Showing states: open (hide) maybe-fixed (hide) (show fixed)
Showing categories: base (always) secondary (hide) (show stale)
Showing branch types: head (hide) stable (hide)
Showing os: all (filter)
Showing machine: all (filter)
Showing compiler: all (filter)
Showing buildseries: all (filter)

pkgsrc broken builds (by package)

Package Issue Description
archivers/arj maybe-fixed 820 SIGSEGV during build
archivers/dar 1261 C++ issues: invalid pure specifier (only `= 0' is allowed) before ';' token
archivers/jamjar 1262 chgrp: you are not a member of group wheel
archivers/makeself 1264 does not appear to extract correctly; then build does nothing and install fails
archivers/ruby-archive-tar-minitar
     ruby18-archive-tar-minitar
1263 permission problems during gem install
archivers/ruby-archive-tar-minitar
     ruby193-archive-tar-minitar
1263 permission problems during gem install
archivers/ruby-archive-tar-minitar
     ruby200-archive-tar-minitar
1263 permission problems during gem install
archivers/ruby-libarchive
     ruby18-libarchive
1263 permission problems during gem install
archivers/ruby-libarchive
     ruby193-libarchive
1263 permission problems during gem install
archivers/ruby-libarchive
     ruby200-libarchive
1263 permission problems during gem install
archivers/ruby-zip
     ruby18-zip
1263 permission problems during gem install
archivers/ruby-zip
     ruby193-zip
1263 permission problems during gem install
archivers/ruby-zip
     ruby200-zip
1263 permission problems during gem install
archivers/star 1265 No build rules for freebsd
archivers/unarj 1266 generic C build failure
audio/alsa-lib 1267 endian.h not found; also, redefinition of struct timeval & struct timespec
audio/amp 1268 AFMT_S16_LE, SNDCTL_DSP_SETFMT, etc. undeclared
audio/buzztard 1269 INT64_MAX undeclared
audio/cdparanoia 1270 ENOMEDIUM undeclared
audio/csound5 1271 scons issues: name 'pythonIncludePath' is not defined
audio/daapd 824 C++ issues
audio/gmpc-alarm 1272 configure: error: GNU gettext tools not found; required for intltool
audio/gmpc-jamendo 1272 configure: error: GNU gettext tools not found; required for intltool
audio/gmpc-libnotify 1272 configure: error: GNU gettext tools not found; required for intltool
audio/gmpc-wikipedia 1272 configure: error: GNU gettext tools not found; required for intltool
audio/gramofile 1273 no machine/soundcard.h
audio/gtkpod 1274 undefined references to be32toh
audio/icecast1
     icecast
1275 SIGBUS undeclared
audio/libvisual0.2-plugins 825 display.c:132:24: error: memory input 1 is not directly addressable
audio/lmms 826 C++ issues
audio/mad123 1276 no sys/audioio.h
audio/maplay 1277 no machine/soundcard.h
audio/mixer.app 1278 no machine/soundcard.h
audio/mp3diags maybe-fixed 827 C++ STL issues (no type named 'streamsize' in namespace 'std')
audio/mpg123-oss 1279 conflicts with mpg123, which it depends on
audio/muse 1280 redefinition of 'struct iovec'
audio/nas 1281 no machine/pcaudioio.h
audio/nspmod 1282 no sys/audioio.h
audio/ocp 1283 configure script can't find iconv
audio/openal 1284 no machine/soundcard.h
audio/pd 1285 API_DEFSTRING undeclared
audio/portaudio 1286 no machine/soundcard.h
audio/portaudio-devel 1287 no alloca.h
audio/pulseaudio 1288 cap_t undeclared
audio/rio500 1490 no sys/inttypes.h
audio/rosegarden 1290 /usr/bin/ld: cannot find -lmalloc
audio/rplay 1291 no machine/soundcard.h
audio/ruby-taglib
     ruby18-taglib
1263 permission problems during gem install
audio/ruby-taglib
     ruby193-taglib
1263 permission problems during gem install
audio/ruby-taglib
     ruby200-taglib
1263 permission problems during gem install
audio/sidplay 1292
audio/sidplay2 1293
audio/spiralloops 1294 no machine/soundcard.h
audio/spiralsynth 1295 no machine/soundcard.h
audio/squeezeboxserver 830 depends on multiple versions of mysql
audio/tracker 1296 no machine/soundcard.h
audio/wmmixer 1297 no machine/soundcard.h
audio/wmmp
     WMmp
1298 chown/chgrp: Operation not permitted (during install, using root/kmem)
audio/wmsmixer 1299 no machine/soundcard.h
audio/wsoundprefs 831 undefined reference to 'wsyserror'
audio/xanalyser 1880 no byteswap.h
audio/xcdplayer 1300 gcc: SharedXawReqs: No such file or directory
audio/xmcd 1300 gcc: SharedXawReqs: No such file or directory
audio/xmix 1301 no machine/soundcard.h
audio/xmmix 1300 gcc: SharedXawReqs: No such file or directory
audio/xwave 1302 types.h:55: error: expected specifier-qualifier-list before 'ulong'
benchmarks/benchfft 832 g95 crashes
benchmarks/libmicro 1303 no makefile for freebsd
benchmarks/lmbench 1304 error: conflicting types for 'pmap_set'
benchmarks/nettest 1305 no make rules for freebsd
benchmarks/skampi 833 MPI problems
benchmarks/xengine 1300 gcc: SharedXawReqs: No such file or directory
benchmarks/zelibm 1306 no machine/ieee.h
biology/gromacs 834 MPI problems
biology/mopac 835 "to enable REAL loop parameters use -freal-loops"
biology/mpqc 1307 configure can't find blas
biology/plinkseq 1308 PF_INET undeclared
biology/puzzle 837 plist divergence, appears to be an MPI issue
cad/boolean 1309 values.h: No such file or directory
cad/felt 1310 multiple definitions of yacc symbols
cad/ghdl 1894 inline problems with floor_log2, exact_log2
cad/magic 1311 configure fails to find opengl and tcl; thus install blows up
cad/openscad 839 (1 more) no viable conversion from Line_face_circulator to value_type
cad/spice 1312 no sgtty.h
cad/tnt-mmtl 840 defined(%hash) is deprecated at /usr/pkg/bin/latex2html line 514.
$* is no longer supported at /usr/pkg/bin/latex2html line 10588.
etc.
cad/xcircuit 1313 generic C build failure
chat/blackened 1314 no sgtty.h
chat/ctrlproxy 1315 PLIST divergence, not clear why
chat/gale 1316 redefinition of '__wcwidth'
chat/i2cb 1317 no sgtty.h
chat/i2cbd 1318 no util.h (?!)
chat/icb 1319 conflicting types for 'sys_errlist'; also, no sgtty.h
chat/ircservices 841 use of unknown builtins __builtin_return/__builtin_apply
chat/libfolks 1320 /usr/include/pthread.h:184: error: expected declaration specifiers or '...' before 'clockid_t'
chat/licq-core 1321 configure can't find iconv
chat/ninja 1322 EAI_ADDRFAMILY undeclared
chat/ruby-net-irc
     ruby18-net-irc
1263 permission problems during gem install
chat/ruby-net-irc
     ruby193-net-irc
1263 permission problems during gem install
chat/ruby-net-irc
     ruby200-net-irc
1263 permission problems during gem install
chat/telepathy-gabble 842 g_type_init is deprecated
chat/telepathy-logger 1323 /usr/include/pthread.h:184: error: expected declaration specifiers or '...' before 'clockid_t'
chat/weechat 1324 /usr/bin/ld: cannot find -l__nonexistent__
comms/asterisk 1325 ldconfig: mkstemp(/var/run/ld-elf.so.hints.zAiiYZ): Permission denied
comms/asterisk-sounds-native 1326 fails to extract for no obvious reason
comms/conserver maybe-fixed 1327 needs --with-64bit
comms/hylafax 1328 no utmp.h
comms/kermit 1329 no sgtty.h
comms/mgetty+sendfax
     mgetty
1330 no utmp.h
comms/modemd 1331 no utmp.h
comms/pilot-link-libs 1332 'USB_GET_DEVICEINFO' undeclared (and some related issues)
comms/ruby-termios
     ruby18-termios
1263 permission problems during gem install
comms/ruby-termios
     ruby193-termios
1263 permission problems during gem install
comms/ruby-termios
     ruby200-termios
1263 permission problems during gem install
comms/spandsp 1333 cpol, cpow, cpowf, powl, clogl, clog, clogf, logl not declared
comms/tn3270 1334 'telopts' undeclared
comms/xtel 1300 gcc: SharedXawReqs: No such file or directory
converters/hztty 1335 no sgtty.h
converters/p5-MARC-Charset 1336 Undefined symbol "gdbm_open"
converters/p5-Unicode-IMAPUtf7 1337 permission denied during extract, for no clear reason.
converters/ruby-Ascii85
     ruby18-Ascii85
1263 permission problems during gem install
converters/ruby-Ascii85
     ruby193-Ascii85
1263 permission problems during gem install
converters/ruby-Ascii85
     ruby200-Ascii85
1263 permission problems during gem install
converters/ruby-unf_ext
     ruby18-unf_ext
1263 permission problems during gem install
converters/ruby-unf_ext
     ruby193-unf_ext
1263 permission problems during gem install
converters/ruby-unf_ext
     ruby200-unf_ext
1263 permission problems during gem install
converters/xdeview 1338 undefined reference to `matherr'
cross/freemint-mintbin
     cross-freemint-mintbin
1339 declares own sys_errlist
cross/h8300-elf-gcc34
     cross-h8300-elf-gcc
849 C issues switching on a boolean type with 'case 2:'
cross/h8300-hms-gcc
     cross-h8300-hms-gcc
1340 Please update *-*-freebsd* in gcc/config.gcc
cross/i386-cygwin32
     cross-i386-cygwin32
850 ./config/tc-i386.h:451:32: error: array type has incomplete element type
cross/i386-linux
     cross-i386-linux
851 ./config/tc-i386.h:451:32: error: array type has incomplete element type
cross/i386-msdosdjgpp
     cross-i386-msdosdjgpp
852 ./config/tc-i386.h:451:32: error: array type has incomplete element type
cross/mingw-gcc 853 C issues switching on a boolean type with 'case 2:'
cross/mingw-runtime-bin 1341 permission problems during stage-install
cross/mingw-w32api-bin 1341 permission problems during stage-install
cross/nios2-gcc41 1237 redefinition of a 'extern inline' function 'floor_log2' is not supported in C99 mode
cross/uisp 1342 (1 more) /sys/dev/ppbus/ppi.h: No such file or directory
databases/clisp-bdb 1343 /usr/pkg/bin/clisp-link: create-shared-lib: not found
databases/clisp-gdbm 1343 /usr/pkg/bin/clisp-link: create-shared-lib: not found
databases/clisp-pgsql 1343 /usr/pkg/bin/clisp-link: create-shared-lib: not found
databases/cstore 856 throws exception during build
databases/geneweb 1344 chown: root.wheel: illegal user name
databases/libcassandra 1345 (1 more) C++: expected constructor, destructor, or type conversion before '<' token
databases/lua-tokyocabinet 1346 permission problems during stage-install
databases/lua-tokyocabinet
     lua51-tokyocabinet
1346 permission problems during stage-install
databases/lua-tokyocabinet
     lua52-tokyocabinet
1346 permission problems during stage-install
databases/mysql-workbench 860 (1 more) field has incomplete type 'grt::ValueRef'
databases/mysql55-client
     mysql-client
1347 PLIST divergence on shared libs
databases/nss-pgsql 1348 invalid preprocessing directive #elsif
databases/ocaml-sqlite3 1349 PLIST.opt should be enabled on this platform (freebsd) and isn't
databases/openldap-server 1350 O_DSYNC undeclared
databases/pgtcl 1351 name of installed shared library contains an extra '.'
databases/postgresql-postgis
     postgresql92-postgis
1902 undeclared identifier 'Form_pg_class'
databases/postgresql-postgis
     postgresql93-postgis
1902 undeclared identifier 'Form_pg_class'
databases/postgresql84-uuid 1352 no sha1.h
databases/postgresql90-uuid 1352 no sha1.h
databases/postgresql93-plperl 1353 perlchunks.h: No such file or directory
databases/py-ldap
     py26-ldap
1354 weird errors from pax during stage-install
databases/py-ldap
     py27-ldap
1354 weird errors from pax during stage-install
databases/ruby-arel
     ruby18-arel
1263 permission problems during gem install
databases/ruby-arel
     ruby193-arel
1263 permission problems during gem install
databases/ruby-arel
     ruby200-arel
1263 permission problems during gem install
databases/ruby-hiera
     ruby18-hiera
1263 permission problems during gem install
databases/ruby-hiera
     ruby193-hiera
1263 permission problems during gem install
databases/ruby-hiera
     ruby200-hiera
1263 permission problems during gem install
databases/ruby-ldap
     ruby18-ldap
1263 permission problems during gem install
databases/ruby-ldap
     ruby193-ldap
1263 permission problems during gem install
databases/ruby-ldap
     ruby200-ldap
1263 permission problems during gem install
databases/ruby-odbc
     ruby18-odbc
1263 permission problems during gem install
databases/ruby-odbc
     ruby193-odbc
1263 permission problems during gem install
databases/ruby-odbc
     ruby200-odbc
1263 permission problems during gem install
databases/ruby-pg
     ruby193-pg
1263 permission problems during gem install
databases/ruby-pg
     ruby200-pg
1263 permission problems during gem install
databases/ruby-postgres-pr
     ruby18-postgres-pr
1263 permission problems during gem install
databases/ruby-postgres-pr
     ruby193-postgres-pr
1263 permission problems during gem install
databases/ruby-postgres-pr
     ruby200-postgres-pr
1263 permission problems during gem install
databases/ruby-sequel
     ruby18-sequel
1263 permission problems during gem install
databases/ruby-sequel
     ruby193-sequel
1263 permission problems during gem install
databases/ruby-sequel
     ruby200-sequel
1263 permission problems during gem install
databases/ruby-sqlite
     ruby18-sqlite
1263 permission problems during gem install
databases/ruby-sqlite
     ruby193-sqlite
1263 permission problems during gem install
databases/ruby-sqlite
     ruby200-sqlite
1263 permission problems during gem install
databases/ruby-sqlite3
     ruby18-sqlite3
1263 permission problems during gem install
databases/ruby-sqlite3
     ruby193-sqlite3
1263 permission problems during gem install
databases/ruby-sqlite3
     ruby200-sqlite3
1263 permission problems during gem install
databases/ruby-tokyocabinet
     ruby18-tokyocabinet
1263 permission problems during gem install
databases/ruby-tokyocabinet
     ruby193-tokyocabinet
1263 permission problems during gem install
databases/ruby-tokyocabinet
     ruby200-tokyocabinet
1263 permission problems during gem install
databases/ruby-tokyotyrant
     ruby18-tokyotyrant
1263 permission problems during gem install
databases/ruby-tokyotyrant
     ruby193-tokyotyrant
1263 permission problems during gem install
databases/ruby-tokyotyrant
     ruby200-tokyotyrant
1263 permission problems during gem install
databases/sqlite3-tcl 1355 divergence of installed shared library filenames
databases/sqlrelay 1356 C++: umask was not declared in this scope
devel/ZenTest
     ruby18-ZenTest
1263 permission problems during gem install
devel/ZenTest
     ruby193-ZenTest
1263 permission problems during gem install
devel/ZenTest
     ruby200-ZenTest
1263 permission problems during gem install
devel/aegis 862 (1 more) requires -std=c++0x or -std=gnu++0x
devel/bcc 1358 declares own strlen and strncpy
devel/bmake secondary 1359 conflicting bootstrap-mk-files versions
devel/boost-libs 1872 boost issues
devel/cfitsio 1360 cfortran.h: Can't find your environment
devel/clisp-pcre 1343 /usr/pkg/bin/clisp-link: create-shared-lib: not found
devel/clisp-syscalls 864 lisp issues
devel/clisp-wildcard 1343 /usr/pkg/bin/clisp-link: create-shared-lib: not found
devel/clisp-zlib 1343 /usr/pkg/bin/clisp-link: create-shared-lib: not found
devel/coconut 867 (3 more) objc/Protocol.h file not found
devel/cqual 868 undefined symbol 'nil'
devel/dconf 1362 /usr/bin/ld: cannot find -ldl
devel/ddd 1881 /usr/bin/ld: cannot find -liconv
devel/doxygen 1363 undefined reference to `libiconv'
devel/editline 1364 C: macro "__weak_reference" requires 2 arguments, but only 1 given
devel/electric-fence 1365 self-test receives SIGSEGV
devel/elftoolchain 1366 undefined references to own (?) symbols
devel/florist
     florist-gpl
869 clang and ada support don't yet get along
devel/frama-c 871 ocaml issues
devel/gcvs 1367 provides own gethostname() (!?)
devel/gdb 1368 *** Gdb does not support native target x86_64-unknown-freebsd9
devel/gdb6
     gdb
873 (1 more) bsd-kvm.c:236:11: error: 'struct proc' has no member named 'p_addr'
devel/gearmand 1370 pthread_timedjoin_np was not declared in this scope
devel/gindent 1371 build receives SIGSEGV
devel/gnustep-base 874 configure: error: C compiler cannot create executables
devel/gnustep-objc 1372 PLIST divergence of installed shared library names
devel/gnustep-objc-lf2 876 (1 more) sendmsg.c:179:10: error: use of unknown builtin '__builtin_apply'
devel/hoe
     ruby193-hoe
1263 permission problems during gem install
devel/hoe
     ruby200-hoe
1263 permission problems during gem install
devel/jq 1373 flex can't open its output file
devel/libblkid 1374 generic C build failure
devel/libfirm 883 ../include/libfirm/adt/array.h:245:9: error: alignment of array elements is greater than element size
devel/libinotify 1375 /usr/include/sys/event.h:58: error: expected specifier-qualifier-list before 'uintptr_t'
devel/libjit 884 (1 more) SIGSEGV during build (running ./gen-apply)
devel/libmemcached 1377 no alloca.h
devel/libtecla 1378 PLIST divergence of installed shared library names
devel/libusb 1379 redefinition of 'struct usb_string_descriptor'
devel/libusb1 1380 error: unsupported operating system
devel/libusbx 1381 error: unsupported operating system
devel/lua-posix 1382 O_DSYNC undeclared
devel/lua-posix
     lua51-posix
1382 O_DSYNC undeclared
devel/lua-posix
     lua52-posix
1382 O_DSYNC undeclared
devel/mad-flute 1383 storage size of 'ipv6' isn't known; PF_INET, PF_INET6 undeclared
devel/menhir 1384 strip: /tmp/devel/menhir/work/.destdir/usr/pkg/bin/menhir: File format not recognized
devel/mico 885 assertion failure on CosNaming.idl
devel/nbitools 887 (1 more) uses cpp on non-C-source and fails miserably
devel/nsis 1386 no iconv.h
devel/nspr-reference 1387 permission errors from pax during stage-install
devel/ocaml-batteries 1388 this platform (freebsd) should have PLIST.opt set, and it isn't
devel/ocaml-deriving-ocsigen 1389 this platform (freebsd) should have PLIST.opt set, and it isn't
devel/ocaml-optcomp
     optcomp
1867 this platform should have PLIST.opt set and doesn't
devel/ocaml-react 1390 this platform (freebsd) should have PLIST.opt set, and it isn't
devel/opencm 1391 fails to find kerberos
devel/p5-RT-Authen-ExternalAuth 901 tries to access /usr/pkg/etc during stage-install
devel/pcc-libs 906 crtstuff files not installed
devel/prcs 907 'ext/stdio_filebuf.h' file not found (C++)
devel/pwlib 909 include/ptlib/array.h:626:9: error: 'SetAt' was not declared in this scope
devel/ruby-abstract
     ruby18-abstract
1263 permission problems during gem install
devel/ruby-abstract
     ruby193-abstract
1263 permission problems during gem install
devel/ruby-abstract
     ruby200-abstract
1263 permission problems during gem install
devel/ruby-assistance
     ruby18-assistance
1263 permission problems during gem install
devel/ruby-assistance
     ruby193-assistance
1263 permission problems during gem install
devel/ruby-assistance
     ruby200-assistance
1263 permission problems during gem install
devel/ruby-atomic
     ruby18-atomic
1263 permission problems during gem install
devel/ruby-atomic
     ruby193-atomic
1263 permission problems during gem install
devel/ruby-atomic
     ruby200-atomic
1263 permission problems during gem install
devel/ruby-backports
     ruby18-backports
1263 permission problems during gem install
devel/ruby-backports
     ruby193-backports
1263 permission problems during gem install
devel/ruby-backports
     ruby200-backports
1263 permission problems during gem install
devel/ruby-blankslate
     ruby18-blankslate
1263 permission problems during gem install
devel/ruby-blankslate
     ruby193-blankslate
1263 permission problems during gem install
devel/ruby-blankslate
     ruby200-blankslate
1263 permission problems during gem install
devel/ruby-cmd
     ruby18-cmd
1263 permission problems during gem install
devel/ruby-cmd
     ruby193-cmd
1263 permission problems during gem install
devel/ruby-cmd
     ruby200-cmd
1263 permission problems during gem install
devel/ruby-daemon_controller
     ruby18-daemon_controller
1263 permission problems during gem install
devel/ruby-daemon_controller
     ruby193-daemon_controller
1263 permission problems during gem install
devel/ruby-daemon_controller
     ruby200-daemon_controller
1263 permission problems during gem install
devel/ruby-deprecated
     ruby18-deprecated
1263 permission problems during gem install
devel/ruby-deprecated
     ruby193-deprecated
1263 permission problems during gem install
devel/ruby-deprecated
     ruby200-deprecated
1263 permission problems during gem install
devel/ruby-dhaka
     ruby18-dhaka
1263 permission problems during gem install
devel/ruby-dhaka
     ruby193-dhaka
1263 permission problems during gem install
devel/ruby-dhaka
     ruby200-dhaka
1263 permission problems during gem install
devel/ruby-eventmachine
     ruby18-eventmachine
1263 permission problems during gem install
devel/ruby-eventmachine
     ruby193-eventmachine
1263 permission problems during gem install
devel/ruby-eventmachine
     ruby200-eventmachine
1263 permission problems during gem install
devel/ruby-extlib
     ruby18-extlib
1263 permission problems during gem install
devel/ruby-extlib
     ruby193-extlib
1263 permission problems during gem install
devel/ruby-extlib
     ruby200-extlib
1263 permission problems during gem install
devel/ruby-facade
     ruby18-facade
1263 permission problems during gem install
devel/ruby-facade
     ruby193-facade
1263 permission problems during gem install
devel/ruby-facade
     ruby200-facade
1263 permission problems during gem install
devel/ruby-fast_gettext
     ruby18-fast_gettext
1263 permission problems during gem install
devel/ruby-fast_gettext
     ruby193-fast_gettext
1263 permission problems during gem install
devel/ruby-fast_gettext
     ruby200-fast_gettext
1263 permission problems during gem install
devel/ruby-ffi
     ruby193-ffi
1263 permission problems during gem install
devel/ruby-ffi
     ruby200-ffi
1263 permission problems during gem install
devel/ruby-flexmock
     ruby18-flexmock
1263 permission problems during gem install
devel/ruby-flexmock
     ruby193-flexmock
1263 permission problems during gem install
devel/ruby-flexmock
     ruby200-flexmock
1263 permission problems during gem install
devel/ruby-gemcutter
     ruby18-gemcutter
1263 permission problems during gem install
devel/ruby-gemcutter
     ruby193-gemcutter
1263 permission problems during gem install
devel/ruby-gemcutter
     ruby200-gemcutter
1263 permission problems during gem install
devel/ruby-getopt
     ruby18-getopt
1263 permission problems during gem install
devel/ruby-getopt
     ruby193-getopt
1263 permission problems during gem install
devel/ruby-getopt
     ruby200-getopt
1263 permission problems during gem install
devel/ruby-hashery
     ruby18-hashery
1263 permission problems during gem install
devel/ruby-hashery
     ruby193-hashery
1263 permission problems during gem install
devel/ruby-hashery
     ruby200-hashery
1263 permission problems during gem install
devel/ruby-highline
     ruby18-highline
1263 permission problems during gem install
devel/ruby-highline
     ruby193-highline
1263 permission problems during gem install
devel/ruby-highline
     ruby200-highline
1263 permission problems during gem install
devel/ruby-hike
     ruby18-hike
1263 permission problems during gem install
devel/ruby-hike
     ruby193-hike
1263 permission problems during gem install
devel/ruby-hike
     ruby200-hike
1263 permission problems during gem install
devel/ruby-i18n
     ruby18-i18n
1263 permission problems during gem install
devel/ruby-i18n
     ruby193-i18n
1263 permission problems during gem install
devel/ruby-i18n
     ruby200-i18n
1263 permission problems during gem install
devel/ruby-io-console
     ruby193-io-console
1263 permission problems during gem install
devel/ruby-io-console
     ruby200-io-console
1263 permission problems during gem install
devel/ruby-io-like
     ruby18-io-like
1263 permission problems during gem install
devel/ruby-io-like
     ruby193-io-like
1263 permission problems during gem install
devel/ruby-io-like
     ruby200-io-like
1263 permission problems during gem install
devel/ruby-kgio
     ruby18-kgio
1263 permission problems during gem install
devel/ruby-kgio
     ruby193-kgio
1263 permission problems during gem install
devel/ruby-kgio
     ruby200-kgio
1263 permission problems during gem install
devel/ruby-little-plugger
     ruby18-little-plugger
1263 permission problems during gem install
devel/ruby-little-plugger
     ruby193-little-plugger
1263 permission problems during gem install
devel/ruby-little-plugger
     ruby200-little-plugger
1263 permission problems during gem install
devel/ruby-locale
     ruby18-locale
1263 permission problems during gem install
devel/ruby-locale
     ruby193-locale
1263 permission problems during gem install
devel/ruby-locale
     ruby200-locale
1263 permission problems during gem install
devel/ruby-lockfile
     ruby18-lockfile
1263 permission problems during gem install
devel/ruby-lockfile
     ruby193-lockfile
1263 permission problems during gem install
devel/ruby-lockfile
     ruby200-lockfile
1263 permission problems during gem install
devel/ruby-log4r
     ruby18-log4r
1263 permission problems during gem install
devel/ruby-log4r
     ruby193-log4r
1263 permission problems during gem install
devel/ruby-log4r
     ruby200-log4r
1263 permission problems during gem install
devel/ruby-loquacious
     ruby18-loquacious
1263 permission problems during gem install
devel/ruby-loquacious
     ruby193-loquacious
1263 permission problems during gem install
devel/ruby-loquacious
     ruby200-loquacious
1263 permission problems during gem install
devel/ruby-metaclass
     ruby18-metaclass
1263 permission problems during gem install
devel/ruby-metaclass
     ruby193-metaclass
1263 permission problems during gem install
devel/ruby-metaclass
     ruby200-metaclass
1263 permission problems during gem install
devel/ruby-metaid
     ruby18-metaid
1263 permission problems during gem install
devel/ruby-metaid
     ruby193-metaid
1263 permission problems during gem install
devel/ruby-metaid
     ruby200-metaid
1263 permission problems during gem install
devel/ruby-mkrf
     ruby193-mkrf
1263 permission problems during gem install
devel/ruby-mkrf
     ruby200-mkrf
1263 permission problems during gem install
devel/ruby-msgpack
     ruby18-msgpack
1263 permission problems during gem install
devel/ruby-msgpack
     ruby193-msgpack
1263 permission problems during gem install
devel/ruby-msgpack
     ruby200-msgpack
1263 permission problems during gem install
devel/ruby-needle
     ruby18-needle
1263 permission problems during gem install
devel/ruby-needle
     ruby193-needle
1263 permission problems during gem install
devel/ruby-needle
     ruby200-needle
1263 permission problems during gem install
devel/ruby-ole
     ruby18-ole
1263 permission problems during gem install
devel/ruby-ole
     ruby193-ole
1263 permission problems during gem install
devel/ruby-ole
     ruby200-ole
1263 permission problems during gem install
devel/ruby-open4
     ruby18-open4
1263 permission problems during gem install
devel/ruby-open4
     ruby193-open4
1263 permission problems during gem install
devel/ruby-open4
     ruby200-open4
1263 permission problems during gem install
devel/ruby-parseconfig
     ruby18-parseconfig
1263 permission problems during gem install
devel/ruby-parseconfig
     ruby193-parseconfig
1263 permission problems during gem install
devel/ruby-parseconfig
     ruby200-parseconfig
1263 permission problems during gem install
devel/ruby-path
     ruby18-path
1263 permission problems during gem install
devel/ruby-path
     ruby193-path
1263 permission problems during gem install
devel/ruby-path
     ruby200-path
1263 permission problems during gem install
devel/ruby-polyglot
     ruby18-polyglot
1263 permission problems during gem install
devel/ruby-polyglot
     ruby193-polyglot
1263 permission problems during gem install
devel/ruby-polyglot
     ruby200-polyglot
1263 permission problems during gem install
devel/ruby-posix-spawn
     ruby18-posix-spawn
1263 permission problems during gem install
devel/ruby-posix-spawn
     ruby193-posix-spawn
1263 permission problems during gem install
devel/ruby-posix-spawn
     ruby200-posix-spawn
1263 permission problems during gem install
devel/ruby-priority-queue
     ruby18-priority-queue
1263 permission problems during gem install
devel/ruby-priority-queue
     ruby193-priority-queue
1263 permission problems during gem install
devel/ruby-priority-queue
     ruby200-priority-queue
1263 permission problems during gem install
devel/ruby-rake
     ruby18-rake
1263 permission problems during gem install
devel/ruby-rake
     ruby193-rake
1263 permission problems during gem install
devel/ruby-rake
     ruby200-rake
1263 permission problems during gem install
devel/ruby-randexp
     ruby18-randexp
1263 permission problems during gem install
devel/ruby-randexp
     ruby193-randexp
1263 permission problems during gem install
devel/ruby-randexp
     ruby200-randexp
1263 permission problems during gem install
devel/ruby-rbtree
     ruby18-rbtree
1263 permission problems during gem install
devel/ruby-rbtree
     ruby193-rbtree
1263 permission problems during gem install
devel/ruby-rbtree
     ruby200-rbtree
1263 permission problems during gem install
devel/ruby-rbx-require-relative
     ruby18-rbx-require-relative
1263 permission problems during gem install
devel/ruby-rbx-require-relative
     ruby193-rbx-require-relative
1263 permission problems during gem install
devel/ruby-rbx-require-relative
     ruby200-rbx-require-relative
1263 permission problems during gem install
devel/ruby-rcov
     ruby18-rcov
1263 permission problems during gem install
devel/ruby-rdoc
     ruby193-rdoc
1263 permission problems during gem install
devel/ruby-rdoc
     ruby200-rdoc
1263 permission problems during gem install
devel/ruby-rspec-core
     ruby18-rspec-core
1263 permission problems during gem install
devel/ruby-rspec-core
     ruby193-rspec-core
1263 permission problems during gem install
devel/ruby-rspec-core
     ruby200-rspec-core
1263 permission problems during gem install
devel/ruby-rspec-mocks
     ruby18-rspec-mocks
1263 permission problems during gem install
devel/ruby-rspec-mocks
     ruby193-rspec-mocks
1263 permission problems during gem install
devel/ruby-rspec-mocks
     ruby200-rspec-mocks
1263 permission problems during gem install
devel/ruby-sexp-processor
     ruby18-sexp-processor
1263 permission problems during gem install
devel/ruby-sexp-processor
     ruby193-sexp-processor
1263 permission problems during gem install
devel/ruby-sexp-processor
     ruby200-sexp-processor
1263 permission problems during gem install
devel/ruby-simple_uuid
     ruby18-simple_uuid
1263 permission problems during gem install
devel/ruby-simple_uuid
     ruby193-simple_uuid
1263 permission problems during gem install
devel/ruby-simple_uuid
     ruby200-simple_uuid
1263 permission problems during gem install
devel/ruby-simplecov-html
     ruby193-simplecov-html
1263 permission problems during gem install
devel/ruby-simplecov-html
     ruby200-simplecov-html
1263 permission problems during gem install
devel/ruby-spruz
     ruby18-spruz
1263 permission problems during gem install
devel/ruby-spruz
     ruby193-spruz
1263 permission problems during gem install
devel/ruby-spruz
     ruby200-spruz
1263 permission problems during gem install
devel/ruby-stomp
     ruby18-stomp
1263 permission problems during gem install
devel/ruby-stomp
     ruby193-stomp
1263 permission problems during gem install
devel/ruby-stomp
     ruby200-stomp
1263 permission problems during gem install
devel/ruby-stream
     ruby18-stream
1263 permission problems during gem install
devel/ruby-stream
     ruby193-stream
1263 permission problems during gem install
devel/ruby-stream
     ruby200-stream
1263 permission problems during gem install
devel/ruby-subexec
     ruby18-subexec
1263 permission problems during gem install
devel/ruby-subexec
     ruby193-subexec
1263 permission problems during gem install
devel/ruby-subexec
     ruby200-subexec
1263 permission problems during gem install
devel/ruby-term-ansicolor
     ruby18-term-ansicolor
1263 permission problems during gem install
devel/ruby-term-ansicolor
     ruby193-term-ansicolor
1263 permission problems during gem install
devel/ruby-term-ansicolor
     ruby200-term-ansicolor
1263 permission problems during gem install
devel/ruby-test-spec
     ruby18-test-spec
1263 permission problems during gem install
devel/ruby-test-spec
     ruby193-test-spec
1263 permission problems during gem install
devel/ruby-test-spec
     ruby200-test-spec
1263 permission problems during gem install
devel/ruby-test-unit
     ruby18-test-unit
1263 permission problems during gem install
devel/ruby-test-unit
     ruby193-test-unit
1263 permission problems during gem install
devel/ruby-test-unit
     ruby200-test-unit
1263 permission problems during gem install
devel/ruby-thor
     ruby18-thor
1263 permission problems during gem install
devel/ruby-thor
     ruby193-thor
1263 permission problems during gem install
devel/ruby-thor
     ruby200-thor
1263 permission problems during gem install
devel/ruby-thrift
     ruby18-thrift
1263 permission problems during gem install
devel/ruby-thrift
     ruby193-thrift
1263 permission problems during gem install
devel/ruby-thrift
     ruby200-thrift
1263 permission problems during gem install
devel/ruby-uuidtools
     ruby18-uuidtools
1263 permission problems during gem install
devel/ruby-uuidtools
     ruby193-uuidtools
1263 permission problems during gem install
devel/ruby-uuidtools
     ruby200-uuidtools
1263 permission problems during gem install
devel/ruby-validatable
     ruby18-validatable
1263 permission problems during gem install
devel/ruby-validatable
     ruby193-validatable
1263 permission problems during gem install
devel/ruby-validatable
     ruby200-validatable
1263 permission problems during gem install
devel/rubyforge
     ruby18-rubyforge
1263 permission problems during gem install
devel/rubyforge
     ruby193-rubyforge
1263 permission problems during gem install
devel/rubyforge
     ruby200-rubyforge
1263 permission problems during gem install
devel/sdcc 911 find -exec ... + yields E2BIG
devel/sfio 1392 passing argument 1 of 'setclass' discards qualifiers from pointer target type
devel/sfslite 913 (1 more) vec.h:167:7: error: use of undeclared identifier 'bfree'
devel/sparsehash 914 C++ issues
devel/tcl-tclOO 1873 divergence of installed shared library names
devel/tet3 1394 permission failures from pax during stage-install
devel/ucommon 1395 C++: reference to 'HMAC' is ambiguous
devel/valide 916 needs updating
devel/xsd 918 (1 more) chokes on libcult's headers
devel/xulrunner10 919 (1 more) C++: operator new cannot be declared inline
devel/xulrunner17 920 (1 more) C++: operator new cannot be declared inline
devel/xxgdb 1398 storage size of 'status' isn't known
editors/TeXmacs 1399 (small) PLIST divergence
editors/beav 1400 error: #error "Definitions not available without TTY ioctl compat."
editors/biew 1401 is_unicode undeclared
editors/easyedit 1402 undefined references to ~all of curses
editors/elvis 1403 /usr/bin/ld: cannot find -lipc
editors/elvis-x11 1403 /usr/bin/ld: cannot find -lipc
editors/emacs20 1404 Emacs hasn't been ported to `x86_64-unknown-freebsd9' systems.
editors/emacs21 1405 Emacs hasn't been ported to `x86_64-unknown-freebsd9' systems.
editors/emacs21-nox11 1405 Emacs hasn't been ported to `x86_64-unknown-freebsd9' systems.
editors/emacs22 1406 no utmp.h
editors/emacs22-nox11 1406 no utmp.h
editors/mg2a 1407 no sgtty.h
editors/mined 1408 undefined references to tputs/tgetstr/etc.
editors/mule 927 temacs segfaults during build
editors/nvi 1409 I_PUSH undeclared
editors/ted 1882 user <malloc.h>, which is apparently fatal on freebsd
editors/ve 1410 no sgtty.h
editors/vigor 1411 expected specifier-qualifier-list before 'CIRCLEQ_ENTRY'
editors/xemacs-current
     xemacs
928 (1 more) temacs segfaults during build
editors/xjed 1413 no stropts.h; also I_PUSH undeclared
emulators/BasiliskII 1414 SIGSEGV_FAULT_HANDLER_ARGLIST was not declared in this scope
emulators/arcem 1868 off64_t undeclared
emulators/darcnes 1415 no machine/soundcard.h
emulators/dynamips 1416 /usr/bin/ld: cannot find -ldl
emulators/generator 931 raze.asm:3139: error: interminable macro recursion (from nasm)
emulators/generator-cbiere 932 raze.asm:3139: error: interminable macro recursion (from nasm)
emulators/hercules-images 1417 pax: illegal option -- O
emulators/ia64sim 1418 undefined reference to `UINT64_C'
emulators/klh10 1419 _NSIG undeclared
emulators/mame 933 array subscript has type 'char' + -Werror
emulators/mess 936 array subscript has type 'char' + -Werror
emulators/p11 939 (1 more) fpp.c:357: Error: operand type mismatch for `fnstsw'
emulators/palmosemulator 940 EmPalmHeap.cpp:1224:70: error: expected primary-expression before ',' token
emulators/pcemu 1421 compress: /dev/stdout: Operation not supported
emulators/pearpc 941 (1 more) x86asm.h:387:119: error: redefinition of 'JitcFloatReg hint1'
emulators/qemu0
     qemu
942 asm clang doesn't understand
emulators/raine 943 blit.c:(.text+0x47af): undefined reference to `ds'
emulators/ski 1423 generic C build failure pertaining to signals
emulators/spim 1300 gcc: SharedXawReqs: No such file or directory
emulators/swarm 1424 Unknown FreeBSD machine amd64
emulators/tme 1425 incompatible implicit declaration of built-in function 'isinff'
emulators/vice 1426 compat.h:338: error: conflicting types for 'basename_r'
emulators/wine-devel
     wine
944 mxwriter.c:257:62: error: dereferencing pointer to incomplete type
filesystems/glusterfs 1491 conflicting types for basename_r
filesystems/openafs 945 (1 more) des.h:20:5: error: unknown type name 'afs_uint32'
filesystems/openafs-devel
     openafs
946 (1 more) fails in package stage if using heimdal from pkgsrc as
kerberos; it conflicts with heimdal.
filesystems/perfuse 1429 puffs.h: No such file or directory
finance/libofx 1430 C++ issues: fatal const problems calling iconv
finance/xinvest 1300 gcc: SharedXawReqs: No such file or directory
fonts/ruby-afm
     ruby18-afm
1263 permission problems during gem install
fonts/ruby-afm
     ruby193-afm
1263 permission problems during gem install
fonts/ruby-afm
     ruby200-afm
1263 permission problems during gem install
fonts/ruby-ttfunk
     ruby18-ttfunk
1263 permission problems during gem install
fonts/ruby-ttfunk
     ruby193-ttfunk
1263 permission problems during gem install
fonts/ruby-ttfunk
     ruby200-ttfunk
1263 permission problems during gem install
games/abuse 1432 invalid conversion from 'int*' to 'socklen_t*'
games/angband-tty 1433 pax: illegal option -- O
games/angband-x11 1434 chown: root.games: illegal user name
games/battalion 1435 undefined reference to cuserid
games/cbzone 1300 gcc: SharedXawReqs: No such file or directory
games/craft 948 (1 more) warnings about parens in conditionals
(may be in generated code, sigh)
games/crafty-book-medium secondary 1451 can't allocate a shm segment
games/crafty-book-small secondary 1451 can't allocate a shm segment
games/criticalmass maybe-fixed 949 C++ issues (reference to 'hash' is ambiguous)
games/exchess 1437 /usr/include/sys/types.h:56: error: duplicate 'unsigned'
games/fkiss 1438 no machine/soundcard.h
games/gamazons 952 needs LP64 cleanup (does not fail the build)
games/imaze 1883 no machine/joystick.h
games/ivan 954 C++ overloading issue probably related to 64-bit time_t
games/knightcap 1439 conflicting types for 'fmin', 'fmax'
games/maelstrom-x11 1440 pax: illegal option -- O
games/mirrormagic 1441 no machine/soundcard.h
games/moria 1442 no sgtty.h
games/netmaze 1443 trigtab.h:5: error: expected '=', ',', ';', 'asm' or '__attribute__' before 'trigtab'
games/plib 1444 USB_DEVICEINFO was not declared in this scope
games/powwow 1445 /usr/include/sys/ioctl_compat.h:42:2: error: #error "Definitions not available without TTY ioctl compat."
games/puzzles 1446 gtk/gtk.h: No such file or directory
games/qnetwalk 957 install fails with horribly wrong paths generated by qmake
games/quake3server-ra3 958 fetch failed
games/quake3server-ut 959 fetch failed
games/spider 1300 gcc: SharedXawReqs: No such file or directory
games/supertuxkart 1905 misuse of __gnuc_va_list
games/wormz 1447 *** No rule to make target 'depend'. (during configure phase)
games/xbill 963 (1 more) XBILL_HOME not declared
games/xboing 1452 doesn't install sounds
games/xemeraldia 1300 gcc: SharedXawReqs: No such file or directory
games/xgalaga 1448 no machine/soundcard.h
games/xjewel 1449 no stropts.h
games/xmris 1300 gcc: SharedXawReqs: No such file or directory
games/xpat2 1300 gcc: SharedXawReqs: No such file or directory
games/xpipeman 1300 gcc: SharedXawReqs: No such file or directory
games/xracer 964 undefined reference to `__glutCurrentWindow'
games/xscrabble 1300 gcc: SharedXawReqs: No such file or directory
geography/proj-swig 965 python rpaths
geography/qgis 966 cannot find qwt_double_interval.h
geography/vis5d+ 967 (1 more) appears to be choking on f2c output?
alternatively, syntax error from g95
geography/xrmap-factbook_html 1453 permission errors from pax during stage-install
geography/xrmap-factbook_text 1453 permission errors from pax during stage-install
geography/xrmap-flags 1453 permission errors from pax during stage-install
geography/xrmap-hymns 1453 permission errors from pax during stage-install
geography/xrmap-pdfmaps 1453 permission errors from pax during stage-install
graphics/GMT 1454 undefined reference to fpresetsticky
graphics/MesaDemos 969 (1 more) Requested 'libdrm >= 2.4.24' but version of libdrm is 2.4.23
graphics/asymptote 971 (1 more) fails running itself to build docs (on loggrid.pdf)
graphics/bktr2jpeg 1456 no machine/ioctl_meteor.h or machine/ioctl_bt848.h
graphics/blender 1906 merge conflict in PLIST file
graphics/cambevao 1457 no machine/ioctl_meteor.h or machine/ioctl_bt848.h
graphics/cnxtview 973 (1 more) jpeg_decode.c:85:1: error: conflicting types for 'jpeg_mem_src'
graphics/cpia2view 974 (1 more) jpeg_decode.c:85:1: error: conflicting types for 'jpeg_mem_src'
graphics/cqcam 975 port.C:(.text+0x33): undefined reference to `i386_iopl'
graphics/deforaos-camera 1460 no linux/videodev2.h
graphics/dia 1461 /usr/include/pthread.h:184: error: expected declaration specifiers or '...' before 'clockid_t'
graphics/evas 976 confused about whether it's on "netbsd-i486' or "netbsdelf-i486',
fails in libtool.
does not occur on amd64.
graphics/evas-svg 977 builds and installs nothing
graphics/exiv2-organize 978 boost issues (at link time)
graphics/f-spot 979 No package 'flickrnet' found
graphics/fbm 980 misuses malloc and requires LP64 patches
graphics/fly 1462 /usr/bin/ld: cannot find -liconv
graphics/fotoxx 981 undefined reference to 'backtrace'
graphics/freeglut 1463 USB_MAX_DEVICES undeclared
graphics/gdchart 1464 /usr/bin/ld: cannot find -liconv
graphics/geomview 1884 expected specifier-qualifier-list before 'ulong'
graphics/glew 1465 failed to build with -fPIC
graphics/glu 982 Requested 'libdrm >= 2.4.24' but version of libdrm is 2.4.23
graphics/gnuplot 1466 generic C build failure in history.c
graphics/inkscape 984 C++ issues (friend decls and default args)
graphics/ivtools 985 (1 more) ext/stdio_filebuf.h: file not found
graphics/libpuzzle 1468 /usr/bin/ld: cannot find -liconv
graphics/libv4l 1469 4L2_PIX_FMT_RGB24 undeclared
graphics/magicpoint 1300 gcc: SharedXawReqs: No such file or directory
graphics/mscgen 1470 /usr/bin/ld: cannot find -liconv
graphics/ns-cult3d 986 fetch failed
graphics/optipng 1471 undefined reference to utimensat
graphics/osg 987 errors in /usr/include/g++/ctime, and ffmpeg issues
graphics/p5-GIFgraph 988 cannot find Image::Magick
graphics/pixmap 1300 gcc: SharedXawReqs: No such file or directory
graphics/ruby-RMagick
     ruby18-RMagick
1263 permission problems during gem install
graphics/ruby-RMagick
     ruby193-RMagick
1263 permission problems during gem install
graphics/ruby-RMagick
     ruby200-RMagick
1263 permission problems during gem install
graphics/ruby-chunky_png
     ruby18-chunky_png
1263 permission problems during gem install
graphics/ruby-chunky_png
     ruby193-chunky_png
1263 permission problems during gem install
graphics/ruby-chunky_png
     ruby200-chunky_png
1263 permission problems during gem install
graphics/ruby-color
     ruby18-color
1263 permission problems during gem install
graphics/ruby-color
     ruby193-color
1263 permission problems during gem install
graphics/ruby-color
     ruby200-color
1263 permission problems during gem install
graphics/ruby-color-tools
     ruby18-color-tools
1263 permission problems during gem install
graphics/ruby-color-tools
     ruby193-color-tools
1263 permission problems during gem install
graphics/ruby-color-tools
     ruby200-color-tools
1263 permission problems during gem install
graphics/ruby-gd
     ruby18-gd
1263 permission problems during gem install
graphics/ruby-gd
     ruby193-gd
1263 permission problems during gem install
graphics/ruby-gd
     ruby200-gd
1263 permission problems during gem install
graphics/ruby-gnuplot
     ruby18-gnuplot
1263 permission problems during gem install
graphics/ruby-gnuplot
     ruby193-gnuplot
1263 permission problems during gem install
graphics/ruby-gnuplot
     ruby200-gnuplot
1263 permission problems during gem install
graphics/ruby-imlib2
     ruby18-imlib2
1263 permission problems during gem install
graphics/ruby-imlib2
     ruby193-imlib2
1263 permission problems during gem install
graphics/ruby-imlib2
     ruby200-imlib2
1263 permission problems during gem install
graphics/ruby-opengl
     ruby18-opengl
989 missing library libGL.so.2 (bad/missing rpaths)
graphics/spcaview 1472 field 'configdesc' has incomplete type (usb-related)
graphics/unicap 1473 colorspace.c:92: error: expected ')' before '*' token
graphics/urt 1474 initializer element is not constant
graphics/vcg 1475 cd: X11ccFreeBSD: No such file or directory
graphics/vid 1476 USB_DO_REQUEST undeclared
graphics/vigra 1477 C++: no abs(long long) in <cmath>
graphics/vtk-data 1478 permission errors from pax during stage-install
graphics/xart 1300 gcc: SharedXawReqs: No such file or directory
graphics/xbmbrowser 1300 gcc: SharedXawReqs: No such file or directory
graphics/xpaint 1479 makefile does not link against libXmu
ham/7plus 1480 no sgtty.h
ham/dpbox 1481 generic C build failure in filesys.h
ham/linpsk 1482 no machine/soundcard.h
ham/nec2c 1483 undefined reference to clog
ham/tfkiss 1484 x86_64-unknown-freebsd9 is currently not supported
ham/trustedQSL
     tqsl
993 C++ issues: field has incomplete type 'tqsllib::XMLElement'
ham/xnec2c 1486 needs msgfmt
inputmethod/canna-lib
     Canna-lib
1487 divergence of installed shared library names
inputmethod/skkfep 1488 stty.c:306: error: storage size of 'statusp' isn't known
inputmethod/skkinput 1300 gcc: SharedXawReqs: No such file or directory
inputmethod/unicon-im 1489 u_char does not name a type
lang/LuaJIT2 1492 divergence of installed shared library names
lang/STk 1493 PLIST divergence of OS name in install paths
lang/cint 998 (1 more) C++ issues
lang/classpath 1495 /usr/include/netinet/ip.h:51: error: expected specifier-qualifier-list before 'u_char'
lang/cparser 1496 redeclaration of enumerator 'T___attribute__'
lang/eieio secondary 999 cannot find suitable emacs version
lang/gcc 1001 /usr/include/sys/ansi.h:72: parse error before `__va_list'
lang/gcc3-c 1003 (1 more) no .eh_frame_hdr table will be created and/or libgcc_s.so.1 not found
lang/gcc3-c++ 1004 (not reviewed yet)
lang/gcc3-f77 1005 (not reviewed yet)
lang/gcc3-objc 1006 (not reviewed yet)
lang/gcc34 1007 (1 more) _CTYPE_[NB] was not declared in this scope
lang/gcc48 1499 No checksum recorded for ecj-4.5.jar
lang/ghc 1008 tries to scribble in build user's homedir
lang/ghc7
     ghc
1251 no bootstrap kits
lang/gnat-aux 1009 C compiler cannot create executables
lang/go 1010 (1 more) clang: error: no such file or directory: 'libgcc.a'
lang/gpc 1011 /usr/include/sys/ansi.h:72: parse error before `__va_list'
lang/gprolog 1012 error: global register variables are not supported
lang/kali 1014 gethostbyname() failed on [buildhost]: Unknown host
lang/konoha 1501 libkonoha.so.1.0.0: undefined reference to kthread_cond_wait
lang/ksi 1502 _NSIG undeclared
lang/mercury 1016 massive plist divergence
lang/mono 1503 (1 more) SOL_TCP undeclared
lang/mono2
     mono
1504 ucontext_t undeclared
lang/mpd 1018 netbsd.c:(.text+0xc): undefined reference to `pthread__i386_init'
lang/newlisp 1505 generic C build failure involving readline completions
lang/nhc98 1020 (1 more) invalid asm constraints
lang/nodejs 1506 variable or field 'crypto_threadid_cb' declared void
lang/objc 1507 /usr/include/stdlib.h:82: fatal: syntax error "void"
lang/onyx maybe-fixed 1508 checking for libedit >= 2.6... no; causes PLIST divergence
lang/oo2c 1022 (1 more) "auto" used on function
lang/openjdk7 1024 (1 more) "Error: dl failure on line 910"
lang/parrot 1510 Shared object "libicuuc.so.52" not found, required by "miniparrot"
lang/pfe 1026 (1 more) error: global register variables are not supported
lang/picoc 1511 undefined reference to fdatasync
lang/polyml 1885 /usr/bin/ld: cannot find -liconv
lang/py26-html-docs 1512 permission errors from pax during stage-install
lang/py27-html-docs 1512 permission errors from pax during stage-install
lang/racket 1030 (3 more) PLIST divergence: a bunch of .png files are not installed
lang/racket-textual 1514 undefined references to powl, expl, logl
lang/ruby-coffee-script-source
     ruby18-coffee-script-source
1263 permission problems during gem install
lang/ruby-coffee-script-source
     ruby193-coffee-script-source
1263 permission problems during gem install
lang/ruby-coffee-script-source
     ruby200-coffee-script-source
1263 permission problems during gem install
lang/ruby-execjs
     ruby18-execjs
1263 permission problems during gem install
lang/ruby-execjs
     ruby193-execjs
1263 permission problems during gem install
lang/ruby-execjs
     ruby200-execjs
1263 permission problems during gem install
lang/sather 1515 abort2 redeclared as different kind of symbol
lang/scheme48 1516 gcc: unrecognized option -threads
lang/siod 1517 don't know how to make FreeBSD. Stop
lang/spl 1032 C issues, possibly nested functions
lang/sr 1033 netbsd.c:(.text+0xc): undefined reference to `pthread__i386_init'
lang/sun-jre7 secondary 1907 distfile permission denied
lang/swi-prolog-packages 1034 clang: error: no such file or directory: 'libgcc.a'
lang/tcl-itcl 1518 divergence of installed shared library names
lang/twelf 1035 stdIn:6.37-6.48 Error: unbound structure: Timing in path Timing.init
stdIn:6.14-6.27 Error: unbound structure: Twelf in path Twelf.version
lang/ucblogo 1519 TIOCGETP undeclared
lang/umb-scheme 1520 DBL_MIN undeclared
lang/utilisp 1036 Function address of Special form must be word aligned
lang/yap 1521 tar: Pathname in pax header can't be converted to current locale.
mail/balsa 1522 *** You enabled LDAP but ldap library is not found.
mail/cone 1523 (1 more) fatal const errors calling iconv
mail/courier-maildir 1524 no iconv.h
mail/cue 1525 configure rejects freebsd's getaddrinfo
mail/dk-milter 1526 shminit failed: Function not implemented
mail/evolution-data-server 1527 uses <malloc.h>, which is apparently fatal on freebsd
mail/fml
     fml-7.98.15
secondary 1045 build has no permission to create missing users/groups
mail/freepops 1046 stringhack_lua.h file not found
mail/ja-mh
     ja-mh6
1529 no sgtty.h
mail/mail-notification 1530 function might be possible candidate for printf format attribute, + -Werror
mail/mailagent 1047 (1 more) build aborts if umask is not set to 022
mail/mailwrapper 1532 no utmp.h
mail/majordomo secondary 1048 build has no permission to create missing users/groups
mail/metamail 1533 no sgtty.h
mail/mush 1534 unrecognized command line option -fwritable-strings
mail/mutt 1050 cannot find mail spool
mail/mutt-devel
     mutt
1051 cannot find mail spool
mail/nmh 1535 chgrp: you are not a member of group mail
mail/nullmailer 1536 uid_t, gid_t have not been declared
mail/opendkim 1537 milter includes not found at /usr/pkg
mail/poppassd 1052 cannot find mail spool
mail/qmail 1538 (1 more) no utmp.h
mail/qpopper secondary 1054 ERROR: Couln't [sic] locate the mail spool
mail/ruby-mime-types
     ruby18-mime-types
1263 permission problems during gem install
mail/ruby-mime-types
     ruby193-mime-types
1263 permission problems during gem install
mail/ruby-mime-types
     ruby200-mime-types
1263 permission problems during gem install
mail/ruby-tmail
     ruby18-tmail
1263 permission problems during gem install
mail/ruby-tmail
     ruby193-tmail
1263 permission problems during gem install
mail/ruby-tmail
     ruby200-tmail
1263 permission problems during gem install
mail/sendmail 1539 permission errors during stage-install
mail/smtp-vilter 1055 (1 more) scan.l:21:19: fatal error: parse.h: No such file or directory
mail/spamdyke 1056 "Unable to compile without anonymous inner function support."
mail/teapop 1058 cannot find mail spool
mail/thunderbird10 1542 undefined reference to pthread_attr_get_np
mail/thunderbird17 1875 C++ issues in Events.cpp pertaining to template arguments
mail/xmailbox 1300 gcc: SharedXawReqs: No such file or directory
mail/xmailwatcher 1300 gcc: SharedXawReqs: No such file or directory
math/R 1543 undefined references to logl, expl
math/clisp-pari 1343 /usr/pkg/bin/clisp-link: create-shared-lib: not found
math/fityk 1544 no matching function for call to 'getline(char**, size_t*, FILE*&)'
math/gap 1545 undefined references to own symbols
math/octave-forge 1068 package does not work with current octave
math/ordCalc 1546 uses <malloc.h>, which is apparently fatal on freebsd
math/p5-Math-BigInt-GMP 1547 Shared object "libgmp.so.11" not found
math/p5-Math-Permute-List 1548 permission denied running post-extract chmod
math/py-Scientific
     py26-Scientific
1069 mpi issues
math/py-Scientific
     py27-Scientific
1069 mpi issues
math/ruby-narray
     ruby18-narray
1263 permission problems during gem install
math/ruby-narray
     ruby193-narray
1263 permission problems during gem install
math/ruby-narray
     ruby200-narray
1263 permission problems during gem install
math/scilab 1071 gcc: /tmp/obj-pkgsrc/math/scilab/work/scilab-4.1/libs/system.a: No such file or directory
math/tasp-vsipl 1549 const warnings + -Werror
math/xfractint 1550 no endian.h
math/xlispstat 1551 static declaration of fmax follows non-static declaration
mbone/rat 1552 Makefile_FreeBSD_9: No such file or directory
mbone/vat 1553 no machine/soundcard.h
meta-pkgs/courier 1072 build has no permission to create missing users/groups
misc/calibre 1074 python syntax error
misc/colorls 1554 passing argument 3 of fts_open from incompatible pointer type + -Werror
misc/dnetc 1077 distfile checksum failure
misc/dvtm 1555 undefined reference to waddnwstr
misc/gelemental 1079 (1 more) 'ext/stdio_filebuf.h' file not found
misc/hanzim 1080 install requires an X server
misc/heyu 1557 no sgtty.h
misc/ibutton-pdkit 1558 expected declaration specifiers or '...' before 'ushort'
misc/kdeartwork3
     kdeartwork
1081 C++ issues
misc/kdrill 1300 gcc: SharedXawReqs: No such file or directory
misc/libreoffice 1084 (1 more) clang: unknown argument -fno-enforce-eh-specs
misc/lile
     ile
1559 no sgtty.h or utmp.h
misc/molden 1085 (1 more) fortran issues
misc/openoffice3 1086 'ext/functional' file not found
misc/root 1090 C++ issues
misc/rpm 1561 generic C build failure in fts.c
misc/ruby-ansi
     ruby18-ansi
1263 permission problems during gem install
misc/ruby-ansi
     ruby193-ansi
1263 permission problems during gem install
misc/ruby-ansi
     ruby200-ansi
1263 permission problems during gem install
misc/ruby-args_parser
     ruby18-args_parser
1263 permission problems during gem install
misc/ruby-args_parser
     ruby193-args_parser
1263 permission problems during gem install
misc/ruby-args_parser
     ruby200-args_parser
1263 permission problems during gem install
misc/ruby-bundler
     ruby18-bundler
1263 permission problems during gem install
misc/ruby-bundler
     ruby193-bundler
1263 permission problems during gem install
misc/ruby-bundler
     ruby200-bundler
1263 permission problems during gem install
misc/ruby-colorator
     ruby18-colorator
1263 permission problems during gem install
misc/ruby-colorator
     ruby193-colorator
1263 permission problems during gem install
misc/ruby-colorator
     ruby200-colorator
1263 permission problems during gem install
misc/ruby-columnize
     ruby193-columnize
1263 permission problems during gem install
misc/ruby-columnize
     ruby200-columnize
1263 permission problems during gem install
misc/ruby-configuration
     ruby18-configuration
1263 permission problems during gem install
misc/ruby-configuration
     ruby193-configuration
1263 permission problems during gem install
misc/ruby-configuration
     ruby200-configuration
1263 permission problems during gem install
misc/ruby-daemons
     ruby18-daemons
1263 permission problems during gem install
misc/ruby-daemons
     ruby193-daemons
1263 permission problems during gem install
misc/ruby-daemons
     ruby200-daemons
1263 permission problems during gem install
misc/ruby-gem_plugin
     ruby18-gem_plugin
1263 permission problems during gem install
misc/ruby-gem_plugin
     ruby193-gem_plugin
1263 permission problems during gem install
misc/ruby-gem_plugin
     ruby200-gem_plugin
1263 permission problems during gem install
misc/ruby-hashie
     ruby18-hashie
1263 permission problems during gem install
misc/ruby-hashie
     ruby193-hashie
1263 permission problems during gem install
misc/ruby-hashie
     ruby200-hashie
1263 permission problems during gem install
misc/ruby-parallel
     ruby18-parallel
1263 permission problems during gem install
misc/ruby-parallel
     ruby193-parallel
1263 permission problems during gem install
misc/ruby-parallel
     ruby200-parallel
1263 permission problems during gem install
misc/ruby-rainbow
     ruby18-rainbow
1263 permission problems during gem install
misc/ruby-rainbow
     ruby193-rainbow
1263 permission problems during gem install
misc/ruby-rainbow
     ruby200-rainbow
1263 permission problems during gem install
misc/ruby-transaction-simple
     ruby18-transaction-simple
1263 permission problems during gem install
misc/ruby-transaction-simple
     ruby193-transaction-simple
1263 permission problems during gem install
misc/ruby-transaction-simple
     ruby200-transaction-simple
1263 permission problems during gem install
misc/ruby-typed-array
     ruby18-typed-array
1263 permission problems during gem install
misc/ruby-typed-array
     ruby193-typed-array
1263 permission problems during gem install
misc/ruby-typed-array
     ruby200-typed-array
1263 permission problems during gem install
misc/screen 1562 static declaration of 'getutxent' follows non-static declaration
misc/siag 1563 generic C buildfauilre in Mowitz/MwUtils.h
misc/splitvt 1564 /usr/include/sys/ioctl_compat.h:42:2: error: #error "Definitions not available without TTY ioctl compat."
misc/step 1091 C++ issues: no template named 'vector' in namespace 'std'
misc/taskjuggler 1093 internal tests fail
misc/tmux 1565 "curses not found"
misc/ttyrec 1566 storage size of 'status' isn't known
misc/udfclient 1567 struct scsi_sense_data has no member named add_sense_code
misc/vfu 1569 "Unknown target please define one manually!"
misc/xjdic 1568 no iconv.h or sgtty.h
misc/xrolodex 1300 gcc: SharedXawReqs: No such file or directory
misc/yrolo 1886 undefined reference to cuserid
multimedia/dvb-apps 1606 no linux/dvb/{audio,ca,dmx}.h
multimedia/fxtv 1607 no machine/ioctl_meteor.h
multimedia/gst123 1608 You need to have ncurses5-config installed to build this package.
multimedia/handbrake 1097 (1 more) chokes on inline asm
multimedia/hwdecode-demos 1098 (1 more) fails to configure all its codecs
multimedia/libdvbpsi 1611 comparison is always false due to limited range of data type + -Werror
multimedia/libmpeg3 1612 u_int32_t undeclared
multimedia/liboggz 1613 error: invalid operands to binary -
multimedia/libva-driver-vdpau 1100 (1 more) no package 'libva' found
multimedia/mediatomb 1101 const issues calling iconv()
multimedia/minidlna 1615 no endian.h
multimedia/mpeg_play 1616 video.h:454: error: expected '=', ',', ';', 'asm' or '__attribute__' before ':' token
multimedia/openquicktime 1617 /usr/include/machine/ieeefp.h:144: error: invalid storage class for function '__fnldcw'
multimedia/subtitleeditor 1618 strtoll was not declared in this scope
multimedia/tvtime 1619 expected specifier-qualifier-list before '__u32'
multimedia/xanim 1300 gcc: SharedXawReqs: No such file or directory
multimedia/xawtv 1620 BT848_MAX_CLIP_NODE undeclared here
multimedia/xine-lib 1621 PLIST divergence on codecs
net/DarwinStreamingServer 1622 no match for 'operator=' in 'act.sigaction::sa_mask = 0'
net/IglooFTP 1623 /usr/bin/ld: cannot find -lresolv
net/aiccu 1624 undefined reference to pthread_create
net/arpd 1625 no net/if_ether.h
net/bsddip 1626 no net/slip.h, net/if_slvar.h
net/bwping 1627 configure script fails to find ipv6 support
net/ccrtp 1909 issues with new gcrypt
net/chimera 1628 error: expected specifier-qualifier-list before 'pthread_mutex_t'
net/cia 1629 no net/if_ether.h, net/ethertypes.h
net/clisp-rawsock 1343 /usr/pkg/bin/clisp-link: create-shared-lib: not found
net/coda 1601 no utmp.h
net/couriertcpd 1602 no iconv.h
net/dcsharp 1103 Metadata file `Mono.GetOptions.dll' could not be found
net/dctc 1630 redefinition of 'union semun'
net/delegate 1104 (1 more) undefined refs to own symbols
net/dnscap 1632 undefined reference to _res_opcodes
net/etherape 1633 AF_INET undeclared
net/ettercap 1634 /dev/bpf0 not found
net/gated 1635 undefined reference to h_nerr
net/gopher 1636 conflicting types for 'posix_re_comp'
net/gtk_wicontrol 1637 WI_MAX_DATALEN undeclared
net/gupnp-av 1638 /basejail/usr/include/runetype.h:94: syntax error, unexpected '{', expecting ',' or ';' in '{' at '{'
net/httping 1639 undefined reference to libintl_gettext
net/icsi-finger 1640 no utmp.h, lastlog.h
net/isic 1641 error: #error Random IP generation broken: unexpected RAND_MAX.
net/kiax 1108 install fails with horribly wrong paths generated by qmake
net/knock 1642 /usr/include/resolv.h:195: error: field 'sin' has incomplete type
net/knot 1643 could not find lex that supports reentrant parsers
net/kphone 1644 /usr/bin/ld: cannot find -lresolv
net/latd 1645 no utmp.h
net/lft 1646 undefined reference to pcap_snprintf
net/libbind 1109 (1 more) conflicting sethostent_r/endhostent_r
net/liblive 1648 libBasicUsageEnvironment.la is not a valid libtool archive
net/libpcap 1649 multiple definition of pcap_findalldevs
net/libtrace 1650 extra program installed
net/llnlxdir 1300 gcc: SharedXawReqs: No such file or directory
net/llnlxftp 1887 declares own sys_nerr
net/md-whois 1651 no libintl.h
net/microdc2 1652 tries to pass LDFLAGS/LIBS to ar
net/miredo 1653 void value not ignored as it ought to be
net/mrstat 1654 no utmp.h
net/mrt 1655 RTF_CLONING undeclared
net/mydns-mysql 1113 (1 more) build has no permission to create missing users/groups
net/mydns-pgsql 1114 (1 more) unclear install failure
net/nagios-plugin-dumpdates 1656 DUMPINFMT undeclared
net/nagios-plugin-milter 1657 expected expression before '>' token
net/nagios-plugin-raidctl 1658 no util.h
net/nagios-plugins 1659 'const struct statvfs' has no member named 'f_fstypename'
net/net-snmp 1660 'struct statfs' has no member named 'f_frsize'
net/netatalk 1661 extra stuff installed
net/netbsd-iscsi-initiator 1662 no fuse.h
net/ngrep 1116 (1 more) bad recursive make invocation
net/ns 1117 (1 more) /usr/include/net/pfil.h:48:41: error: expected ';' before 'pfil_link'
/usr/include/net/pfil.h:65:20: error: typedef 'TAILQ_HEAD' is initialized
net/ntp4
     ntp
1665 two extra programs installed
net/ocsync 1876 ENODATA undeclared
net/oidentd 1666 /usr/include/machine/cpufunc.h:153: error: static declaration of 'ffsl' follows non-static declaration
net/omniNotify 1118 LP64 build issue with C++ overloading
net/omniORB 1667 error: #error "No implementation header file"
net/openvpn-acct-wtmpx 1668 no util.h
net/openvpn-nagios 1669 implicit decl of sleep() + -Werror
net/openwbem 1119 (1 more) PLIST mismatch if native PAM not found
net/partysip 1671 undefined refs to (own?) _get_short, _get_long
net/pload 1300 gcc: SharedXawReqs: No such file or directory
net/poptop 1672 no util.h
net/pppd 1122 invalid use of va_list
net/py-twisted-docs 1673 permission errors from pax during stage-install
net/radiusd-cistron 1675 no utmp.h
net/rancid 1676 can't figure out how to pass count == 1 to /sbin/ping.
net/rdist6
     freerdist
1677 Your OS (freebsd9) is currently not supported.
net/ruby-addressable
     ruby18-addressable
1263 permission problems during gem install
net/ruby-addressable
     ruby193-addressable
1263 permission problems during gem install
net/ruby-addressable
     ruby200-addressable
1263 permission problems during gem install
net/ruby-amq-protocol
     ruby18-amq-protocol
1263 permission problems during gem install
net/ruby-amq-protocol
     ruby193-amq-protocol
1263 permission problems during gem install
net/ruby-amq-protocol
     ruby200-amq-protocol
1263 permission problems during gem install
net/ruby-dnsruby
     ruby18-dnsruby
1263 permission problems during gem install
net/ruby-dnsruby
     ruby193-dnsruby
1263 permission problems during gem install
net/ruby-dnsruby
     ruby200-dnsruby
1263 permission problems during gem install
net/ruby-net-ldap
     ruby18-net-ldap
1263 permission problems during gem install
net/ruby-net-ldap
     ruby193-net-ldap
1263 permission problems during gem install
net/ruby-net-ldap
     ruby200-net-ldap
1263 permission problems during gem install
net/ruby-netaddr
     ruby18-netaddr
1263 permission problems during gem install
net/ruby-netaddr
     ruby193-netaddr
1263 permission problems during gem install
net/ruby-netaddr
     ruby200-netaddr
1263 permission problems during gem install
net/ruby-snmp
     ruby18-snmp
1263 permission problems during gem install
net/ruby-snmp
     ruby193-snmp
1263 permission problems during gem install
net/ruby-snmp
     ruby200-snmp
1263 permission problems during gem install
net/ruby-soap4r
     ruby193-soap4r
1263 permission problems during gem install
net/ruby-soap4r
     ruby200-soap4r
1263 permission problems during gem install
net/sendfile 1678 PF_INET undeclared
net/sharity-light 1679 no nfs/rpcv2.h, nfs/nfs.h
net/slurm 1680 no net/if_ppp.h
net/socket++ 1681 declares own gethostname()
net/socks4 1682 (1 more) error: storage size of 'status' isn't known
net/socks5 1683 no utmp.h, sys/ttychars.h
net/spreadlogd 1684 undefined reference to re_search
net/sup 1685 undefined reference to fparseln
net/tacacs 1686 no utmp.h
net/tcl-scotty 1687 disagreement about x86_64 vs. amd64 in plist
net/tcpillust 1688 no net/slip.h
net/tcpreplay 1869 AF_INET undeclared
net/tightvnc 1604 imake lossage similar to issue 1300
net/tightvncviewer 1300 gcc: SharedXawReqs: No such file or directory
net/udpcast 1689 'struct ifreq' has no member named 'ifr_ifindex'
net/uftp 1690 invalid storage class for function P_hash
net/uucp 1691 no util.h
net/vnc 1126 (1 more) uses cpp on makefiles (also appears to contain its own imake)
net/vsftpd 1693 cap_t undeclared
net/waste 1694 invalid conversion from int* to socklen_t*
net/wimon 1695 storage size of 'wreq' isn't known
net/wistumbler 1696 no net/if_ieee80211.h, dev/ic/wi_ieee.h
net/wistumbler2 1697 storage size of 'wreq' isn't known
net/wistumbler2-gtk 1698 storage size of 'wreq' isn't known
net/wminet 1699 'const struct ifnet' has no member named 'if_name'
net/wmnet 1700 invalid application of 'sizeof' to incomplete type 'struct ifnet'
net/wpa_supplicant 1701 no netpacket/packet.h
net/wu-ftpd 1702 no utmp.h
net/xfce4-wavelan-plugin 1703 storage size of 'wr' isn't known
net/xl2tpd 1704 no utio.h
net/ywho 1705 no utmp.h, rpcsvc/rusers.h
news/knews 1300 gcc: SharedXawReqs: No such file or directory
news/newsx 1127 C compiler cannot create executables
news/nget 1128 flexible array member of non-POD element type
and other C++ issues
news/nn 1706 config.h:128:21: error: m-amd64.h: No such file or directory
news/suck 1707 conflicting types for strnstr
news/xrn 1300 gcc: SharedXawReqs: No such file or directory
parallel/clusterit 1708 no utmp.h
parallel/dqs 1709 config.guess: too many arguments
parallel/gridscheduler 1130 depends on standalone-tcsh, which fails to install
parallel/mpi-ch
     mpich
1131 /usr/bin/ld: cannot find -lf95
parallel/openmpi 1710 extra stuff installed (pertaining to posix shmem)
parallel/pvm3
     pvm
1711 exec: PVM_ARCH=UNKNOWN: not found
parallel/py-billiard
     py26-billiard
1910 (1 more) python syntax error during install
pkgtools/packagekit 1713 expected '=', ',', ';', 'asm' or '__attribute__' before 'pk_backend_get_uint'
pkgtools/pkg_select 1714 passing argument 3 of 'scandir' from incompatible pointer type + -Werror
pkgtools/pkgin 1715 error: #warning "this file includes <sys/termios.h> which is deprecated, use <termios.h> instead"
print/LPRng-core 1716 TAB1 and TAB2 undeclared
print/LPRng-doc 1717 pax: illegal option -- O
print/hplip 1239 depends on both py-imaging and py-Pillow, which conflict
print/imposter 1718 expected specifier-qualifier-list before 'ulong'
print/latex-mk 1719 texi2dvi: not found
print/pdf2djvu 1720 gcc crashes
print/pdvipsk 1721 distfile patch rejects
print/poppler-glib 1722 LLONG_MAX was not declared in this scope
print/rtf2latex2e 1723 uses <malloc.h>, which is apparently fatal in freebsd
print/scribus 1135 cmake can't find freetype
print/scribus-qt4
     scribus
1137 cmake can't find freetype
print/tcl-pdflib 1138 can't find pdflib; maybe libtool problems?
print/tex-bibtex8 1724 iconv: not found
print/transfig 1725 declares own sys_nerr
security/CSP 1726 pax: Cannot access destination directory /tmp/security/CSP/work/.destdir/var/csp <No such file or directory>
security/HElib 1727 pkgsrc patches reject
security/MyPasswordSafe 1728 no endian.h
security/PAM 1729 no utmp.h, also uses malloc.h
security/botan 1730 PLIST divergence
security/cfs 1731 post-patch rule generates chmod usage message
security/chkrootkit 1732 no utmp.h
security/courier-authlib 1733 no iconv.h
security/honeyd 1147 (1 more) type conflicts with libevent2
security/honeyd-arpd 1148 undefined references to `event_sigcb' and `event_gotsig'
security/ipsec-tools 1149 (1 more) error: conflicting types for 'ipsec_set_policy'
security/jessie 1150 kaffe fails the configure test for a working JVM
security/kstart 1736 need afs/param.h to build libkafs replacement
security/kth-krb4 1737 UT_NAMESIZE undeclared
security/libnetpgpverify 1738 SHA256_DIGEST_LENGTH undeclared
security/libpbc
     pbc
1151 uses nested functions
security/libprelude-lua 1152 lua52 fallout
security/mcrypt 1739 uses <malloc.h>, which is apparently fatal in freebsd
security/mit-krb5-appl 1740 conflicting types for 'ptyint_update_wtmp'
security/munge 1741 extra share/examples file installed
security/netpgp 1742 IDEA_KEY_LENGTH undeclared
security/nfsbug
     nfsshell
1153 (1 more) archaic C
security/ocaml-cryptokit 1744 PLIST.opt is not set and should be on this platform
security/openssh 1745 'struct utmpx' has no member named 'ut_name'
security/openvas-libraries 1746 no -lresolv
security/p5-Authen-TacacsPlus 1747 no utmp.h
security/pam-krb5 1748 KRB5_WELLKNOWN_NAME undeclared
security/pam-radius 1749 no utmp.h
security/pinentry-qt4 1155 C++ issues in /usr/include/c++/string
security/prelude-lml 1156 compile-time assertion in mktime.c
security/putty 1750 no gdk/gdk.h or gtk/gtk.h
security/qca 1157 install fails with horribly wrong paths generated by qmake
security/qca-tls 1158 install fails with horribly wrong paths generated by qmake
security/rainbowcrack 1752 VM_METER was not declared in this scope
security/rid 1814 grammer.h:25: error: expected specifier-qualifier-list before 'uint16_t'
security/ruby-bcrypt
     ruby18-bcrypt
1263 permission problems during gem install
security/ruby-bcrypt
     ruby193-bcrypt
1263 permission problems during gem install
security/ruby-bcrypt
     ruby200-bcrypt
1263 permission problems during gem install
security/ruby-ezcrypto
     ruby18-ezcrypto
1263 permission problems during gem install
security/ruby-ezcrypto
     ruby193-ezcrypto
1263 permission problems during gem install
security/ruby-ezcrypto
     ruby200-ezcrypto
1263 permission problems during gem install
security/ruby-hmac
     ruby18-hmac
1263 permission problems during gem install
security/ruby-hmac
     ruby193-hmac
1263 permission problems during gem install
security/ruby-hmac
     ruby200-hmac
1263 permission problems during gem install
security/ruby-net-ssh
     ruby18-net-ssh
1263 permission problems during gem install
security/ruby-net-ssh
     ruby193-net-ssh
1263 permission problems during gem install
security/ruby-net-ssh
     ruby200-net-ssh
1263 permission problems during gem install
security/ruby-oauth
     ruby18-oauth
1263 permission problems during gem install
security/ruby-oauth
     ruby193-oauth
1263 permission problems during gem install
security/ruby-oauth
     ruby200-oauth
1263 permission problems during gem install
security/ruby-rc4
     ruby18-rc4
1263 permission problems during gem install
security/ruby-rc4
     ruby193-rc4
1263 permission problems during gem install
security/ruby-rc4
     ruby200-rc4
1263 permission problems during gem install
security/ruby-shadow
     ruby18-shadow
1160 (1 more) lib/shadow.so not installed
ruby193 seems to be ok
security/ruby-shadow
     ruby193-shadow
1263 permission problems during gem install
security/ruby-shadow
     ruby200-shadow
1263 permission problems during gem install
security/ruby-simple_oauth
     ruby18-simple_oauth
1263 permission problems during gem install
security/ruby-simple_oauth
     ruby193-simple_oauth
1263 permission problems during gem install
security/ruby-simple_oauth
     ruby200-simple_oauth
1263 permission problems during gem install
security/sfs 1161 (1 more) C++ issues
security/skey 1753 no utmp.h
security/smaSHeM 1877 pointer of type 'void *' used in arithmetic
security/srp_client
     srp-client
1754 no utmp.h
security/tct 1755 unsupported system: FreeBSD.9.1-RELEASE-p6
security/tripwire 1756 pax: illegal option -- O
security/xmlsec1 1757 /usr/bin/ld: cannot find -ldl
shells/ast-ksh 1816 apparently defines own FILE
shells/dash 1758 build receives SIGSEGV
shells/heirloom-sh 1759 invalid use of undefined type 'struct acct'
shells/standalone-tcsh 1164 failed to package owing apparently to being in /
shells/static-ast-ksh 1165 (1 more) cannot find own executable at install time
sysutils/acpidump 1760 declares own vm_offset_t
sysutils/adtool 1761 /usr/bin/ld: cannot find -lresolv
sysutils/amanda-common 1762 IPv6 support was requested, but opening an IPv6 socket failed
sysutils/amtterm 1763 SOCK_STREAM undeclared
sysutils/apcupsd 1764 apparently tries to strip a shell script
sysutils/aperture secondary 1166 needs kernel sources, not available on build host
sysutils/bacula-wx-console 1765 type of 'pthread_mutex_init' is unknown
sysutils/bbsload 1766 aggregate 'uvmexp uvm_stat' has incomplete type and cannot be defined
sysutils/bubblemon 1767 tries to install as group kmem
sysutils/cdbkup 1768 *** Please install eject first: http://sourceforge.net/projects/eject ***
sysutils/cdrkit 1769 /usr/bin/ld: cannot find -lcap
sysutils/conky 1770 Could not find optreset in -lbsd.
sysutils/dmsdos 1771 uses <malloc.h>, which is apparently fatal in freebsd
sysutils/dvdrecord 1772 tries to pass LIBS to ar
sysutils/gentoo 1773 'struct statvfs' has no member named 'f_mntfromname'
sysutils/gkrellm 1774 no utmp.h
sysutils/gkrellm-server 1775 no utmp.h
sysutils/gnome-volume-manager 1776 no utmp.h
sysutils/grub 1170 "GRUB requires GAS .code16 addr32 support; upgrade binutils"
sysutils/grub2 1171 (1 more) configure: error: gcc failed to produce assembly code
sysutils/heirloom-ps 1778 PS_SWAPPINGOUT undeclared
sysutils/heirloom-stty 1779 NLDLY, CRDLY, BSDLY, FFDLY, VTDLY, etc. undeclared
sysutils/heirloom-users 1780 undefined reference to utmpxname
sysutils/heirloom-who 1781 RUN_LVL undeclared
sysutils/ipw-firmware 1817 cannot fetch distfile
sysutils/isapnptools 1172 ../include/isapnp/iopl.h:50:28: fatal error: machine/bus.h: No such file or directory
sysutils/iwi-firmware 1818 cannot fetch distfile
sysutils/iwi-firmware3 1819 cannot fetch distfile
sysutils/libgtop 1782 __FreeBSD_kernel_version undeclared
sysutils/liboobs 1783 no utmp.h
sysutils/logrotate 1784 no alloca.h
sysutils/lsof 1785 Lsof requires kernel sources to be found in /usr/src/sys.
sysutils/memtestplus 1173 C issues
sysutils/munin-node 1820 fails to install plugins for no obvious reason
sysutils/ntfsprogs 1786 freebsd_io.c: No such file or directory
sysutils/nvnet 1174 can't find bsd.kmod.mk
sysutils/p5-Sys-Filesystem 1176 configure thinks it needs to look at /etc/fstab and
fails because the build chroot has none
sysutils/p5-Sys-Utmp 1787 no utmp.h
sysutils/pftop 1788 expected '=', ',', ';', 'asm' or '__attribute__' before 'void'
sysutils/pluged 1789 USB_MAX_DEVNAMELEN undeclared
sysutils/py-psutil
     py26-psutil
1821 installs _psutil_bsd.so instead of _psutil_netbsd.so
sysutils/py-psutil
     py27-psutil
1821 installs _psutil_bsd.so instead of _psutil_netbsd.so
sysutils/py-xattr
     py26-xattr
1790 XATTR_CREATE, XATTR_REPLACE undeclared
sysutils/py-xattr
     py27-xattr
1790 XATTR_CREATE, XATTR_REPLACE undeclared
sysutils/radeontool 1791 no asm/page.h; PAGE_SIZE undeclared
sysutils/rox 1792 intmax_t undeclared
sysutils/rtty secondary 1177 pkg_create: cannot open data file rtty/bin/ttysrv: Permission denied
sysutils/ruby-directory-watcher
     ruby18-directory-watcher
1263 permission problems during gem install
sysutils/ruby-directory-watcher
     ruby193-directory-watcher
1263 permission problems during gem install
sysutils/ruby-directory-watcher
     ruby200-directory-watcher
1263 permission problems during gem install
sysutils/ruby-facter
     ruby18-facter
1263 permission problems during gem install
sysutils/ruby-facter
     ruby193-facter
1263 permission problems during gem install
sysutils/ruby-facter
     ruby200-facter
1263 permission problems during gem install
sysutils/ruby-fssm
     ruby18-fssm
1263 permission problems during gem install
sysutils/ruby-fssm
     ruby193-fssm
1263 permission problems during gem install
sysutils/ruby-fssm
     ruby200-fssm
1263 permission problems during gem install
sysutils/ruby-notify
     ruby18-notify
1263 permission problems during gem install
sysutils/ruby-notify
     ruby193-notify
1263 permission problems during gem install
sysutils/ruby-notify
     ruby200-notify
1263 permission problems during gem install
sysutils/ruby-quota
     ruby18-quota
1263 permission problems during gem install
sysutils/ruby-quota
     ruby193-quota
1263 permission problems during gem install
sysutils/ruby-quota
     ruby200-quota
1263 permission problems during gem install
sysutils/salt-docs 1793 permission errors from pax during stage-install
sysutils/same 1794 passing argument 1 of 'gzgets' from incompatible pointer type + -Werror
sysutils/sformat 1795 *** No rule to make target 'RULES/amd64-freebsd-cc.rul'. Stop.
sysutils/strace 1796 (1 more) error: #error "FreeBSD support is only for i386 arch right now."
sysutils/su2 1797 no utmp.h
sysutils/syslog-ng 1798 cap_t undeclared
sysutils/tcx 1799 storage size of 'status' isn't known
sysutils/ups-nut 1822 PLIST divergence
sysutils/usbutil 1800 USBD_SHORT_XFER_OK undeclared
sysutils/vobcopy 1801 undefined reference to fdatasync
sysutils/whowatch 1802 no utmp.h
sysutils/wipe 1803 DIOCGWEDGEINFO undeclared
sysutils/wmSMPmon 1804 no sys/swap.h
sysutils/wmcpuload 1805 tries to install as group kmem
sysutils/wmmemmon 1806 tries to install as group kmem
sysutils/xdu 1300 gcc: SharedXawReqs: No such file or directory
sysutils/xenkernel3 1180 (1 more) variably modified __checkFstruct_grant_entry__flags at file scope
(and a dozen more like it)
sysutils/xentools20 1184 sys_string.h:76:22: error: static declaration of 'strnlen' follows non-static declaration
sysutils/xentools42 1188 16-bit assembler that clang doesn't handle
sysutils/xfce4-netload-plugin 1807 no net/if_ppp.h
sysutils/xfm 1300 gcc: SharedXawReqs: No such file or directory
sysutils/xfsprogs 1808 can't find msgfmt (which is already in USE_TOOLS)
sysutils/xmeter 1300 gcc: SharedXawReqs: No such file or directory
sysutils/xosview 1809 error: xosview has not been ported to freebsd9.1
sysutils/xps 1888 'struct kinfo_proc' has no member named 'kp_eproc'
textproc/WordNet 1810 uses <malloc.h>, which is apparently fatal in freebsd
textproc/bsdgrep-devel 1811 request for member 'have' in something not a structure or union
textproc/cabocha 1912 aborts during build on malloc failure
textproc/catdoc 1812 int32_t undeclared
textproc/cityhash 1813 no byteswap.h
textproc/expatobjc 1189 "Expat not found. Install expat first."
textproc/groonga 1190 clang crashes
textproc/ispell 1823 no sgtty.h
textproc/libclucene 1824 wcstoll was not declared in this scope
textproc/makeztxt 1825 expected '=', ',', ';', 'asm' or '__attribute__' before 'palmid_to_int'
textproc/ocaml-csv 1826 PLIST.opt should be set on this platform and is not
textproc/ocaml-text 1827 libiconv seems to be missing!
textproc/ocaml-tyxml 1828 PLIST.opt should be set on this platform and is not
textproc/p5-XML-LibXML 1829 Shared object "libxml2.so.11" not found, during configure
textproc/pear-Console_Table
     php53-pear-Console_Table
1830 pax: illegal option -- O
textproc/pear-Console_Table
     php54-pear-Console_Table
1830 pax: illegal option -- O
textproc/pear-Console_Table
     php55-pear-Console_Table
1830 pax: illegal option -- O
textproc/py-empy
     py26-empy
1831 pax: Cannot access destination directory /tmp/textproc/py-empy/work/.destdir/usr/pkg/share/doc/empy <No such file or directory>
textproc/py-empy
     py27-empy
1831 pax: Cannot access destination directory /tmp/textproc/py-empy/work/.destdir/usr/pkg/share/doc/empy <No such file or directory>
textproc/ruby-bluecloth
     ruby18-bluecloth
1263 permission problems during gem install
textproc/ruby-bluecloth
     ruby193-bluecloth
1263 permission problems during gem install
textproc/ruby-bluecloth
     ruby200-bluecloth
1263 permission problems during gem install
textproc/ruby-builder
     ruby18-builder
1263 permission problems during gem install
textproc/ruby-builder
     ruby193-builder
1263 permission problems during gem install
textproc/ruby-builder
     ruby200-builder
1263 permission problems during gem install
textproc/ruby-coderay
     ruby18-coderay
1263 permission problems during gem install
textproc/ruby-coderay
     ruby193-coderay
1263 permission problems during gem install
textproc/ruby-coderay
     ruby200-coderay
1263 permission problems during gem install
textproc/ruby-diff-lcs
     ruby18-diff-lcs
1263 permission problems during gem install
textproc/ruby-diff-lcs
     ruby193-diff-lcs
1263 permission problems during gem install
textproc/ruby-diff-lcs
     ruby200-diff-lcs
1263 permission problems during gem install
textproc/ruby-fast-stemmer
     ruby18-fast-stemmer
1263 permission problems during gem install
textproc/ruby-fast-stemmer
     ruby193-fast-stemmer
1263 permission problems during gem install
textproc/ruby-fast-stemmer
     ruby200-fast-stemmer
1263 permission problems during gem install
textproc/ruby-fastercsv
     ruby18-fastercsv
1263 permission problems during gem install
textproc/ruby-fastercsv
     ruby193-fastercsv
1263 permission problems during gem install
textproc/ruby-fastercsv
     ruby200-fastercsv
1263 permission problems during gem install
textproc/ruby-ferret
     ruby18-ferret
1263 permission problems during gem install
textproc/ruby-ferret
     ruby193-ferret
1263 permission problems during gem install
textproc/ruby-ferret
     ruby200-ferret
1263 permission problems during gem install
textproc/ruby-hpricot
     ruby18-hpricot
1263 permission problems during gem install
textproc/ruby-hpricot
     ruby193-hpricot
1263 permission problems during gem install
textproc/ruby-hpricot
     ruby200-hpricot
1263 permission problems during gem install
textproc/ruby-json
     ruby18-json
1263 permission problems during gem install
textproc/ruby-json
     ruby193-json
1263 permission problems during gem install
textproc/ruby-json
     ruby200-json
1263 permission problems during gem install
textproc/ruby-json-pure
     ruby18-json-pure
1263 permission problems during gem install
textproc/ruby-json-pure
     ruby193-json-pure
1263 permission problems during gem install
textproc/ruby-json-pure
     ruby200-json-pure
1263 permission problems during gem install
textproc/ruby-kramdown
     ruby18-kramdown
1263 permission problems during gem install
textproc/ruby-kramdown
     ruby193-kramdown
1263 permission problems during gem install
textproc/ruby-kramdown
     ruby200-kramdown
1263 permission problems during gem install
textproc/ruby-levenshtein
     ruby18-levenshtein
1263 permission problems during gem install
textproc/ruby-levenshtein
     ruby193-levenshtein
1263 permission problems during gem install
textproc/ruby-levenshtein
     ruby200-levenshtein
1263 permission problems during gem install
textproc/ruby-libxml
     ruby18-libxml
1263 permission problems during gem install
textproc/ruby-libxml
     ruby193-libxml
1263 permission problems during gem install
textproc/ruby-libxml
     ruby200-libxml
1263 permission problems during gem install
textproc/ruby-mab
     ruby18-mab
1263 permission problems during gem install
textproc/ruby-mab
     ruby193-mab
1263 permission problems during gem install
textproc/ruby-mab
     ruby200-mab
1263 permission problems during gem install
textproc/ruby-multi_json
     ruby18-multi_json
1263 permission problems during gem install
textproc/ruby-multi_json
     ruby193-multi_json
1263 permission problems during gem install
textproc/ruby-multi_json
     ruby200-multi_json
1263 permission problems during gem install
textproc/ruby-nokogiri
     ruby18-nokogiri
1263 permission problems during gem install
textproc/ruby-nokogiri
     ruby193-nokogiri
1263 permission problems during gem install
textproc/ruby-nokogiri
     ruby200-nokogiri
1263 permission problems during gem install
textproc/ruby-oniguruma
     ruby18-oniguruma
1263 permission problems during gem install
textproc/ruby-oniguruma
     ruby193-oniguruma
1263 permission problems during gem install
textproc/ruby-oniguruma
     ruby200-oniguruma
1263 permission problems during gem install
textproc/ruby-plist
     ruby18-plist
1263 permission problems during gem install
textproc/ruby-plist
     ruby193-plist
1263 permission problems during gem install
textproc/ruby-plist
     ruby200-plist
1263 permission problems during gem install
textproc/ruby-rdtool
     ruby18-rdtool
1263 permission problems during gem install
textproc/ruby-rdtool
     ruby193-rdtool
1263 permission problems during gem install
textproc/ruby-rdtool
     ruby200-rdtool
1263 permission problems during gem install
textproc/ruby-redcarpet
     ruby193-redcarpet
1263 permission problems during gem install
textproc/ruby-redcarpet
     ruby200-redcarpet
1263 permission problems during gem install
textproc/ruby-redcloth
     ruby18-redcloth
1263 permission problems during gem install
textproc/ruby-redcloth
     ruby193-redcloth
1263 permission problems during gem install
textproc/ruby-redcloth
     ruby200-redcloth
1263 permission problems during gem install
textproc/ruby-safe_yaml
     ruby18-safe_yaml
1263 permission problems during gem install
textproc/ruby-safe_yaml
     ruby193-safe_yaml
1263 permission problems during gem install
textproc/ruby-safe_yaml
     ruby200-safe_yaml
1263 permission problems during gem install
textproc/ruby-simple-rss
     ruby18-simple-rss
1263 permission problems during gem install
textproc/ruby-simple-rss
     ruby193-simple-rss
1263 permission problems during gem install
textproc/ruby-simple-rss
     ruby200-simple-rss
1263 permission problems during gem install
textproc/ruby-stringex
     ruby18-stringex
1263 permission problems during gem install
textproc/ruby-stringex
     ruby193-stringex
1263 permission problems during gem install
textproc/ruby-stringex
     ruby200-stringex
1263 permission problems during gem install
textproc/ruby-syntax
     ruby18-syntax
1263 permission problems during gem install
textproc/ruby-syntax
     ruby193-syntax
1263 permission problems during gem install
textproc/ruby-syntax
     ruby200-syntax
1263 permission problems during gem install
textproc/ruby-text
     ruby18-text
1263 permission problems during gem install
textproc/ruby-text
     ruby193-text
1263 permission problems during gem install
textproc/ruby-text
     ruby200-text
1263 permission problems during gem install
textproc/ruby-tilt
     ruby18-tilt
1263 permission problems during gem install
textproc/ruby-tilt
     ruby193-tilt
1263 permission problems during gem install
textproc/ruby-tilt
     ruby200-tilt
1263 permission problems during gem install
textproc/ruby-will-paginate
     ruby18-will-paginate
1263 permission problems during gem install
textproc/ruby-will-paginate
     ruby193-will-paginate
1263 permission problems during gem install
textproc/ruby-will-paginate
     ruby200-will-paginate
1263 permission problems during gem install
textproc/ruby-xslt
     ruby18-xslt
1263 permission problems during gem install
textproc/ruby-xslt
     ruby193-xslt
1263 permission problems during gem install
textproc/ruby-xslt
     ruby200-xslt
1263 permission problems during gem install
textproc/ruby-yajl
     ruby18-yajl
1263 permission problems during gem install
textproc/ruby-yajl
     ruby193-yajl
1263 permission problems during gem install
textproc/ruby-yajl
     ruby200-yajl
1263 permission problems during gem install
textproc/unac 1832 iconv_open not found
textproc/xerces-c 1833 PLIST divergence pertaining to iconv
textproc/xmlada 1196 clang and ada support don't yet get along
time/dateutils 1834 MAP_ANONYMOUS undeclared
time/emiclock 1836 no machine/soundcard.h
time/gnyaclock 1300 gcc: SharedXawReqs: No such file or directory
time/heirloom-date 1837 undefined reference to updwtmpx
time/plan 1889 no utmp.h
time/ruby-tzinfo
     ruby18-tzinfo
1263 permission problems during gem install
time/ruby-tzinfo
     ruby193-tzinfo
1263 permission problems during gem install
time/ruby-tzinfo
     ruby200-tzinfo
1263 permission problems during gem install
time/swisswatch 1300 gcc: SharedXawReqs: No such file or directory
time/titrax 1300 gcc: SharedXawReqs: No such file or directory
time/wyrd 1838 undefined references to half of curses
time/xalarm 1300 gcc: SharedXawReqs: No such file or directory
time/xcal 1300 gcc: SharedXawReqs: No such file or directory
time/xtimer 1300 gcc: SharedXawReqs: No such file or directory
wm/afterstep 1198 plist divergence on docs
wm/bbkeys09 1839 /usr/bin/ld: cannot find -liconv
wm/bbpager04 1840 /usr/bin/ld: cannot find -liconv
wm/bmpanel2 1841 uses <malloc.h>, which is apparently fatal in freebsd
wm/ctwm 1300 gcc: SharedXawReqs: No such file or directory
wm/fvwm 1842 PLIST divergence on message catalogs
wm/fvwm-themes 1200 half the material doesn't install
wm/icecc 1201 install fails with horribly wrong paths generated by qmake
wm/larswm 1300 gcc: SharedXawReqs: No such file or directory
wm/notion 1843 SIGTRAP undeclared
wm/pekwm 1844 Could not find iconv.
wm/piewm 1300 gcc: SharedXawReqs: No such file or directory
wm/pwm 1845 snprintf_2.2/snprintf.c:455: error: incompatible types in assignment
wm/tvtwm 1300 gcc: SharedXawReqs: No such file or directory
wm/wmii 1847 no iconv.h
www/amaya 1848 cannot convert 'FILE*' to 'gzFile_s*' for argument '1' to 'int gzread(gzFile_s*, void*, unsigned int)'
www/ap-auth-ntlm
     ap13-auth-ntlm
1849 uses <malloc.h>, which is apparently fatal in freebsd
www/ap-python
     ap13-py26-python
1850 permission errors from pax during stage-install
www/ap-python
     ap13-py27-python
1850 permission errors from pax during stage-install
www/ap-ssl
     ap13-ssl
1202 openssl issues
www/ap2-auth-ldap 1851 expected specifier-qualifier-list before 'apr_thread_mutex_t'
www/ap2-auth-ntlm 1852 uses <malloc.h>, which is apparently fatal in freebsd
www/ap2-auth-ntlm
     ap22-auth-ntlm
1852 uses <malloc.h>, which is apparently fatal in freebsd
www/bkedit 1853 /usr/bin/ld: cannot find -lgnugetopt
www/c-icap-modules 1854 conflicting types for 'strnstr'
www/clisp-fastcgi 1343 /usr/pkg/bin/clisp-link: create-shared-lib: not found
www/crawl 1855 EAI_NODATA undeclared
www/jetty7
     jetty
1205 build has no permission to create missing users/groups
www/netsurf 1856 expected declaration specifiers or '...' before 'size_t'
www/nvu 1857 error: #error "Unknown CPU architecture"
www/opera 1858 pile of missing libraries
www/paros 1207 pile of missing libraries
www/php-fpm
     php53-fpm
1861 'struct tcp_info' has no member named 'tcpi_sacked'
www/ruby-cookiejar
     ruby18-cookiejar
1263 permission problems during gem install
www/ruby-cookiejar
     ruby193-cookiejar
1263 permission problems during gem install
www/ruby-cookiejar
     ruby200-cookiejar
1263 permission problems during gem install
www/ruby-cssmin
     ruby18-cssmin
1263 permission problems during gem install
www/ruby-cssmin
     ruby193-cssmin
1263 permission problems during gem install
www/ruby-cssmin
     ruby200-cssmin
1263 permission problems during gem install
www/ruby-csspool
     ruby18-csspool
1263 permission problems during gem install
www/ruby-csspool
     ruby193-csspool
1263 permission problems during gem install
www/ruby-csspool
     ruby200-csspool
1263 permission problems during gem install
www/ruby-erubis
     ruby18-erubis
1263 permission problems during gem install
www/ruby-erubis
     ruby193-erubis
1263 permission problems during gem install
www/ruby-erubis
     ruby200-erubis
1263 permission problems during gem install
www/ruby-fcgi
     ruby18-fcgi
1263 permission problems during gem install
www/ruby-fcgi
     ruby193-fcgi
1263 permission problems during gem install
www/ruby-fcgi
     ruby200-fcgi
1263 permission problems during gem install
www/ruby-http_parser.rb
     ruby18-http_parser.rb
1263 permission problems during gem install
www/ruby-http_parser.rb
     ruby193-http_parser.rb
1263 permission problems during gem install
www/ruby-http_parser.rb
     ruby200-http_parser.rb
1263 permission problems during gem install
www/ruby-journey
     ruby18-journey
1263 permission problems during gem install
www/ruby-journey
     ruby193-journey
1263 permission problems during gem install
www/ruby-journey
     ruby200-journey
1263 permission problems during gem install
www/ruby-jsmin
     ruby18-jsmin
1263 permission problems during gem install
www/ruby-jsmin
     ruby193-jsmin
1263 permission problems during gem install
www/ruby-jsmin
     ruby200-jsmin
1263 permission problems during gem install
www/ruby-liquid
     ruby18-liquid
1263 permission problems during gem install
www/ruby-liquid
     ruby193-liquid
1263 permission problems during gem install
www/ruby-liquid
     ruby200-liquid
1263 permission problems during gem install
www/ruby-multipart-post
     ruby18-multipart-post
1263 permission problems during gem install
www/ruby-multipart-post
     ruby193-multipart-post
1263 permission problems during gem install
www/ruby-multipart-post
     ruby200-multipart-post
1263 permission problems during gem install
www/ruby-net-http-digest_auth
     ruby18-net-http-digest_auth
1263 permission problems during gem install
www/ruby-net-http-digest_auth
     ruby193-net-http-digest_auth
1263 permission problems during gem install
www/ruby-net-http-digest_auth
     ruby200-net-http-digest_auth
1263 permission problems during gem install
www/ruby-net-http-persistent
     ruby18-net-http-persistent
1263 permission problems during gem install
www/ruby-net-http-persistent
     ruby193-net-http-persistent
1263 permission problems during gem install
www/ruby-net-http-persistent
     ruby200-net-http-persistent
1263 permission problems during gem install
www/ruby-ntlm-http
     ruby18-ntlm-http
1263 permission problems during gem install
www/ruby-ntlm-http
     ruby193-ntlm-http
1263 permission problems during gem install
www/ruby-ntlm-http
     ruby200-ntlm-http
1263 permission problems during gem install
www/ruby-patron
     ruby18-patron
1263 permission problems during gem install
www/ruby-patron
     ruby193-patron
1263 permission problems during gem install
www/ruby-patron
     ruby200-patron
1263 permission problems during gem install
www/ruby-rack
     ruby18-rack
1263 permission problems during gem install
www/ruby-rack
     ruby193-rack
1263 permission problems during gem install
www/ruby-rack
     ruby200-rack
1263 permission problems during gem install
www/ruby-rack-rewrite
     ruby18-rack-rewrite
1263 permission problems during gem install
www/ruby-rack-rewrite
     ruby193-rack-rewrite
1263 permission problems during gem install
www/ruby-rack-rewrite
     ruby200-rack-rewrite
1263 permission problems during gem install
www/ruby-rack14
     ruby18-rack14
1263 permission problems during gem install
www/ruby-rack14
     ruby193-rack14
1263 permission problems during gem install
www/ruby-rack14
     ruby200-rack14
1263 permission problems during gem install
www/ruby-raindrops
     ruby18-raindrops
1263 permission problems during gem install
www/ruby-raindrops
     ruby193-raindrops
1263 permission problems during gem install
www/ruby-raindrops
     ruby200-raindrops
1263 permission problems during gem install
www/ruby-sass
     ruby18-sass
1263 permission problems during gem install
www/ruby-sass
     ruby193-sass
1263 permission problems during gem install
www/ruby-sass
     ruby200-sass
1263 permission problems during gem install
www/squidclamav 1865 conflicting types for strnstr
www/wml 1582 something did not get compiled with -fPIC
x11/9term 1583 no utmp.h
x11/Xbae 1890 /usr/bin/ld: cannot find -liconv
x11/aterm 1584 error: #error define UTMP_FILENAME in config.h
x11/clisp-gtk2 1343 /usr/pkg/bin/clisp-link: create-shared-lib: not found
x11/clisp-new-clx 1343 /usr/pkg/bin/clisp-link: create-shared-lib: not found
x11/ede 1213 /tmp/obj-pkgsrc/x11/ede/work/.buildlink/lib/libefltk.so: undefined reference to `copy_row'
x11/efltk 1585 fatal const errors calling scandir
x11/elementary 1586 Cannot create buffer engine canvas for image load.
x11/elementary-icon-theme 1587 permission errors from pax during stage-installl
x11/eterm 1588 no iconv.h
x11/fltk2 1595 fatal const errors calling scandir
x11/gdm 1596 'struct utmpx' has no member named 'ut_exit'
x11/ggiterm 1597 no utmp.h
x11/gtkada 1215 clang and ada support don't yet get along
x11/hanterm 1216 (1 more) use of undeclared identifier ECHO
x11/kde4-l10n-sr 1217 plist divergence
x11/kterm 1599 no utmp.h
x11/lablgtk1 1218 (1 more) ocaml issues
x11/libXi secondary 1219 Requested 'x11 >= 1.4.99.1' but version of X11 is 1.4.4
x11/libXrandr secondary 1220 Requested 'randrproto >= 1.4' but version of RandrProto is 1.3.2
x11/matchbox-panel 1600 battery applet fails to configure
x11/modular-xorg-server 1222 (1 more) GL_RESET_NOTIFICATION_STRATEGY_ARB undeclared
x11/mrxvt 1572 LASTLOG_FILENAME undeclared
x11/mxterm 1891 no utmp.h, sgtty.h
x11/openbsd-input-ws 1223 doesn't work with current X server
x11/py-gnome2-desktop
     py26-gnome2-desktop
1232 depends on multiple python versions and self-conflicting python modules
x11/qt4-libs 1591 libqcncodecs.la is not a valid libtool archive
x11/ruby-wxruby
     ruby193-wxruby
1224 wrong swig version
x11/ruby-wxruby
     ruby200-wxruby
1224 wrong swig version
x11/rxvt 1574 no utmp or utmpx struct found
x11/rxvt-unicode 1575 undefined references to operator new[](unsigned long)
x11/speyes 1300 gcc: SharedXawReqs: No such file or directory
x11/vte 1592 no utmp.h
x11/vte029 1593 no utmp.h
x11/wmfstatus 1594 no utmp.h
x11/wterm 1590 error: #error define UTMP_FILENAME in config.h
x11/x3270 1576 No iconv library function
x11/xaniroc 1300 gcc: SharedXawReqs: No such file or directory
x11/xbanner 1577 generic C build failure in xb_check.c
x11/xcb 1300 gcc: SharedXawReqs: No such file or directory
x11/xcb-util-cursor 1578 type qualifiers ignored on function return type
x11/xcolors 1300 gcc: SharedXawReqs: No such file or directory
x11/xcolorsel 1300 gcc: SharedXawReqs: No such file or directory
x11/xdm3d 1226 install: /etc/X11/xdm/GiveConsole: stat: No such file or directory
x11/xearth 1300 gcc: SharedXawReqs: No such file or directory
x11/xforms 1581 not build with -fPIC
x11/xgas 1300 gcc: SharedXawReqs: No such file or directory
x11/xkeycaps 1300 gcc: SharedXawReqs: No such file or directory
x11/xless 1300 gcc: SharedXawReqs: No such file or directory
x11/xlogout 1300 gcc: SharedXawReqs: No such file or directory
x11/xlt 1892 /usr/bin/ld: cannot find -liconv
x11/xlupe 1300 gcc: SharedXawReqs: No such file or directory
x11/xmascot 1300 gcc: SharedXawReqs: No such file or directory
x11/xmon 1300 gcc: SharedXawReqs: No such file or directory
x11/xmx 1579 uses <malloc.h>, which is apparently fatal on freebsd
x11/xp 1300 gcc: SharedXawReqs: No such file or directory
x11/xpaste 1300 gcc: SharedXawReqs: No such file or directory
x11/xpostit 1300 gcc: SharedXawReqs: No such file or directory
x11/xscribble 1300 gcc: SharedXawReqs: No such file or directory
x11/xview-lib 1580 no sgtty.h
x11/xvkbd 1300 gcc: SharedXawReqs: No such file or directory