ATF Tests Results

Execution summary

Item

Value

ATF

Version

Automated Testing Framework 0.20 (atf-0.20)

Timings

Start time of tests

Thu Dec 29 12:56:07 CET 2016

End time of tests

Thu Dec 29 13:24:52 CET 2016

System information

Host name

thirdstage.duskware.de

Operating system

NetBSD

Operating system release

7.99.53

Operating system version

NetBSD 7.99.53 (MODULAR) #587: Thu Dec 29 11:56:12 CET 2016 martin@thirdstage.duskware.de:/usr/src/sys/arch/sparc64/compile/MODULAR

Platform

sparc64

Tests results

Root

/usr/tests

Test programs

676

Bogus test programs

0

Test cases

4788

Passed test cases

4651

Failed test cases

18

Expected failures

37

Skipped test cases

82

See more execution details

Test cases summary

Test case

Result

Reason

Duration

bin/cat/t_cat

0.694957s

align

Passed

N/A

0.409809s

nonexistent

Passed

N/A

0.140295s

se_output

Passed

N/A

0.143125s

bin/cp/t_cp

2.275098s

dir_to_dir

Passed

N/A

0.505992s

dir_to_file

Passed

N/A

0.179516s

file_over_link

Passed

N/A

0.150895s

file_to_file

Passed

N/A

0.340360s

file_to_link

Passed

N/A

0.147719s

file_to_linkdir

Passed

N/A

0.217819s

files_to_dir

Passed

N/A

0.175390s

link_over_file

Passed

N/A

0.160313s

link_to_file

Passed

N/A

0.183254s

linkdir_to_file

Passed

N/A

0.193326s

bin/dd/t_dd

0.962135s

io

Passed

N/A

0.468901s

length

Passed

N/A

0.196889s

seek

Passed

N/A

0.293790s

bin/df/t_df

0.303492s

hflag

Passed

N/A

0.157170s

normal

Passed

N/A

0.144730s

bin/expr/t_expr

2.070716s

arithmetic_ops

Passed

N/A

0.161363s

basic_functional

Passed

N/A

0.129231s

basic_math

Passed

N/A

0.107054s

colon_vs_math

Passed

N/A

0.120305s

compare_ops

Passed

N/A

0.243693s

compare_ops_precedence

Passed

N/A

0.109065s

gtkmm

Passed

N/A

0.159281s

lang

Passed

N/A

0.205299s

math_precedence

Passed

N/A

0.108526s

multiply

Passed

N/A

0.120014s

negative

Passed

N/A

0.148586s

overflow

Passed

N/A

0.238034s

precedence

Passed

N/A

0.106568s

regex

Passed

N/A

0.105018s

bin/pax/t_pax

0.299186s

append

Passed

N/A

0.297875s

bin/ps/t_ps

3.119362s

default_columns

Passed

N/A

0.921053s

duplicate_column

Passed

N/A

0.226453s

minus_O

Passed

N/A

0.299487s

minus_o

Passed

N/A

0.391965s

override_heading_all_null

Passed

N/A

0.263692s

override_heading_embedded_specials

Passed

N/A

0.326298s

override_heading_simple

Passed

N/A

0.307959s

override_heading_some_null

Passed

N/A

0.377389s

bin/sh/dotcmd/t_dotcmd

38.531409s

case_break_case

Passed

N/A

0.216282s

case_break_compound

Passed

N/A

0.194258s

case_break_file

Passed

N/A

0.188819s

case_break_for

Passed

N/A

0.198547s

case_break_func

Passed

N/A

0.194690s

case_break_subshell

Passed

N/A

0.197927s

case_break_until

Passed

N/A

0.201645s

case_break_while

Passed

N/A

0.190699s

case_continue_case

Passed

N/A

0.192582s

case_continue_compound

Passed

N/A

0.200049s

case_continue_file

Passed

N/A

0.189913s

case_continue_for

Passed

N/A

0.191853s

case_continue_func

Passed

N/A

0.208932s

case_continue_subshell

Passed

N/A

0.201457s

case_continue_until

Passed

N/A

0.200108s

case_continue_while

Passed

N/A

0.190698s

case_return_case

Passed

N/A

0.224089s

case_return_compound

Passed

N/A

0.190712s

case_return_file

Passed

N/A

0.195029s

case_return_for

Passed

N/A

0.195834s

case_return_func

Passed

N/A

0.194097s

case_return_subshell

Passed

N/A

0.206590s

case_return_until

Passed

N/A

0.198972s

case_return_while

Passed

N/A

0.191858s

compound_break_case

Passed

N/A

0.196301s

compound_break_compound

Passed

N/A

0.194377s

compound_break_file

Passed

N/A

0.212976s

compound_break_for

Passed

N/A

0.211222s

compound_break_func

Passed

N/A

0.193562s

compound_break_subshell

Passed

N/A

0.200864s

compound_break_until

Passed

N/A

0.197973s

compound_break_while

Passed

N/A

0.193870s

compound_continue_case

Passed

N/A

0.193942s

compound_continue_compound

Passed

N/A

0.209579s

compound_continue_file

Passed

N/A

0.189115s

compound_continue_for

Passed

N/A

0.189459s

compound_continue_func

Passed

N/A

0.194897s

compound_continue_subshell

Passed

N/A

0.200641s

compound_continue_until

Passed

N/A

0.202604s

compound_continue_while

Passed

N/A

0.189879s

compound_return_case

Passed

N/A

0.193052s

compound_return_compound

Passed

N/A

0.197218s

compound_return_file

Passed

N/A

0.193672s

compound_return_for

Passed

N/A

0.199272s

compound_return_func

Passed

N/A

0.192410s

compound_return_subshell

Passed

N/A

0.202256s

compound_return_until

Passed

N/A

0.202386s

compound_return_while

Passed

N/A

0.191022s

file_break_case

Passed

N/A

0.202723s

file_break_compound

Passed

N/A

0.198559s

file_break_file

Passed

N/A

0.195473s

file_break_for

Passed

N/A

0.197289s

file_break_func

Passed

N/A

0.194150s

file_break_subshell

Passed

N/A

0.206496s

file_break_until

Passed

N/A

0.198740s

file_break_while

Passed

N/A

0.193749s

file_continue_case

Passed

N/A

0.195434s

file_continue_compound

Passed

N/A

0.202436s

file_continue_file

Passed

N/A

0.199969s

file_continue_for

Passed

N/A

0.191027s

file_continue_func

Passed

N/A

0.196626s

file_continue_subshell

Passed

N/A

0.205324s

file_continue_until

Passed

N/A

0.201207s

file_continue_while

Passed

N/A

0.196755s

file_return_case

Passed

N/A

0.206447s

file_return_compound

Passed

N/A

0.202261s

file_return_file

Passed

N/A

0.192887s

file_return_for

Passed

N/A

0.196125s

file_return_func

Passed

N/A

0.197850s

file_return_subshell

Passed

N/A

0.197641s

file_return_until

Passed

N/A

0.197840s

file_return_while

Passed

N/A

0.199174s

for_break_case

Passed

N/A

0.195900s

for_break_compound

Passed

N/A

0.192984s

for_break_file

Passed

N/A

0.194492s

for_break_for

Passed

N/A

0.201227s

for_break_func

Passed

N/A

0.197298s

for_break_subshell

Passed

N/A

0.324944s

for_break_until

Passed

N/A

0.211931s

for_break_while

Passed

N/A

0.194333s

for_continue_case

Passed

N/A

0.198714s

for_continue_compound

Passed

N/A

0.190521s

for_continue_file

Passed

N/A

0.198584s

for_continue_for

Passed

N/A

0.195207s

for_continue_func

Passed

N/A

0.194594s

for_continue_subshell

Passed

N/A

0.201121s

for_continue_until

Passed

N/A

0.199872s

for_continue_while

Passed

N/A

0.196498s

for_return_case

Passed

N/A

0.198148s

for_return_compound

Passed

N/A

0.195216s

for_return_file

Passed

N/A

0.194359s

for_return_for

Passed

N/A

0.202559s

for_return_func

Passed

N/A

0.192167s

for_return_subshell

Passed

N/A

0.206235s

for_return_until

Passed

N/A

0.197732s

for_return_while

Passed

N/A

0.195196s

func_break_case

Passed

N/A

0.194035s

func_break_compound

Passed

N/A

0.204453s

func_break_file

Passed

N/A

0.194008s

func_break_for

Passed

N/A

0.196232s

func_break_func

Passed

N/A

0.198734s

func_break_subshell

Passed

N/A

0.198453s

func_break_until

Passed

N/A

0.194736s

func_break_while

Passed

N/A

0.193563s

func_continue_case

Passed

N/A

0.194766s

func_continue_compound

Passed

N/A

0.196208s

func_continue_file

Passed

N/A

0.197252s

func_continue_for

Passed

N/A

0.198934s

func_continue_func

Passed

N/A

0.207094s

func_continue_subshell

Passed

N/A

0.197779s

func_continue_until

Passed

N/A

0.196762s

func_continue_while

Passed

N/A

0.205114s

func_return_case

Passed

N/A

0.192446s

func_return_compound

Passed

N/A

0.192007s

func_return_file

Passed

N/A

0.198683s

func_return_for

Passed

N/A

0.195291s

func_return_func

Passed

N/A

0.199274s

func_return_subshell

Passed

N/A

0.203258s

func_return_until

Passed

N/A

0.198709s

func_return_while

Passed

N/A

0.191688s

subshell_break_case

Passed

N/A

0.207430s

subshell_break_compound

Passed

N/A

0.200161s

subshell_break_file

Passed

N/A

0.202332s

subshell_break_for

Passed

N/A

0.197899s

subshell_break_func

Passed

N/A

0.194882s

subshell_break_subshell

Passed

N/A

0.205881s

subshell_break_until

Passed

N/A

0.200440s

subshell_break_while

Passed

N/A

0.254170s

subshell_continue_case

Passed

N/A

0.205209s

subshell_continue_compound

Passed

N/A

0.208264s

subshell_continue_file

Passed

N/A

0.204990s

subshell_continue_for

Passed

N/A

0.206937s

subshell_continue_func

Passed

N/A

0.206632s

subshell_continue_subshell

Passed

N/A

0.207239s

subshell_continue_until

Passed

N/A

0.204933s

subshell_continue_while

Passed

N/A

0.197794s

subshell_return_case

Passed

N/A

0.203153s

subshell_return_compound

Passed

N/A

0.201883s

subshell_return_file

Passed

N/A

0.198251s

subshell_return_for

Passed

N/A

0.203637s

subshell_return_func

Passed

N/A

0.205580s

subshell_return_subshell

Passed

N/A

0.202408s

subshell_return_until

Passed

N/A

0.206718s

subshell_return_while

Passed

N/A

0.202694s

until_break_case

Passed

N/A

0.198871s

until_break_compound

Passed

N/A

0.195840s

until_break_file

Passed

N/A

0.195914s

until_break_for

Passed

N/A

0.195934s

until_break_func

Passed

N/A

0.190718s

until_break_subshell

Passed

N/A

0.213150s

until_break_until

Passed

N/A

0.199596s

until_break_while

Passed

N/A

0.197888s

until_continue_case

Passed

N/A

0.199012s

until_continue_compound

Passed

N/A

0.196928s

until_continue_file

Passed

N/A

0.199418s

until_continue_for

Passed

N/A

0.193681s

until_continue_func

Passed

N/A

0.197968s

until_continue_subshell

Passed

N/A

0.203121s

until_continue_until

Passed

N/A

0.205580s

until_continue_while

Passed

N/A

0.196730s

until_return_case

Passed

N/A

0.194780s

until_return_compound

Passed

N/A

0.196507s

until_return_file

Passed

N/A

0.199748s

until_return_for

Passed

N/A

0.196649s

until_return_func

Passed

N/A

0.202105s

until_return_subshell

Passed

N/A

0.206882s

until_return_until

Passed

N/A

0.207431s

until_return_while

Passed

N/A

0.199704s

while_break_case

Passed

N/A

0.201315s

while_break_compound

Passed

N/A

0.196159s

while_break_file

Passed

N/A

0.197058s

while_break_for

Passed

N/A

0.198644s

while_break_func

Passed

N/A

0.199476s

while_break_subshell

Passed

N/A

0.203941s

while_break_until

Passed

N/A

0.204483s

while_break_while

Passed

N/A

0.199594s

while_continue_case

Passed

N/A

0.199066s

while_continue_compound

Passed

N/A

0.253858s

while_continue_file

Passed

N/A

0.200420s

while_continue_for

Passed

N/A

0.195692s

while_continue_func

Passed

N/A

0.201027s

while_continue_subshell

Passed

N/A

0.207159s

while_continue_until

Passed

N/A

0.192059s

while_continue_while

Passed

N/A

0.198173s

while_return_case

Passed

N/A

0.198869s

while_return_compound

Passed

N/A

0.196911s

while_return_file

Passed

N/A

0.194978s

while_return_for

Passed

N/A

0.201970s

while_return_func

Passed

N/A

0.193287s

while_return_subshell

Passed

N/A

0.203987s

while_return_until

Passed

N/A

0.199554s

while_return_while

Passed

N/A

0.193216s

bin/sh/t_arith

12.409907s

constants

Passed

N/A

0.702227s

do_unary_minus

Passed

N/A

0.386495s

do_unary_not

Passed

N/A

0.315837s

do_unary_plus

Passed

N/A

0.321819s

do_unary_tilde

Passed

N/A

0.283224s

elementary_add

Passed

N/A

0.504735s

elementary_div

Passed

N/A

0.469095s

elementary_eq

Passed

N/A

0.602993s

elementary_ge

Passed

N/A

0.287957s

elementary_gt

Passed

N/A

0.528998s

elementary_le

Passed

N/A

0.448973s

elementary_lt

Passed

N/A

0.417926s

elementary_mul

Passed

N/A

0.534644s

elementary_ne

Passed

N/A

0.496141s

elementary_rem

Passed

N/A

0.661301s

elementary_shl

Passed

N/A

0.431503s

elementary_shr

Passed

N/A

0.490001s

elementary_sub

Passed

N/A

0.484469s

fiddle_bits_and

Passed

N/A

0.375612s

fiddle_bits_or

Passed

N/A

0.383667s

fiddle_bits_xor

Passed

N/A

0.400665s

logical_and

Passed

N/A

0.345936s

logical_or

Passed

N/A

0.362557s

make_selection

Passed

N/A

0.346371s

operator_precedence

Passed

N/A

0.947849s

parentheses

Passed

N/A

0.861863s

bin/sh/t_cmdsub

7.468935s

a_basic_cmdsub

Passed

N/A

0.598484s

b_basic_backticks

Passed

N/A

0.610146s

c_nested_cmdsub

Passed

N/A

0.229434s

d_nested_backticks

Passed

N/A

0.220627s

e_perverse_mixing

Passed

N/A

0.313535s

f_redirect_in_cmdsub

Passed

N/A

0.341712s

g_redirect_in_backticks

Passed

N/A

0.340834s

h_vars_in_cmdsub

Passed

N/A

0.456850s

i_vars_in_backticks

Passed

N/A

0.417440s

j_cmdsub_in_varexpand

Passed

N/A

0.249530s

k_backticks_in_varexpand

Passed

N/A

0.234869s

l_arithmetic_in_cmdsub

Passed

N/A

0.210306s

m_arithmetic_in_backticks

Passed

N/A

0.214292s

n_cmdsub_in_arithmetic

Passed

N/A

0.212413s

o_backticks_in_arithmetic

Passed

N/A

0.215068s

p_cmdsub_in_heredoc

Passed

N/A

0.153785s

q_backticks_in_heredoc

Passed

N/A

0.149370s

r_heredoc_in_cmdsub

Passed

N/A

0.244491s

s_heredoc_in_backticks

Passed

N/A

0.189781s

t_nested_cmdsubs_in_heredoc

Passed

N/A

0.273074s

u_nested_backticks_in_heredoc

Passed

N/A

0.268633s

v_cmdsub_paren_tests

Passed

N/A

0.637189s

w_heredoc_outside_cmdsub

Passed

N/A

0.240983s

x_heredoc_outside_backticks

Passed

N/A

0.187068s

z_absurd_heredoc_cmdsub_combos

Passed

N/A

0.240679s

bin/sh/t_evaltested

0.109904s

evaltested

Passed

N/A

0.108817s

bin/sh/t_exit

2.338295s

background

Passed

N/A

0.162166s

function

Passed

N/A

0.136036s

readout

Passed

N/A

0.132958s

simple_exit

Passed

N/A

0.627306s

subshell_background

Passed

N/A

0.160012s

subshell_exit

Passed

N/A

0.700255s

trap_subshell

Passed

N/A

0.147500s

trap_zero__explicit_exit

Passed

N/A

0.130684s

trap_zero__implicit_exit

Passed

N/A

0.134674s

bin/sh/t_expand

2.493988s

arithmetic

Passed

N/A

0.194891s

dollar_at

Passed

N/A

0.211907s

dollar_at_with_text

Passed

N/A

0.501267s

iteration_on_null_or_missing_parameter

Passed

N/A

0.128977s

iteration_on_null_or_null_parameter

Passed

N/A

0.129190s

iteration_on_null_parameter

Passed

N/A

0.130808s

iteration_on_quoted_null_parameter

Passed

N/A

0.131512s

shell_params

Passed

N/A

0.436313s

strip

Passed

N/A

0.492090s

varpattern_backslashes

Passed

N/A

0.130129s

bin/sh/t_fsplit

3.240053s

default_val

Passed

N/A

0.689924s

dollar_at

Passed

N/A

0.588255s

for

Passed

N/A

0.120054s

ifs

Passed

N/A

0.313651s

ifs_alpha

Passed

N/A

0.225502s

quote

Passed

N/A

0.161570s

replacement_val

Passed

N/A

0.948122s

var_length

Passed

N/A

0.187241s

bin/sh/t_here

11.101947s

do_simple

Passed

N/A

0.814701s

end_markers

Passed

N/A

8.194506s

incomplete

Passed

N/A

0.546341s

lineends

Passed

N/A

0.472820s

multiple

Passed

N/A

0.277789s

nested

Passed

N/A

0.209773s

quoting

Passed

N/A

0.235695s

side_effects

Passed

N/A

0.139797s

vicious

Passed

N/A

0.204531s

bin/sh/t_option

6.934511s

Option_switching

Passed

N/A

1.505200s

restore_local_opts

Passed

N/A

0.189840s

set_C

Passed

N/A

0.444832s

set_a

Passed

N/A

0.265326s

set_e

Passed

N/A

0.259201s

set_f

Passed

N/A

0.263256s

set_n

Passed

N/A

2.424824s

set_u

Passed

N/A

0.566332s

set_v

Passed

N/A

0.316871s

set_x

Passed

N/A

0.271510s

vi_emacs_VE_toggle

Passed

N/A

0.284656s

xx_bogus

Passed

N/A

0.131036s

bin/sh/t_redir

32.125838s

basic_test_method_test

Passed

N/A

0.417697s

do_input_redirections

Passed

N/A

0.712722s

do_output_redirections

Passed

N/A

0.717684s

fd_redirections

Passed

N/A

1.171295s

incorrect_redirections

Passed

N/A

0.541324s

local_redirections

Passed

N/A

0.274685s

named_fd_redirections

Passed

N/A

0.364965s

redir_here_doc

Passed

N/A

0.146749s

redir_in_case

Passed

N/A

0.229167s

subshell_redirections

Passed

N/A

0.303644s

ulimit_redirection_interaction

Passed

N/A

0.292580s

validate_fn_redirects

Passed

N/A

26.926347s

bin/sh/t_redircloexec

1.186538s

compound_redir_open

Passed

N/A

0.141330s

exec_redir_closed

Passed

N/A

0.304291s

exec_redir_open

Passed

N/A

0.302702s

loop_redir_open

Passed

N/A

0.140275s

simple_redir_open

Passed

N/A

0.144927s

subshell_redir_open

Passed

N/A

0.149219s

bin/sh/t_set_e

2.555773s

all

Passed

N/A

2.555069s

bin/sh/t_shift

1.680933s

basic_shift_test

Passed

N/A

0.512974s

excessive_shift

Passed

N/A

0.405691s

function_shift

Passed

N/A

0.098494s

non_numeric_shift

Passed

N/A

0.393109s

too_many_args

Passed

N/A

0.267406s

bin/sh/t_ulimit

0.197080s

limits

Passed

N/A

0.196232s

bin/sh/t_varquote

0.391970s

all

Passed

N/A

0.111505s

default_assignment_with_arith

Passed

N/A

0.150655s

nested_quotes_multiword

Passed

N/A

0.127047s

bin/sh/t_varval

-3349.807239s

aaa

Passed

N/A

0.298075s

assignment

Passed

N/A

1.066548s

cmdline

Passed

N/A

1.118594s

read

Passed

N/A

1.142506s

redirect

Passed

N/A

-3352.077078s

bin/sh/t_wait

21.758361s

basic_wait

Passed

N/A

6.263620s

individual

Passed

N/A

3.127220s

jobs

Passed

N/A

7.179821s

kill

Passed

N/A

5.183910s

bin/sleep/t_sleep

2.166416s

fraction

Passed

N/A

0.822131s

hex

Passed

N/A

1.139505s

nonnumeric

Passed

N/A

0.202482s

bin/tar/t_tar

0.231834s

append

Passed

N/A

0.230397s

dev/cgd/t_cgd_3des

0.393295s

cgd_3des_cbc_192_encblkno1

Passed

N/A

0.310990s

cgd_3des_cbc_192_encblkno8

Passed

N/A

0.081049s

dev/cgd/t_cgd_aes

0.663565s

cgd_aes_cbc_128_encblkno1

Passed

N/A

0.083814s

cgd_aes_cbc_128_encblkno8

Passed

N/A

0.084678s

cgd_aes_cbc_192_encblkno1

Passed

N/A

0.085339s

cgd_aes_cbc_192_encblkno8

Passed

N/A

0.080191s

cgd_aes_cbc_256_encblkno1

Passed

N/A

0.080385s

cgd_aes_cbc_256_encblkno8

Passed

N/A

0.084437s

cgd_aes_xts_256

Passed

N/A

0.079178s

cgd_aes_xts_512

Passed

N/A

0.080021s

dev/cgd/t_cgd_blowfish

0.490411s

cgd_bf_cbc_128_encblkno1

Passed

N/A

0.083432s

cgd_bf_cbc_128_encblkno8

Passed

N/A

0.080164s

cgd_bf_cbc_256_encblkno1

Passed

N/A

0.080480s

cgd_bf_cbc_256_encblkno8

Passed

N/A

0.080231s

cgd_bf_cbc_448_encblkno1

Passed

N/A

0.076765s

cgd_bf_cbc_448_encblkno8

Passed

N/A

0.085102s

dev/cgd/t_cgd

2.941262s

basic

Passed

N/A

0.649325s

unaligned_write

Passed

N/A

1.639073s

wrongpass

Passed

N/A

0.649783s

dev/clock_subr/t_clock_subr

0.027063s

secs_to_ymdhms

Passed

N/A

0.012462s

ymdhms_to_secs

Passed

N/A

0.013354s

dev/fss/t_fss

0.507685s

basic

Passed

N/A

0.503352s

dev/raidframe/t_raid

19.709594s

raid1_comp0fail

Passed

N/A

3.765014s

raid1_compfail

Passed

N/A

3.808204s

raid1_normal

Passed

N/A

3.769221s

raid5_compfail

Passed

N/A

3.825283s

raid5_normal

Passed

N/A

3.794760s

smalldisk

Passed

N/A

0.425703s

dev/audio/t_pad

0.990042s

pad_output

Failed

atf-check failed; see the output of the test for details

0.989103s

dev/md/t_md

0.513794s

basic

Passed

N/A

0.512574s

dev/scsipi/t_cd

0.095347s

noisyeject

Passed

N/A

0.094310s

dev/sysmon/t_swwdog

5.510636s

disarm

Passed

N/A

2.496010s

panic

Passed

N/A

1.513012s

reboot

Passed

N/A

1.493100s

dev/sysmon/t_swsensor

121.377959s

alarm_sensor

Passed

N/A

28.452740s

entropy_interrupt_sensor

Passed

N/A

16.860954s

entropy_polled_sensor

Passed

N/A

32.248530s

limit_sensor

Passed

N/A

27.041912s

simple_sensor

Passed

N/A

16.765701s

dev/usb/t_hid

0.094623s

khid

Passed

N/A

0.046208s

khid_parse_just_pop

Passed

N/A

0.046725s

games/t_factor

0.725929s

loop1

Passed

N/A

0.227317s

loop2

Passed

N/A

0.179214s

overflow1

Passed

N/A

0.160798s

overflow2

Passed

N/A

0.155148s

include/machine/t_bswap

0.078065s

bswap16_basic

Passed

N/A

0.012693s

bswap16_unconst

Passed

N/A

0.013192s

bswap32_basic

Passed

N/A

0.011614s

bswap32_unconst

Passed

N/A

0.011478s

bswap64_basic

Passed

N/A

0.012913s

bswap64_unconst

Passed

N/A

0.012040s

include/sys/t_bitops

0.087239s

bitmap_basic

Passed

N/A

0.014070s

fast_divide32

Passed

N/A

0.014544s

ffsfls

Passed

N/A

0.012893s

ilog2_32bit

Passed

N/A

0.013954s

ilog2_64bit

Passed

N/A

0.013004s

ilog2_const

Passed

N/A

0.013984s

include/sys/t_bootblock

0.026896s

mbr_partition

Passed

N/A

0.013101s

mbr_sector

Passed

N/A

0.012448s

include/sys/t_cdefs

0.103690s

sissigned

Passed

N/A

0.012182s

stypefit

Passed

N/A

0.012793s

stypemask

Passed

N/A

0.012359s

stypeminmax

Passed

N/A

0.012042s

uissigned

Passed

N/A

0.012645s

utypefit

Passed

N/A

0.011719s

utypemask

Passed

N/A

0.012956s

utypeminmax

Passed

N/A

0.011733s

include/sys/t_pslist

0.012845s

misc

Passed

N/A

0.012065s

include/sys/t_tree

0.500678s

tree_rbstress

Passed

N/A

0.500039s

include/sys/t_types

0.038603s

types_limits

Passed

N/A

0.012041s

types_signed

Passed

N/A

0.013026s

types_unsigned

Passed

N/A

0.011444s

include/sys/t_socket

0.244573s

cmsg_sendfd

Passed

N/A

0.082225s

cmsg_sendfd_bounds

Passed

N/A

0.077549s

sock_cloexec

Passed

N/A

0.082690s

include/t_bitstring

0.215173s

bits_27

Passed

N/A

0.032743s

bits_32

Passed

N/A

0.033875s

bits_49

Passed

N/A

0.036439s

bits_64

Passed

N/A

0.037003s

bits_67

Passed

N/A

0.037267s

bits_8

Passed

N/A

0.032281s

include/t_errno

0.014859s

errno_constants

Expected failure

PR standards/44921: 2 checks failed as expected; see output for more details

0.014241s

include/t_glob

0.013129s

glob_types

Passed

N/A

0.012522s

include/t_inttypes

0.013669s

int_fmtio

Passed

N/A

0.013011s

include/t_limits

0.039133s

char

Passed

N/A

0.011952s

posix

Passed

N/A

0.012467s

short

Passed

N/A

0.012789s

include/t_netdb

0.014082s

netdb_constants

Expected failure

PR standards/44777: 2 checks failed as expected; see output for more details

0.013111s

include/t_paths

0.012974s

paths

Skipped

PR port-sparc/45580

0.012272s

include/t_stdint

0.025865s

int16

Passed

N/A

0.013067s

int8

Passed

N/A

0.011463s

kernel/kqueue/read/t_fifo

0.012994s

fifo

Passed

N/A

0.012185s

kernel/kqueue/read/t_file

6.072612s

file

Passed

N/A

6.071572s

kernel/kqueue/read/t_file2

0.013710s

file2

Passed

N/A

0.012556s

kernel/kqueue/read/t_pipe

0.012944s

pipe

Passed

N/A

0.012281s

kernel/kqueue/read/t_ttypty

2.039528s

master

Passed

N/A

1.018856s

slave

Passed

N/A

1.019206s

kernel/kqueue/write/t_fifo

0.017288s

fifo

Passed

N/A

0.016473s

kernel/kqueue/write/t_pipe

0.097718s

pipe1

Passed

N/A

0.068184s

pipe2

Passed

N/A

0.015719s

pipe3

Passed

N/A

0.011705s

kernel/kqueue/write/t_ttypty

2.042237s

master

Passed

N/A

1.021636s

slave

Passed

N/A

1.019329s

kernel/kqueue/t_ioctl

0.027564s

kfilter_byfilter

Passed

N/A

0.014020s

kfilter_byname

Passed

N/A

0.012204s

kernel/kqueue/t_proc1

2.026086s

proc1

Passed

N/A

2.025380s

kernel/kqueue/t_proc2

2.019152s

proc2

Passed

N/A

2.018261s

kernel/kqueue/t_proc3

0.014384s

proc3

Passed

N/A

0.013707s

kernel/kqueue/t_sig

12.073103s

sig

Passed

N/A

12.072473s

kernel/kqueue/t_vnode

0.474210s

dir_no_note_link_create_file_in

Passed

N/A

0.025314s

dir_no_note_link_delete_file_in

Passed

N/A

0.025820s

dir_no_note_link_mv_dir_within

Passed

N/A

0.025531s

dir_no_note_link_mv_file_within

Passed

N/A

0.025329s

dir_note_link_create_dir_in

Passed

N/A

0.026050s

dir_note_link_delete_dir_in

Passed

N/A

0.026255s

dir_note_link_mv_dir_in

Passed

N/A

0.025384s

dir_note_link_mv_dir_out

Passed

N/A

0.024958s

dir_note_write_create_dir_in

Passed

N/A

0.025334s

dir_note_write_create_file_in

Passed

N/A

0.025463s

dir_note_write_delete_dir_in

Passed

N/A

0.026322s

dir_note_write_delete_file_in

Passed

N/A

0.025669s

dir_note_write_mv_dir_in

Passed

N/A

0.025759s

dir_note_write_mv_dir_out

Passed

N/A

0.025432s

dir_note_write_mv_dir_within

Passed

N/A

0.025339s

dir_note_write_mv_file_in

Passed

N/A

0.025966s

dir_note_write_mv_file_out

Passed

N/A

0.026505s

dir_note_write_mv_file_within

Passed

N/A

0.025901s

kernel/tty/t_pr

0.203372s

client_first

Passed

N/A

0.064621s

master_first

Passed

N/A

0.068432s

ptyioctl

Passed

N/A

0.068201s

kernel/t_lock

1.007013s

lock

Passed

N/A

1.006303s

kernel/t_lockf

61.054151s

deadlock

Passed

N/A

1.014632s

randlock

Passed

N/A

60.037621s

kernel/t_ptrace

0.074240s

attach_chroot

Passed

N/A

0.015452s

attach_pid0

Passed

N/A

0.013189s

attach_pid1

Passed

N/A

0.015361s

attach_pid1_securelevel

Skipped

Test must be run with securelevel >= 1

0.012582s

attach_self

Passed

N/A

0.013205s

kernel/t_ptrace_wait

0.988475s

attach3

Passed

N/A

0.019019s

attach4

Passed

N/A

0.019469s

eventmask1

Passed

N/A

0.020022s

eventmask2

Passed

N/A

0.020451s

fork2

Passed

N/A

0.022204s

fpregs1

Passed

N/A

0.019855s

fpregs2

Failed

/usr/src/tests/kernel/t_ptrace_wait.c:3894: ptrace(PT_SETFPREGS, child, &r, 0) != -1 not met

0.019861s

io_read_d1

Passed

N/A

0.018597s

io_read_d2

Passed

N/A

0.018501s

io_read_d3

Passed

N/A

0.019029s

io_read_d4

Passed

N/A

0.020161s

io_read_d_write_d_handshake1

Passed

N/A

0.018281s

io_read_d_write_d_handshake2

Passed

N/A

0.020468s

io_read_i1

Passed

N/A

0.018096s

io_read_i2

Passed

N/A

0.020537s

io_read_i3

Passed

N/A

0.017940s

io_read_i4

Passed

N/A

0.020441s

io_write_d1

Passed

N/A

0.018006s

io_write_d2

Passed

N/A

0.020169s

io_write_d3

Passed

N/A

0.017741s

io_write_d4

Passed

N/A

0.019538s

kill1

Passed

N/A

0.019708s

kill2

Passed

N/A

0.022028s

lwpinfo1

Passed

N/A

0.019978s

read_d1

Passed

N/A

0.019668s

read_d2

Passed

N/A

0.019674s

read_d3

Passed

N/A

0.019753s

read_d4

Passed

N/A

0.019912s

read_d_write_d_handshake1

Passed

N/A

0.020044s

read_d_write_d_handshake2

Passed

N/A

0.019790s

read_i1

Passed

N/A

0.019467s

read_i2

Passed

N/A

0.019789s

read_i3

Passed

N/A

0.019649s

read_i4

Passed

N/A

0.019249s

regs1

Passed

N/A

0.020367s

regs2

Passed

N/A

0.018136s

regs3

Passed

N/A

0.020845s

regs4

Passed

N/A

0.018209s

regs5

Passed

N/A

0.020671s

traceme1

Passed

N/A

0.019895s

traceme2

Passed

N/A

0.021104s

traceme3

Passed

N/A

0.018839s

traceme4

Passed

N/A

0.023195s

vfork2

Passed

N/A

0.020215s

write_d1

Passed

N/A

0.020247s

write_d2

Passed

N/A

0.019793s

write_d3

Passed

N/A

0.020784s

write_d4

Passed

N/A

0.019594s

kernel/t_ptrace_wait3

1.017154s

attach3

Passed

N/A

0.020173s

attach4

Passed

N/A

0.019953s

eventmask1

Passed

N/A

0.019640s

eventmask2

Passed

N/A

0.019456s

fork2

Passed

N/A

0.024736s

fpregs1

Passed

N/A

0.017949s

fpregs2

Failed

/usr/src/tests/kernel/t_ptrace_wait.c:3894: ptrace(PT_SETFPREGS, child, &r, 0) != -1 not met

0.021023s

io_read_d1

Passed

N/A

0.018398s

io_read_d2

Passed

N/A

0.020530s

io_read_d3

Passed

N/A

0.017959s

io_read_d4

Passed

N/A

0.020353s

io_read_d_write_d_handshake1

Passed

N/A

0.018821s

io_read_d_write_d_handshake2

Passed

N/A

0.019072s

io_read_i1

Passed

N/A

0.020314s

io_read_i2

Passed

N/A

0.020251s

io_read_i3

Passed

N/A

0.022222s

io_read_i4

Passed

N/A

0.020152s

io_write_d1

Passed

N/A

0.020541s

io_write_d2

Passed

N/A

0.021522s

io_write_d3

Passed

N/A

0.018187s

io_write_d4

Passed

N/A

0.021346s

kill1

Passed

N/A

0.019048s

kill2

Passed

N/A

0.020063s

lwpinfo1

Passed

N/A

0.022791s

read_d1

Passed

N/A

0.019725s

read_d2

Passed

N/A

0.020729s

read_d3

Passed

N/A

0.020185s

read_d4

Passed

N/A

0.019720s

read_d_write_d_handshake1

Passed

N/A

0.020727s

read_d_write_d_handshake2

Passed

N/A

0.018177s

read_i1

Passed

N/A

0.020587s

read_i2

Passed

N/A

0.018221s

read_i3

Passed

N/A

0.021312s

read_i4

Passed

N/A

0.018982s

regs1

Passed

N/A

0.022382s

regs2

Passed

N/A

0.020406s

regs3

Passed

N/A

0.021881s

regs4

Passed

N/A

0.019257s

regs5

Passed

N/A

0.020319s

traceme1

Passed

N/A

0.021256s

traceme2

Passed

N/A

0.019579s

traceme3

Passed

N/A

0.021776s

traceme4

Passed

N/A

0.020314s

vfork2

Passed

N/A

0.021793s

write_d1

Passed

N/A

0.018931s

write_d2

Passed

N/A

0.021411s

write_d3

Passed

N/A

0.018499s

write_d4

Passed

N/A

0.023331s

kernel/t_ptrace_wait4

1.226303s

attach1

Passed

N/A

0.020963s

attach2

Passed

N/A

0.023246s

attach3

Passed

N/A

0.021251s

attach4

Passed

N/A

0.019870s

attach5

Passed

N/A

0.020937s

attach6

Passed

N/A

0.022178s

attach7

Passed

N/A

0.021802s

eventmask1

Passed

N/A

0.020776s

eventmask2

Passed

N/A

0.019789s

fork1

Failed

/usr/src/tests/kernel/t_ptrace_wait.h:295: Reported exited process

0.021472s

fork2

Passed

N/A

0.024251s

fpregs1

Passed

N/A

0.019956s

fpregs2

Failed

/usr/src/tests/kernel/t_ptrace_wait.c:3894: ptrace(PT_SETFPREGS, child, &r, 0) != -1 not met

0.020703s

io_read_d1

Passed

N/A

0.019501s

io_read_d2

Passed

N/A

0.021353s

io_read_d3

Passed

N/A

0.020787s

io_read_d4

Passed

N/A

0.021786s

io_read_d_write_d_handshake1

Passed

N/A

0.021124s

io_read_d_write_d_handshake2

Passed

N/A

0.021130s

io_read_i1

Passed

N/A

0.018565s

io_read_i2

Passed

N/A

0.020831s

io_read_i3

Passed

N/A

0.018372s

io_read_i4

Passed

N/A

0.021539s

io_write_d1

Passed

N/A

0.019079s

io_write_d2

Passed

N/A

0.023068s

io_write_d3

Passed

N/A

0.020816s

io_write_d4

Passed

N/A

0.021043s

kill1

Passed

N/A

0.018502s

kill2

Passed

N/A

0.020916s

lwpinfo1

Passed

N/A

0.018404s

lwpinfo2

Passed

N/A

0.023770s

read_d1

Passed

N/A

0.019314s

read_d2

Passed

N/A

0.021604s

read_d3

Passed

N/A

0.020993s

read_d4

Passed

N/A

0.021325s

read_d_write_d_handshake1

Passed

N/A

0.018681s

read_d_write_d_handshake2

Passed

N/A

0.021738s

read_i1

Passed

N/A

0.019670s

read_i2

Passed

N/A

0.023058s

read_i3

Passed

N/A

0.020861s

read_i4

Passed

N/A

0.019211s

regs1

Passed

N/A

0.023205s

regs2

Passed

N/A

0.019749s

regs3

Passed

N/A

0.022643s

regs4

Passed

N/A

0.020963s

regs5

Passed

N/A

0.018629s

traceme1

Passed

N/A

0.020972s

traceme2

Passed

N/A

0.020980s

traceme3

Passed

N/A

0.022419s

traceme4

Passed

N/A

0.022155s

vfork1

Expected failure

PR kern/51630: /usr/src/tests/kernel/t_ptrace_wait.h:305: WSTOPSIG(status) != expected: Unexpected stop signal received [Child exited] != [Trace/BPT trap]

0.021627s

vfork2

Passed

N/A

0.021836s

write_d1

Passed

N/A

0.021328s

write_d2

Passed

N/A

0.021673s

write_d3

Passed

N/A

0.021173s

write_d4

Passed

N/A

0.021738s

kernel/t_ptrace_wait6

1.230549s

attach1

Passed

N/A

0.021690s

attach2

Passed

N/A

0.020807s

attach3

Passed

N/A

0.019236s

attach4

Passed

N/A

0.019440s

attach5

Passed

N/A

0.021627s

attach6

Passed

N/A

0.022881s

attach7

Passed

N/A

0.021305s

eventmask1

Passed

N/A

0.022079s

eventmask2

Passed

N/A

0.020308s

fork1

Failed

/usr/src/tests/kernel/t_ptrace_wait.h:295: Reported exited process

0.023892s

fork2

Passed

N/A

0.021691s

fpregs1

Passed

N/A

0.022470s

fpregs2

Failed

/usr/src/tests/kernel/t_ptrace_wait.c:3894: ptrace(PT_SETFPREGS, child, &r, 0) != -1 not met

0.019967s

io_read_d1

Passed

N/A

0.018951s

io_read_d2

Passed

N/A

0.020778s

io_read_d3

Passed

N/A

0.019901s

io_read_d4

Passed

N/A

0.020871s

io_read_d_write_d_handshake1

Passed

N/A

0.019305s

io_read_d_write_d_handshake2

Passed

N/A

0.022650s

io_read_i1

Passed

N/A

0.020427s

io_read_i2

Passed

N/A

0.020944s

io_read_i3

Passed

N/A

0.021134s

io_read_i4

Passed

N/A

0.021173s

io_write_d1

Passed

N/A

0.022329s

io_write_d2

Passed

N/A

0.021161s

io_write_d3

Passed

N/A

0.021090s

io_write_d4

Passed

N/A

0.018554s

kill1

Passed

N/A

0.022736s

kill2

Passed

N/A

0.019283s

lwpinfo1

Passed

N/A

0.023127s

lwpinfo2

Passed

N/A

0.021107s

read_d1

Passed

N/A

0.020413s

read_d2

Passed

N/A

0.021815s

read_d3

Passed

N/A

0.020053s

read_d4

Passed

N/A

0.023491s

read_d_write_d_handshake1

Passed

N/A

0.021065s

read_d_write_d_handshake2

Passed

N/A

0.019012s

read_i1

Passed

N/A

0.022065s

read_i2

Passed

N/A

0.020002s

read_i3

Passed

N/A

0.023341s

read_i4

Passed

N/A

0.020382s

regs1

Passed

N/A

0.020493s

regs2

Passed

N/A

0.021536s

regs3

Passed

N/A

0.023254s

regs4

Passed

N/A

0.021272s

regs5

Passed

N/A

0.018305s

traceme1

Passed

N/A

0.021422s

traceme2

Passed

N/A

0.018663s

traceme3

Passed

N/A

0.021618s

traceme4

Passed

N/A

0.020545s

vfork1

Expected failure

PR kern/51630: /usr/src/tests/kernel/t_ptrace_wait.h:305: WSTOPSIG(status) != expected: Unexpected stop signal received [Child exited] != [Trace/BPT trap]

0.023626s

vfork2

Passed

N/A

0.019788s

write_d1

Passed

N/A

0.019788s

write_d2

Passed

N/A

0.020566s

write_d3

Passed

N/A

0.021706s

write_d4

Passed

N/A

0.021928s

kernel/t_ptrace_waitid

301.206123s

attach1

Passed

N/A

0.035395s

attach2

Passed

N/A

0.024554s

attach3

Passed

N/A

0.018765s

attach4

Passed

N/A

0.019551s

attach5

Passed

N/A

0.031789s

attach6

Passed

N/A

0.038876s

attach7

Passed

N/A

0.039657s

eventmask1

Passed

N/A

0.019915s

eventmask2

Passed

N/A

0.019667s

fork1

Failed

/usr/src/tests/kernel/t_ptrace_wait.c:1152: ptrace(PT_GET_PROCESS_STATE, child2, &state, slen) != -1 not met

0.022433s

fork2

Passed

N/A

0.020709s

fpregs1

Passed

N/A

0.019597s

fpregs2

Failed

/usr/src/tests/kernel/t_ptrace_wait.c:3894: ptrace(PT_SETFPREGS, child, &r, 0) != -1 not met

0.019958s

io_read_d1

Passed

N/A

0.018561s

io_read_d2

Passed

N/A

0.018469s

io_read_d3

Passed

N/A

0.019691s

io_read_d4

Passed

N/A

0.019963s

io_read_d_write_d_handshake1

Passed

N/A

0.017952s

io_read_d_write_d_handshake2

Passed

N/A

0.019956s

io_read_i1

Passed

N/A

0.017680s

io_read_i2

Passed

N/A

0.019899s

io_read_i3

Passed

N/A

0.019796s

io_read_i4

Passed

N/A

0.017777s

io_write_d1

Passed

N/A

0.020685s

io_write_d2

Passed

N/A

0.019817s

io_write_d3

Passed

N/A

0.017893s

io_write_d4

Passed

N/A

0.019666s

kill1

Passed

N/A

0.019696s

kill2

Passed

N/A

0.019769s

lwpinfo1

Passed

N/A

0.017686s

lwpinfo2

Passed

N/A

0.023882s

read_d1

Passed

N/A

0.017754s

read_d2

Passed

N/A

0.022346s

read_d3

Passed

N/A

0.019209s

read_d4

Passed

N/A

0.019153s

read_d_write_d_handshake1

Passed

N/A

0.019324s

read_d_write_d_handshake2

Passed

N/A

0.019507s

read_i1

Passed

N/A

0.022626s

read_i2

Passed

N/A

0.017987s

read_i3

Passed

N/A

0.021772s

read_i4

Passed

N/A

0.019072s

regs1

Passed

N/A

0.022211s

regs2

Passed

N/A

0.019998s

regs3

Passed

N/A

0.019393s

regs4

Passed

N/A

0.020983s

regs5

Passed

N/A

0.018305s

traceme1

Passed

N/A

0.020150s

traceme2

Passed

N/A

0.018279s

traceme3

Passed

N/A

0.019961s

traceme4

Passed

N/A

0.019219s

vfork1

Failed

Test case timed out after 300 seconds

300.007141s

vfork2

Passed

N/A

0.018398s

write_d1

Passed

N/A

0.018602s

write_d2

Passed

N/A

0.019838s

write_d3

Passed

N/A

0.017967s

write_d4

Passed

N/A

0.019387s

kernel/t_ptrace_waitpid

1.264028s

attach1

Passed

N/A

0.019817s

attach2

Passed

N/A

0.039023s

attach3

Passed

N/A

0.021425s

attach4

Passed

N/A

0.019430s

attach5

Passed

N/A

0.036418s

attach6

Passed

N/A

0.021308s

attach7

Passed

N/A

0.036374s

eventmask1

Passed

N/A

0.019538s

eventmask2

Passed

N/A

0.020400s

fork1

Failed

/usr/src/tests/kernel/t_ptrace_wait.h:295: Reported exited process

0.022888s

fork2

Passed

N/A

0.022230s

fpregs1

Passed

N/A

0.020213s

fpregs2

Failed

/usr/src/tests/kernel/t_ptrace_wait.c:3894: ptrace(PT_SETFPREGS, child, &r, 0) != -1 not met

0.022549s

io_read_d1

Passed

N/A

0.019795s

io_read_d2

Passed

N/A

0.021207s

io_read_d3

Passed

N/A

0.020674s

io_read_d4

Passed

N/A

0.019811s

io_read_d_write_d_handshake1

Passed

N/A

0.021220s

io_read_d_write_d_handshake2

Passed

N/A

0.019848s

io_read_i1

Passed

N/A

0.021759s

io_read_i2

Passed

N/A

0.019218s

io_read_i3

Passed

N/A

0.019538s

io_read_i4

Passed

N/A

0.022242s

io_write_d1

Passed

N/A

0.020217s

io_write_d2

Passed

N/A

0.021036s

io_write_d3

Passed

N/A

0.021444s

io_write_d4

Passed

N/A

0.020247s

kill1

Passed

N/A

0.021464s

kill2

Passed

N/A

0.019766s

lwpinfo1

Passed

N/A

0.018126s

lwpinfo2

Passed

N/A

0.020444s

read_d1

Passed

N/A

0.021442s

read_d2

Passed

N/A

0.020297s

read_d3

Passed

N/A

0.022997s

read_d4

Passed

N/A

0.020117s

read_d_write_d_handshake1

Passed

N/A

0.022059s

read_d_write_d_handshake2

Passed

N/A

0.018735s

read_i1

Passed

N/A

0.020367s

read_i2

Passed

N/A

0.023243s

read_i3

Passed

N/A

0.021454s

read_i4

Passed

N/A

0.020070s

regs1

Passed

N/A

0.018488s

regs2

Passed

N/A

0.019602s

regs3

Passed

N/A

0.020785s

regs4

Passed

N/A

0.019573s

regs5

Passed

N/A

0.021451s

traceme1

Passed

N/A

0.019351s

traceme2

Passed

N/A

0.022683s

traceme3

Passed

N/A

0.020279s

traceme4

Passed

N/A

0.022238s

vfork1

Expected failure

PR kern/51630: /usr/src/tests/kernel/t_ptrace_wait.h:305: WSTOPSIG(status) != expected: Unexpected stop signal received [Child exited] != [Trace/BPT trap]

0.020432s

vfork2

Passed

N/A

0.023684s

write_d1

Passed

N/A

0.021310s

write_d2

Passed

N/A

0.021067s

write_d3

Passed

N/A

0.021045s

write_d4

Passed

N/A

0.020807s

kernel/t_pty

6.065226s

pty_no_queue

Passed

N/A

3.034609s

pty_queue

Passed

N/A

3.029326s

kernel/t_mqueue

0.014045s

mqueue

Passed

N/A

0.013063s

kernel/t_sysv

1.110011s

msg

Passed

N/A

0.032559s

sem

Passed

N/A

1.045832s

shm

Passed

N/A

0.029074s

kernel/t_subr_prf

0.051928s

snprintf_count

Passed

N/A

0.011918s

snprintf_count_overflow

Passed

N/A

0.011557s

snprintf_print

Passed

N/A

0.012688s

snprintf_print_overflow

Passed

N/A

0.012978s

kernel/t_kauth_pr_47598

1.246744s

kauth_curtain

Passed

N/A

1.246124s

kernel/t_sysctl

0.017113s

bufsize

Passed

N/A

0.016281s

kernel/t_extattrctl

0.062613s

extattrctl_namei

Passed

N/A

0.062008s

kernel/t_filedesc

54.364420s

getfilerace

Passed

N/A

54.363760s

kernel/t_rnd

0.207011s

RNDADDDATA

Passed

N/A

0.069577s

RNDADDDATA2

Passed

N/A

0.064748s

read_random

Passed

N/A

0.070647s

kernel/t_extent

0.151002s

bound1

Passed

N/A

0.013754s

bound2

Passed

N/A

0.012367s

bound3

Passed

N/A

0.013846s

bound4

Passed

N/A

0.012158s

bound5

Passed

N/A

0.013685s

coalesce

Passed

N/A

0.013384s

free

Passed

N/A

0.012261s

subregion1

Passed

N/A

0.013764s

subregion2

Passed

N/A

0.012326s

subregion3

Passed

N/A

0.013425s

subregion4

Passed

N/A

0.012706s

kernel/t_umount

0.842859s

umount

Passed

N/A

0.837562s

kernel/t_umountstress

2.882415s

fileop

Passed

N/A

0.990309s

mountlist

Passed

N/A

1.881564s

kernel/t_ps_strings

0.251452s

update

Passed

N/A

0.122724s

validate

Passed

N/A

0.127446s

lib/csu/t_crt0

0.675834s

initfini1

Passed

N/A

0.148101s

initfini2

Passed

N/A

0.167684s

initfini3

Passed

N/A

0.191606s

initfini4

Passed

N/A

0.164874s

lib/libbluetooth/t_bluetooth

0.028178s

check_bt_aton

Passed

N/A

0.012954s

check_bt_ntoa

Passed

N/A

0.013773s

lib/libbluetooth/t_sdp_data

0.036336s

check_sdp_data_size

Passed

N/A

0.021234s

check_sdp_data_type

Passed

N/A

0.013713s

lib/libbluetooth/t_sdp_get

0.144746s

check_sdp_get_alt

Passed

N/A

0.013466s

check_sdp_get_attr

Passed

N/A

0.014649s

check_sdp_get_bool

Passed

N/A

0.014014s

check_sdp_get_data

Passed

N/A

0.013735s

check_sdp_get_int

Passed

N/A

0.013529s

check_sdp_get_seq

Passed

N/A

0.013760s

check_sdp_get_str

Passed

N/A

0.012621s

check_sdp_get_uint

Passed

N/A

0.013370s

check_sdp_get_url

Passed

N/A

0.013667s

check_sdp_get_uuid

Passed

N/A

0.014913s

lib/libbluetooth/t_sdp_match

0.013232s

check_sdp_match_uuid16

Passed

N/A

0.012536s

lib/libbluetooth/t_sdp_put

0.301369s

check_sdp_put_alt

Passed

N/A

0.013349s

check_sdp_put_attr

Passed

N/A

0.014219s

check_sdp_put_bool

Passed

N/A

0.013166s

check_sdp_put_data

Passed

N/A

0.013885s

check_sdp_put_int

Passed

N/A

0.013236s

check_sdp_put_int16

Passed

N/A

0.013867s

check_sdp_put_int32

Passed

N/A

0.014128s

check_sdp_put_int64

Passed

N/A

0.014536s

check_sdp_put_int8

Passed

N/A

0.012957s

check_sdp_put_seq

Passed

N/A

0.014092s

check_sdp_put_str

Passed

N/A

0.013330s

check_sdp_put_uint

Passed

N/A

0.014253s

check_sdp_put_uint16

Passed

N/A

0.012681s

check_sdp_put_uint32

Passed

N/A

0.014188s

check_sdp_put_uint64

Passed

N/A

0.013959s

check_sdp_put_uint8

Passed

N/A

0.012611s

check_sdp_put_url

Passed

N/A

0.014078s

check_sdp_put_uuid

Passed

N/A

0.012688s

check_sdp_put_uuid128

Passed

N/A

0.014722s

check_sdp_put_uuid16

Passed

N/A

0.012941s

check_sdp_put_uuid32

Passed

N/A

0.014196s

lib/libbluetooth/t_sdp_set

0.068634s

check_sdp_set_alt

Passed

N/A

0.012239s

check_sdp_set_bool

Passed

N/A

0.012116s

check_sdp_set_int

Passed

N/A

0.013623s

check_sdp_set_seq

Passed

N/A

0.012774s

check_sdp_set_uint

Passed

N/A

0.014379s

lib/libc/c063/t_faccessat

0.096763s

faccessat_fd

Passed

N/A

0.013514s

faccessat_fdcwd

Passed

N/A

0.011841s

faccessat_fdcwderr

Passed

N/A

0.013178s

faccessat_fderr1

Passed

N/A

0.011849s

faccessat_fderr2

Passed

N/A

0.013401s

faccessat_fderr3

Passed

N/A

0.012597s

faccessat_fdlink

Passed

N/A

0.013279s

lib/libc/c063/t_fchmodat

0.096305s

fchmodat_fd

Passed

N/A

0.013349s

fchmodat_fdcwd

Passed

N/A

0.012185s

fchmodat_fdcwderr

Passed

N/A

0.013198s

fchmodat_fderr1

Passed

N/A

0.012948s

fchmodat_fderr2

Passed

N/A

0.011871s

fchmodat_fderr3

Passed

N/A

0.012467s

fchmodat_fdlink

Passed

N/A

0.013274s

lib/libc/c063/t_fchownat

0.105890s

fchownat_fd

Passed

N/A

0.015006s

fchownat_fdcwd

Passed

N/A

0.013214s

fchownat_fdcwderr

Passed

N/A

0.013577s

fchownat_fderr1

Passed

N/A

0.014531s

fchownat_fderr2

Passed

N/A

0.013770s

fchownat_fderr3

Passed

N/A

0.014467s

fchownat_fdlink

Passed

N/A

0.014539s

lib/libc/c063/t_fexecve

0.018781s

fexecve

Expected failure

fexecve not implemented: /usr/src/tests/lib/libc/c063/t_fexecve.c:85: access("test", F_OK) == 0 not met

0.018124s

lib/libc/c063/t_fstatat

0.095533s

fstatat_fd

Passed

N/A

0.012472s

fstatat_fdcwd

Passed

N/A

0.013074s

fstatat_fdcwderr

Passed

N/A

0.011849s

fstatat_fderr1

Passed

N/A

0.013491s

fstatat_fderr2

Passed

N/A

0.011826s

fstatat_fderr3

Passed

N/A

0.013150s

fstatat_fdlink

Passed

N/A

0.011928s

lib/libc/c063/t_linkat

0.086441s

linkat_fd

Passed

N/A

0.013019s

linkat_fdcwd

Passed

N/A

0.011886s

linkat_fdcwderr

Passed

N/A

0.013006s

linkat_fderr

Passed

N/A

0.012211s

linkat_fdlink1

Passed

N/A

0.013131s

linkat_fdlink2

Passed

N/A

0.013629s

lib/libc/c063/t_mkdirat

0.054332s

mkdirat_fd

Passed

N/A

0.011863s

mkdirat_fdcwd

Passed

N/A

0.013086s

mkdirat_fdcwderr

Passed

N/A

0.011996s

mkdirat_fderr

Passed

N/A

0.013056s

lib/libc/c063/t_mkfifoat

0.054227s

mkfifoat_fd

Passed

N/A

0.012639s

mkfifoat_fdcwd

Passed

N/A

0.012893s

mkfifoat_fdcwderr

Passed

N/A

0.012853s

mkfifoat_fderr

Passed

N/A

0.011759s

lib/libc/c063/t_mknodat

0.053949s

mknodat_fd

Passed

N/A

0.011961s

mknodat_fdcwd

Passed

N/A

0.013228s

mknodat_fdcwderr

Passed

N/A

0.011831s

mknodat_fderr

Passed

N/A

0.013075s

lib/libc/c063/t_o_search

0.044705s

o_search_notdir

Passed

N/A

0.013356s

o_search_perm1

Passed

N/A

0.013201s

o_search_perm2

Passed

N/A

0.014465s

lib/libc/c063/t_openat

0.082883s

openat_fd

Passed

N/A

0.013789s

openat_fdcwd

Passed

N/A

0.011874s

openat_fdcwderr

Passed

N/A

0.013313s

openat_fderr1

Passed

N/A

0.012013s

openat_fderr2

Passed

N/A

0.013427s

openat_fderr3

Passed

N/A

0.011703s

lib/libc/c063/t_readlinkat

0.068566s

readlinkat_fd

Passed

N/A

0.012434s

readlinkat_fdcwd

Passed

N/A

0.013504s

readlinkat_fdcwderr

Passed

N/A

0.011768s

readlinkat_fderr1

Passed

N/A

0.013705s

readlinkat_fderr2

Passed

N/A

0.011920s

lib/libc/c063/t_renameat

0.055126s

renameat_fd

Passed

N/A

0.012333s

renameat_fdcwd

Passed

N/A

0.013501s

renameat_fdcwderr

Passed

N/A

0.011828s

renameat_fderr

Passed

N/A

0.011903s

lib/libc/c063/t_symlinkat

0.057221s

symlinkat_fd

Passed

N/A

0.013327s

symlinkat_fdcwd

Passed

N/A

0.012997s

symlinkat_fdcwderr

Passed

N/A

0.013095s

symlinkat_fderr

Passed

N/A

0.011631s

lib/libc/c063/t_unlinkat

0.094835s

unlinkat_dir

Passed

N/A

0.013102s

unlinkat_fd

Passed

N/A

0.013460s

unlinkat_fdcwd

Passed

N/A

0.011885s

unlinkat_fdcwderr

Passed

N/A

0.013768s

unlinkat_fderr1

Passed

N/A

0.012063s

unlinkat_fderr2

Passed

N/A

0.011745s

unlinkat_fderr3

Passed

N/A

0.012206s

lib/libc/c063/t_utimensat

0.096879s

utimensat_fd

Passed

N/A

0.012418s

utimensat_fdcwd

Passed

N/A

0.012982s

utimensat_fdcwderr

Passed

N/A

0.013310s

utimensat_fderr1

Passed

N/A

0.011768s

utimensat_fderr2

Passed

N/A

0.013105s

utimensat_fderr3

Passed

N/A

0.012458s

utimensat_fdlink

Passed

N/A

0.013088s

lib/libc/db/t_db_hash_seq

0.062620s

test_hash_del_all

Passed

N/A

0.016337s

test_hash_del_alt

Passed

N/A

0.015284s

test_hash_del_every_7

Passed

N/A

0.013807s

test_hash_del_none

Passed

N/A

0.014745s

lib/libc/db/t_db

326.976409s

alternate_recno

Passed

N/A

0.269367s

big_btree

Passed

N/A

0.944544s

big_hash

Passed

N/A

0.385812s

big_recno

Passed

N/A

0.796842s

bsize_ffactor

Passed

N/A

35.354932s

bsize_torture

Passed

N/A

249.289875s

btree_byteswap_unaligned_access_bksd

Passed

N/A

0.204562s

btree_byteswap_unaligned_access_skbd

Passed

N/A

0.208543s

btree_known_byte_order

Passed

N/A

0.290446s

btree_recursive_traversal

Passed

N/A

2.391544s

btree_tricky_page_split

Passed

N/A

0.438288s

btree_weird_page_split

Passed

N/A

29.285216s

byte_orders_btree

Passed

N/A

0.331042s

byte_orders_hash

Passed

N/A

0.331444s

cursor_flags_btree

Passed

N/A

0.273408s

cursor_flags_recno

Passed

N/A

0.274872s

delete_btree

Passed

N/A

0.244650s

delete_recno

Passed

N/A

0.238847s

duplicate_btree

Passed

N/A

0.217774s

four_char_hash

Passed

N/A

0.158706s

medium_btree

Passed

N/A

0.194399s

medium_hash

Passed

N/A

0.186561s

medium_recno

Passed

N/A

0.185423s

random_recno

Passed

N/A

0.302803s

repeated_btree

Passed

N/A

0.218194s

repeated_hash

Passed

N/A

0.234228s

reverse_order_recno

Passed

N/A

0.218251s

reverse_recno

Passed

N/A

0.264871s

small_btree

Passed

N/A

0.191571s

small_hash

Passed

N/A

0.188004s

small_page_btree

Passed

N/A

2.601112s

small_recno

Passed

N/A

0.184467s

lib/libc/gen/exect/t_exect

0.013091s

t_exect_null

Skipped

exect(3) misdesigned and hangs - PR port-amd64/51700

0.012478s

lib/libc/gen/execve/t_execve

0.012363s

t_execve_null

Passed

N/A

0.011738s

lib/libc/gen/posix_spawn/t_spawn

0.110556s

t_spawn_child

Passed

N/A

0.033499s

t_spawn_ls

Passed

N/A

0.014217s

t_spawn_missing

Passed

N/A

0.011894s

t_spawn_nonexec

Passed

N/A

0.016997s

t_spawn_zero

Passed

N/A

0.016177s

t_spawnp_ls

Passed

N/A

0.013767s

lib/libc/gen/posix_spawn/t_fileactions

0.113997s

t_spawn_empty_fileactions

Passed

N/A

0.018570s

t_spawn_fileactions

Passed

N/A

0.019048s

t_spawn_open_nonexistent

Passed

N/A

0.012476s

t_spawn_open_nonexistent_diag

Passed

N/A

0.013509s

t_spawn_openmode

Passed

N/A

0.028777s

t_spawn_reopen

Passed

N/A

0.017448s

lib/libc/gen/posix_spawn/t_spawnattr

0.021094s

t_spawnattr

Passed

N/A

0.020545s

lib/libc/gen/t_alarm

1.048951s

alarm_basic

Passed

N/A

1.019255s

alarm_fork

Passed

N/A

0.014883s

alarm_previous

Passed

N/A

0.012952s

lib/libc/gen/t_assert

0.034766s

assert_false

Passed

N/A

0.014031s

assert_true

Passed

N/A

0.018289s

lib/libc/gen/t_basedirname

0.026504s

basename_posix

Passed

N/A

0.012028s

dirname_posix

Passed

N/A

0.013271s

lib/libc/gen/t_closefrom

0.077443s

closefrom_basic

Passed

N/A

0.024418s

closefrom_buffer

Passed

N/A

0.024313s

closefrom_err

Passed

N/A

0.012909s

closefrom_one

Passed

N/A

0.013523s

lib/libc/gen/t_cpuset

0.038699s

cpuset_err

Passed

N/A

0.013282s

cpuset_set

Passed

N/A

0.011393s

cpuset_size

Passed

N/A

0.012144s

lib/libc/gen/t_dir

0.048618s

seekdir_basic

Passed

N/A

0.012187s

telldir_leak

Passed

N/A

0.034315s

lib/libc/gen/t_floatunditf

0.013610s

floatunditf

Passed

N/A

0.013013s

lib/libc/gen/t_fmtcheck

0.013775s

fmtcheck_basic

Passed

N/A

0.013242s

lib/libc/gen/t_fnmatch

0.093364s

fnmatch_backslashes

Passed

N/A

0.013280s

fnmatch_casefold

Passed

N/A

0.013385s

fnmatch_initialbracket

Passed

N/A

0.011581s

fnmatch_leadingdir

Passed

N/A

0.012776s

fnmatch_noescape

Passed

N/A

0.012804s

fnmatch_pathname

Passed

N/A

0.011775s

fnmatch_period

Passed

N/A

0.012747s

lib/libc/gen/t_fpclassify

0.029244s

fpclassify_double

Passed

N/A

0.013746s

fpclassify_float

Passed

N/A

0.014376s

lib/libc/gen/t_fpsetmask

0.092092s

fpsetmask_basic

Passed

N/A

0.013205s

fpsetmask_masked_double

Passed

N/A

0.012699s

fpsetmask_masked_float

Passed

N/A

0.011567s

fpsetmask_masked_long_double

Passed

N/A

0.013179s

fpsetmask_unmasked_double

Passed

N/A

0.011815s

fpsetmask_unmasked_float

Passed

N/A

0.013289s

fpsetmask_unmasked_long_double

Passed

N/A

0.011771s

lib/libc/gen/t_fpsetround

0.015191s

fpsetround_basic

Passed

N/A

0.014454s

lib/libc/gen/t_ftok

0.038435s

ftok_err

Passed

N/A

0.012910s

ftok_link

Passed

N/A

0.023991s

lib/libc/gen/t_getcwd

1.455984s

getcwd_err

Passed

N/A

0.012669s

getcwd_fts

Passed

N/A

1.441882s

lib/libc/gen/t_getgrent

0.148445s

getgrent_loop

Passed

N/A

0.017286s

getgrent_setgid

Passed

N/A

0.130015s

lib/libc/gen/t_glob

0.026872s

glob_star

Passed

N/A

0.013686s

glob_star_not

Passed

N/A

0.011708s

lib/libc/gen/t_humanize_number

0.026468s

humanize_number_basic

Passed

N/A

0.012129s

humanize_number_big

Passed

N/A

0.013165s

lib/libc/gen/t_isnan

0.026082s

isinf_basic

Passed

N/A

0.013039s

isnan_basic

Passed

N/A

0.011525s

lib/libc/gen/t_nice

0.109731s

nice_err

Passed

N/A

0.016525s

nice_priority

Passed

N/A

0.061904s

nice_root

Passed

N/A

0.013134s

nice_thread

Passed

N/A

0.015526s

lib/libc/gen/t_pause

3.049581s

pause_basic

Passed

N/A

1.018977s

pause_kill

Passed

N/A

2.029385s

lib/libc/gen/t_raise

1.258640s

raise_err

Passed

N/A

0.012056s

raise_ret

Passed

N/A

1.013754s

raise_sig

Passed

N/A

0.109363s

raise_stress

Passed

N/A

0.121047s

lib/libc/gen/t_randomid

0.379434s

randomid_basic

Passed

N/A

0.378906s

lib/libc/gen/t_realpath

0.040940s

realpath_basic

Passed

N/A

0.013620s

realpath_huge

Passed

N/A

0.011589s

realpath_symlink

Passed

N/A

0.013577s

lib/libc/gen/t_setdomainname

0.077820s

setdomainname_basic

Passed

N/A

0.024952s

setdomainname_limit

Passed

N/A

0.023826s

setdomainname_perm

Passed

N/A

0.027015s

lib/libc/gen/t_sethostname

0.075376s

sethostname_basic

Passed

N/A

0.023663s

sethostname_limit

Passed

N/A

0.023611s

sethostname_perm

Passed

N/A

0.026189s

lib/libc/gen/t_siginfo

3.148241s

sigalarm

Passed

N/A

1.021611s

sigbus_adraln

Passed

N/A

0.015532s

sigchild_dump

Passed

N/A

1.024692s

sigchild_kill

Passed

N/A

0.016189s

sigchild_normal

Passed

N/A

1.017550s

sigfpe_flt

Passed

N/A

0.015853s

sigfpe_int

Passed

N/A

0.013945s

sigsegv

Passed

N/A

0.016161s

lib/libc/gen/t_sleep

166.029667s

kevent

Passed

N/A

26.598008s

nanosleep

Passed

N/A

36.789635s

poll

Passed

N/A

36.789449s

select

Passed

N/A

36.789352s

sleep

Passed

N/A

29.059489s

lib/libc/gen/t_syslog

0.016355s

syslog_pthread

Passed

N/A

0.015784s

lib/libc/gen/t_time

10.136478s

time_copy

Passed

N/A

0.013490s

time_mono

Passed

N/A

10.107264s

time_timeofday

Passed

N/A

0.013461s

lib/libc/gen/t_ttyname

0.057065s

ttyname_err

Passed

N/A

0.014831s

ttyname_r_err

Passed

N/A

0.014557s

ttyname_r_stdin

Passed

N/A

0.013493s

ttyname_stdin

Passed

N/A

0.011596s

lib/libc/gen/t_vis

0.095172s

strunvis_hex

Passed

N/A

0.012203s

strvis_basic

Passed

N/A

0.015679s

strvis_empty

Passed

N/A

0.011975s

strvis_locale

Passed

N/A

0.039208s

strvis_null

Passed

N/A

0.013001s

lib/libc/hash/t_sha2

0.042646s

t_sha256

Passed

N/A

0.014120s

t_sha384

Passed

N/A

0.013515s

t_sha512

Passed

N/A

0.013299s

lib/libc/hash/t_hmac

3.003041s

t_hmac

Passed

N/A

3.002376s

lib/libc/hash/t_hash

1.426571s

md5

Passed

N/A

0.167659s

sha1

Passed

N/A

1.257727s

lib/libc/inet/t_inet_addr

0.028171s

inet_addr_basic

Passed

N/A

0.014180s

inet_addr_err

Passed

N/A

0.012782s

lib/libc/inet/t_inet_network

0.025075s

inet_network_basic

Passed

N/A

0.012012s

inet_network_err

Passed

N/A

0.011566s

lib/libc/locale/t_mbrtowc

0.130132s

mbrtowc_internal

Passed

N/A

0.110833s

mbrtowc_object

Passed

N/A

0.018227s

lib/libc/locale/t_mbstowcs

0.027148s

mbstowcs_basic

Passed

N/A

0.026637s

lib/libc/locale/t_mbsnrtowcs

0.015024s

mbsnrtowcs

Passed

N/A

0.014393s

lib/libc/locale/t_mbtowc

0.123658s

mbtowc

Passed

N/A

0.123123s

lib/libc/locale/t_wcscspn

0.012508s

wcscspn

Passed

N/A

0.011873s

lib/libc/locale/t_wcspbrk

0.012648s

wcspbrk

Passed

N/A

0.012005s

lib/libc/locale/t_wcsspn

0.013056s

wcsspn

Passed

N/A

0.012472s

lib/libc/locale/t_wcstod

0.160008s

wcstod

Passed

N/A

0.159515s

lib/libc/locale/t_wctomb

0.047477s

wcrtomb

Passed

N/A

0.013815s

wcrtomb_state

Passed

N/A

0.016699s

wctomb

Passed

N/A

0.014675s

lib/libc/locale/t_io

0.088739s

bad_big5_getwc

Passed

N/A

0.013737s

bad_big5_swprintf

Passed

N/A

0.014706s

bad_big5_wprintf

Passed

N/A

0.013343s

good_big5_getwc

Passed

N/A

0.014787s

good_big5_swprintf

Passed

N/A

0.013037s

good_big5_wprintf

Passed

N/A

0.014849s

lib/libc/net/getaddrinfo/t_getaddrinfo

1.184595s

basic

Passed

N/A

0.236006s

empty_hostname

Passed

N/A

0.217889s

empty_servname

Passed

N/A

0.161475s

scopeaddr

Passed

N/A

0.122977s

sock_raw

Passed

N/A

0.167221s

specific

Passed

N/A

0.155363s

unsupported_family

Passed

N/A

0.117663s

lib/libc/net/t_getprotoent

0.109272s

endprotoent_rewind

Passed

N/A

0.012990s

getprotobyname_basic

Passed

N/A

0.015263s

getprotobyname_err

Passed

N/A

0.019721s

getprotobynumber_basic

Passed

N/A

0.015637s

getprotobynumber_err

Passed

N/A

0.015135s

getprotoent_next

Passed

N/A

0.013830s

setprotoent_rewind

Passed

N/A

0.012351s

lib/libc/net/t_ether_aton

0.012298s

tc_ether_aton

Passed

N/A

0.011496s

lib/libc/net/t_nsdispatch

0.141816s

recurse

Passed

N/A

0.141041s

lib/libc/net/t_protoent

0.155421s

protoent

Passed

N/A

0.154455s

lib/libc/net/t_servent

1.431453s

servent

Passed

N/A

1.428006s

lib/libc/net/t_hostent

4.328836s

dnsbyaddrlookup4

Passed

N/A

0.494942s

dnsbyaddrlookup6

Passed

N/A

0.461575s

dnsbynamelookup4

Passed

N/A

0.455956s

dnsbynamelookup6

Passed

N/A

0.461998s

gethostbyaddr4

Passed

N/A

0.466198s

gethostbyaddr6

Passed

N/A

0.464524s

gethostbyname4

Passed

N/A

0.474660s

gethostbyname6

Passed

N/A

0.470214s

hostsbyaddrlookup4

Passed

N/A

0.140725s

hostsbyaddrlookup6

Passed

N/A

0.143802s

hostsbynamelookup4

Passed

N/A

0.143288s

hostsbynamelookup6

Passed

N/A

0.139311s

lib/libc/regex/t_regex_att

0.152287s

basic

Passed

N/A

0.041994s

categorization

Passed

N/A

0.015850s

forcedassoc

Passed

N/A

0.021656s

leftassoc

Expected failure

Reason for breakage unknown: /usr/src/tests/lib/libc/regex/t_regex_att.c:377: res != matches ((0,4)(0,2)(2,3)(3,4) != (0,4)(0,1)(1,4)(4,4)): at line 3

0.013375s

nullsubexpr

Passed

N/A

0.016147s

repetition

Passed

N/A

0.023624s

rightassoc

Passed

N/A

0.014580s

lib/libc/regex/t_exhaust

0.418923s

regcomp_too_big

Passed

N/A

0.418314s

lib/libc/regex/t_regex

4.469340s

anchor

Passed

N/A

0.235665s

backref

Passed

N/A

0.218144s

basic

Passed

N/A

0.209509s

bracket

Passed

N/A

0.251224s

c_comments

Passed

N/A

0.225837s

complex

Passed

N/A

0.225268s

error

Passed

N/A

0.234113s

meta

Passed

N/A

0.227557s

nospec

Passed

N/A

0.222106s

paren

Passed

N/A

0.228303s

regress

Passed

N/A

0.221089s

repet_bounded

Passed

N/A

0.280376s

repet_multi

Passed

N/A

0.357084s

repet_ordinary

Passed

N/A

0.224445s

startend

Passed

N/A

0.215184s

subexp

Passed

N/A

0.223361s

subtle

Passed

N/A

0.222950s

word_bound

Passed

N/A

0.217117s

zero

Passed

N/A

0.218422s

lib/libc/rpc/t_xdr

0.012948s

xdr

Passed

N/A

0.012298s

lib/libc/rpc/t_rpc

4.213650s

get_svc_addr_tcp

Passed

N/A

0.030367s

get_svc_addr_udp

Passed

N/A

0.022987s

raw

Passed

N/A

0.016706s

tcp

Passed

N/A

1.031262s

tcp_poll

Passed

N/A

1.038916s

udp

Passed

N/A

1.038372s

udp_poll

Passed

N/A

1.029542s

lib/libc/setjmp/t_setjmp

0.052197s

_setjmp

Passed

N/A

0.011776s

setjmp

Passed

N/A

0.011677s

sigsetjmp_nosave

Passed

N/A

0.012712s

sigsetjmp_save

Passed

N/A

0.013198s

lib/libc/setjmp/t_threadjmp

0.056469s

_setjmp

Passed

N/A

0.013904s

setjmp

Passed

N/A

0.013146s

sigsetjmp_nosave

Passed

N/A

0.013539s

sigsetjmp_save

Passed

N/A

0.013027s

lib/libc/stdlib/t_abs

0.051265s

abs_basic

Passed

N/A

0.011821s

imaxabs_basic

Passed

N/A

0.012800s

labs_basic

Passed

N/A

0.012520s

llabs_basic

Passed

N/A

0.011532s

lib/libc/stdlib/t_atoi

0.051157s

atof_strtod

Passed

N/A

0.012433s

atoi_strtol

Passed

N/A

0.011468s

atol_strtol

Passed

N/A

0.012772s

atoll_strtoll

Passed

N/A

0.012020s

lib/libc/stdlib/t_div

0.038457s

div_basic

Passed

N/A

0.013369s

ldiv_basic

Passed

N/A

0.011633s

lldiv_basic

Passed

N/A

0.011521s

lib/libc/stdlib/t_getenv

17.874056s

clearenv_basic

Passed

N/A

0.064405s

getenv_basic

Passed

N/A

0.012773s

putenv_basic

Passed

N/A

0.014165s

setenv_basic

Passed

N/A

17.765503s

setenv_mixed

Passed

N/A

0.013677s

lib/libc/stdlib/t_getenv_thread

39.070604s

getenv_r_thread

Passed

N/A

9.070091s

putenv_thread

Passed

N/A

9.999214s

setenv_thread

Passed

N/A

9.999463s

unsetenv_thread

Passed

N/A

9.999185s

lib/libc/stdlib/t_exit

0.087933s

exit_atexit

Passed

N/A

0.015926s

exit_basic

Passed

N/A

0.015835s

exit_status

Passed

N/A

0.036802s

exit_tmpfile

Passed

N/A

0.016832s

lib/libc/stdlib/t_hsearch

0.104512s

hsearch_basic

Passed

N/A

0.012988s

hsearch_duplicate

Passed

N/A

0.011848s

hsearch_nonexistent

Passed

N/A

0.013051s

hsearch_r_basic

Passed

N/A

0.011900s

hsearch_r_duplicate

Passed

N/A

0.011774s

hsearch_r_nonexistent

Passed

N/A

0.013134s

hsearch_r_two

Passed

N/A

0.011706s

hsearch_two

Passed

N/A

0.012796s

lib/libc/stdlib/t_mi_vector_hash

0.013152s

mi_vector_hash_basic

Passed

N/A

0.012548s

lib/libc/stdlib/t_posix_memalign

0.027577s

aligned_alloc_basic

Passed

N/A

0.013691s

posix_memalign_basic

Passed

N/A

0.012856s

lib/libc/stdlib/t_random

0.014251s

random_same

Passed

N/A

0.013616s

lib/libc/stdlib/t_strtod

0.160348s

strtod_basic

Passed

N/A

0.017705s

strtod_gherman_bug

Passed

N/A

0.013137s

strtod_hex

Passed

N/A

0.014722s

strtod_inf

Passed

N/A

0.012946s

strtod_nan

Passed

N/A

0.012848s

strtod_round

Passed

N/A

0.014416s

strtod_underflow

Passed

N/A

0.012939s

strtof_inf

Passed

N/A

0.013234s

strtof_nan

Passed

N/A

0.014229s

strtold_inf

Passed

N/A

0.014462s

strtold_nan

Passed

N/A

0.012858s

lib/libc/stdlib/t_strtol

0.051433s

strtol_base

Passed

N/A

0.012186s

strtol_case

Passed

N/A

0.012690s

strtol_range

Passed

N/A

0.011716s

strtol_signed

Passed

N/A

0.012474s

lib/libc/stdlib/t_strtoi

0.052040s

strtoi_base

Passed

N/A

0.012195s

strtoi_case

Passed

N/A

0.012840s

strtoi_range

Passed

N/A

0.012769s

strtoi_signed

Passed

N/A

0.011718s

lib/libc/stdlib/t_system

0.072914s

system_basic

Passed

N/A

0.072354s

lib/libc/stdlib/t_atexit

0.128364s

atexit

Passed

N/A

0.127311s

lib/libc/stdlib/t_getopt

0.883281s

getopt

Passed

N/A

0.463185s

getopt_long

Passed

N/A

0.418865s

lib/libc/stdio/t_clearerr

0.035977s

clearerr_basic

Passed

N/A

0.021260s

clearerr_err

Passed

N/A

0.013318s

lib/libc/stdio/t_fflush

0.074723s

fflush_err

Passed

N/A

0.024623s

fflush_seek

Passed

N/A

0.024290s

fpurge_err

Passed

N/A

0.024010s

lib/libc/stdio/t_fmemopen

0.429845s

test00

Passed

N/A

0.012831s

test01

Passed

N/A

0.013576s

test02

Passed

N/A

0.013077s

test03

Passed

N/A

0.013597s

test04

Passed

N/A

0.013801s

test05

Passed

N/A

0.012138s

test06

Passed

N/A

0.013253s

test07

Passed

N/A

0.013691s

test08

Passed

N/A

0.012365s

test09

Passed

N/A

0.028997s

test10

Passed

N/A

0.024316s

test11

Passed

N/A

0.022353s

test12

Passed

N/A

0.017863s

test13

Passed

N/A

0.019041s

test14

Passed

N/A

0.017233s

test15

Passed

N/A

0.021262s

test16

Passed

N/A

0.014896s

test17

Passed

N/A

0.016099s

test18

Passed

N/A

0.014277s

test19

Passed

N/A

0.027515s

test20

Passed

N/A

0.014460s

test21

Passed

N/A

0.018687s

test22

Passed

N/A

0.039197s

lib/libc/stdio/t_fopen

0.232587s

fdopen_close

Passed

N/A

0.024261s

fdopen_err

Passed

N/A

0.026616s

fdopen_seek

Passed

N/A

0.024809s

fopen_append

Passed

N/A

0.025203s

fopen_err

Passed

N/A

0.024599s

fopen_mode

Passed

N/A

0.024999s

fopen_perm

Passed

N/A

0.015128s

fopen_regular

Passed

N/A

0.012056s

fopen_seek

Passed

N/A

0.024714s

freopen_std

Passed

N/A

0.023727s

lib/libc/stdio/t_open_memstream

0.012827s

test_open_memstream

Passed

N/A

0.012205s

lib/libc/stdio/t_fputc

0.149718s

fputc_basic

Passed

N/A

0.024515s

fputc_err

Passed

N/A

0.024327s

putc_basic

Passed

N/A

0.024517s

putc_err

Passed

N/A

0.024145s

putc_unlocked_basic

Passed

N/A

0.024493s

putc_unlocked_err

Passed

N/A

0.024000s

lib/libc/stdio/t_mktemp

0.014003s

mktemp_not_exist

Passed

N/A

0.013238s

lib/libc/stdio/t_popen

0.176972s

popen_zeropad

Passed

N/A

0.176344s

lib/libc/stdio/t_printf

0.572708s

snprintf_c99

Passed

N/A

0.012269s

snprintf_dotzero

Passed

N/A

0.013714s

snprintf_float

Passed

N/A

0.491246s

snprintf_posarg

Passed

N/A

0.012987s

snprintf_posarg_error

Passed

N/A

0.013461s

snprintf_posarg_width

Passed

N/A

0.011910s

sprintf_zeropad

Passed

N/A

0.013063s

lib/libc/stdio/t_scanf

0.027048s

sscanf_neghex

Passed

N/A

0.013246s

sscanf_whitespace

Passed

N/A

0.012511s

lib/libc/string/t_bm

0.014070s

bm

Passed

N/A

0.013451s

lib/libc/string/t_memchr

0.038617s

memchr_basic

Passed

N/A

0.012134s

memchr_simple

Passed

N/A

0.012983s

memrchr_simple

Passed

N/A

0.011409s

lib/libc/string/t_memcpy

3.216805s

memccpy_simple

Passed

N/A

0.011589s

memcpy_basic

Passed

N/A

3.191154s

memcpy_return

Passed

N/A

0.012122s

lib/libc/string/t_memmem

0.012443s

memmem_basic

Passed

N/A

0.011844s

lib/libc/string/t_memset

0.096090s

bzero_zero_size

Passed

N/A

0.012090s

memset_array

Passed

N/A

0.013255s

memset_basic

Passed

N/A

0.012382s

memset_nonzero

Passed

N/A

0.016942s

memset_return

Passed

N/A

0.012537s

memset_struct

Passed

N/A

0.012898s

memset_zero_size

Passed

N/A

0.011746s

lib/libc/string/t_popcount

0.026907s

popcount_basic

Skipped

config variable "run_popcount" not set to YES/TRUE

0.013349s

popcountll_basic

Skipped

config variable "run_popcount" not set to YES/TRUE

0.011881s

lib/libc/string/t_strcat

0.059297s

strcat_basic

Passed

N/A

0.045256s

strncat_simple

Passed

N/A

0.012739s

lib/libc/string/t_strchr

0.013822s

strchr_basic

Passed

N/A

0.013225s

lib/libc/string/t_strcmp

0.026960s

strcmp_basic

Passed

N/A

0.012487s

strcmp_simple

Passed

N/A

0.012909s

lib/libc/string/t_strcpy

0.013159s

strcpy_basic

Passed

N/A

0.012500s

lib/libc/string/t_strcspn

0.012490s

strcspn

Passed

N/A

0.011856s

lib/libc/string/t_strerror

0.107623s

strerror_basic

Passed

N/A

0.040031s

strerror_err

Passed

N/A

0.012470s

strerror_r_basic

Passed

N/A

0.039848s

strerror_r_err

Passed

N/A

0.012684s

lib/libc/string/t_stresep

0.013879s

stresep_basic

Passed

N/A

0.013315s

lib/libc/string/t_strlen

0.432969s

strlen_basic

Passed

N/A

0.013453s

strlen_huge

Passed

N/A

0.405710s

strnlen_basic

Passed

N/A

0.011681s

lib/libc/string/t_strpbrk

0.012733s

strpbrk

Passed

N/A

0.012167s

lib/libc/string/t_strrchr

0.014190s

strrchr_basic

Passed

N/A

0.013396s

lib/libc/string/t_strspn

0.013717s

strspn

Passed

N/A

0.013126s

lib/libc/string/t_swab

0.013657s

swab_basic

Passed

N/A

0.013061s

lib/libc/sys/t_access

0.093094s

access_access

Passed

N/A

0.026682s

access_fault

Passed

N/A

0.011717s

access_inval

Passed

N/A

0.012746s

access_notdir

Passed

N/A

0.011723s

access_notexist

Passed

N/A

0.013833s

access_toolong

Passed

N/A

0.012029s

lib/libc/sys/t_bind

0.013308s

bind_foreign_family

Passed

N/A

0.012403s

lib/libc/sys/t_chroot

0.092971s

chroot_basic

Passed

N/A

0.015453s

chroot_err

Passed

N/A

0.011605s

chroot_perm

Passed

N/A

0.016919s

fchroot_basic

Passed

N/A

0.015129s

fchroot_err

Passed

N/A

0.013447s

fchroot_perm

Passed

N/A

0.015493s

lib/libc/sys/t_clock_gettime

17.291400s

clock_gettime_real

Passed

N/A

17.291352s

lib/libc/sys/t_clock_nanosleep

0.012965s

clock_nanosleep_remain

Passed

N/A

0.012346s

lib/libc/sys/t_clone

0.059654s

clone_basic

Passed

N/A

0.013089s

clone_null_func

Passed

N/A

0.013073s

clone_null_stack

Passed

N/A

0.012803s

clone_out_of_proc

Passed

N/A

0.015887s

lib/libc/sys/t_connect

0.027197s

connect_foreign_family

Passed

N/A

0.013585s

connect_low_port

Passed

N/A

0.012170s

lib/libc/sys/t_dup

0.185958s

dup2_basic

Passed

N/A

0.012256s

dup2_err

Passed

N/A

0.012002s

dup2_max

Passed

N/A

0.013241s

dup2_mode

Passed

N/A

0.025387s

dup3_err

Passed

N/A

0.013070s

dup3_max

Passed

N/A

0.012352s

dup3_mode

Passed

N/A

0.025970s

dup_err

Passed

N/A

0.012992s

dup_max

Passed

N/A

0.026159s

dup_mode

Passed

N/A

0.026138s

lib/libc/sys/t_fsync

0.028072s

fsync_err

Passed

N/A

0.012074s

fsync_sync

Passed

N/A

0.014380s

lib/libc/sys/t_getcontext

0.038641s

getcontext_err

Passed

N/A

0.012614s

setcontext_err

Passed

N/A

0.011643s

setcontext_link

Passed

N/A

0.012760s

lib/libc/sys/t_getgroups

0.064678s

getgroups_err

Passed

N/A

0.012453s

getgroups_getgid

Passed

N/A

0.013118s

getgroups_setgid

Passed

N/A

0.025170s

getgroups_zero

Passed

N/A

0.011569s

lib/libc/sys/t_getitimer

0.078868s

getitimer_empty

Passed

N/A

0.013675s

getitimer_err

Passed

N/A

0.011787s

setitimer_basic

Passed

N/A

0.025327s

setitimer_err

Passed

N/A

0.012982s

setitimer_old

Passed

N/A

0.011996s

lib/libc/sys/t_getlogin

0.075516s

getlogin_r_err

Passed

N/A

0.012063s

getlogin_same

Passed

N/A

0.012733s

setlogin_basic

Passed

N/A

0.015436s

setlogin_err

Passed

N/A

0.013983s

setlogin_perm

Passed

N/A

0.017264s

lib/libc/sys/t_getpid

0.050178s

getpid_process

Passed

N/A

0.035247s

getpid_thread

Passed

N/A

0.013835s

lib/libc/sys/t_getrusage

9.232301s

getrusage_err

Passed

N/A

0.013444s

getrusage_sig

Passed

N/A

0.012855s

getrusage_utime_back

Expected failure

PR kern/30115: anticipated error did not occur

9.189723s

getrusage_utime_zero

Expected failure

PR kern/30115: zero user time from getrusage(2)

0.013712s

lib/libc/sys/t_getsid

0.042080s

getsid_current

Passed

N/A

0.013115s

getsid_err

Passed

N/A

0.012452s

getsid_process

Passed

N/A

0.014503s

lib/libc/sys/t_getsockname

0.014341s

getsockname_unix

Passed

N/A

0.013298s

lib/libc/sys/t_gettimeofday

0.025924s

gettimeofday_err

Passed

N/A

0.011722s

gettimeofday_mono

Passed

N/A

0.013051s

lib/libc/sys/t_issetugid

0.065430s

issetugid_egid

Passed

N/A

0.017005s

issetugid_euid

Passed

N/A

0.015056s

issetugid_rgid

Passed

N/A

0.015352s

issetugid_ruid

Passed

N/A

0.015525s

lib/libc/sys/t_kevent

0.103287s

kevent_zerotimer

Passed

N/A

0.016939s

kqueue_desc_passing

Skipped

PR kern/46523

0.016622s

kqueue_unsupported_fd

Passed

N/A

0.067758s

lib/libc/sys/t_kill

1.086560s

kill_basic

Passed

N/A

0.015232s

kill_err

Passed

N/A

0.013670s

kill_perm

Passed

N/A

1.021644s

kill_pgrp_neg

Passed

N/A

0.016457s

kill_pgrp_zero

Passed

N/A

0.016015s

lib/libc/sys/t_link

0.089361s

link_count

Passed

N/A

0.024889s

link_err

Passed

N/A

0.024272s

link_perm

Passed

N/A

0.013344s

link_stat

Passed

N/A

0.024248s

lib/libc/sys/t_listen

0.038118s

listen_err

Passed

N/A

0.023318s

listen_low_port

Passed

N/A

0.013492s

lib/libc/sys/t_lwp_ctl

0.030755s

lwpctl_counter

Passed

N/A

0.030067s

lib/libc/sys/t_lwp_create

0.079571s

lwp_create_generic_fail_no_uc_cpu

Passed

N/A

0.012237s

lwp_create_sparc_fail_npc_null

Passed

N/A

0.012147s

lwp_create_sparc_fail_npc_odd

Passed

N/A

0.013166s

lwp_create_sparc_fail_pc_null

Passed

N/A

0.011924s

lwp_create_sparc_fail_pc_odd

Passed

N/A

0.014082s

lwp_create_works

Passed

N/A

0.012016s

lib/libc/sys/t_minherit

0.076099s

minherit_bad

Passed

N/A

0.012802s

minherit_copy

Passed

N/A

0.015717s

minherit_none

Passed

N/A

0.015140s

minherit_share

Passed

N/A

0.014874s

minherit_zero

Passed

N/A

0.014477s

lib/libc/sys/t_mincore

0.121355s

mincore_err

Passed

N/A

0.011967s

mincore_resid

Passed

N/A

0.085188s

mincore_shmseg

Passed

N/A

0.022175s

lib/libc/sys/t_mkdir

1.085104s

mkdir_err

Passed

N/A

0.012605s

mkdir_mode

Passed

N/A

1.030053s

mkdir_perm

Passed

N/A

0.027085s

mkdir_trail

Passed

N/A

0.012068s

lib/libc/sys/t_mkfifo

2.127755s

mkfifo_block

Passed

N/A

1.024523s

mkfifo_err

Passed

N/A

0.024423s

mkfifo_nonblock

Passed

N/A

1.024916s

mkfifo_perm

Passed

N/A

0.026606s

mkfifo_stat

Passed

N/A

0.023505s

lib/libc/sys/t_mknod

0.102455s

mknod_err

Passed

N/A

0.022902s

mknod_exist

Passed

N/A

0.024415s

mknod_perm

Passed

N/A

0.028217s

mknod_stat

Passed

N/A

0.023941s

lib/libc/sys/t_mlock

0.073120s

mlock_clip

Passed

N/A

0.013352s

mlock_err

Passed

N/A

0.012126s

mlock_limits

Passed

N/A

0.018728s

mlock_mmap

Passed

N/A

0.013002s

mlock_nested

Passed

N/A

0.012450s

lib/libc/sys/t_mmap

0.186010s

mmap_block

Skipped

The test case causes a panic (PR kern/38889, kern/46592)

0.012335s

mmap_err

Passed

N/A

0.013080s

mmap_loan

Passed

N/A

0.026460s

mmap_prot_1

Passed

N/A

0.024412s

mmap_prot_2

Passed

N/A

0.014113s

mmap_prot_3

Passed

N/A

0.025374s

mmap_truncate

Passed

N/A

0.025096s

mmap_truncate_signal

Passed

N/A

0.026775s

mmap_va0

Passed

N/A

0.013102s

lib/libc/sys/t_mprotect

0.079700s

mprotect_access

Passed

N/A

0.023856s

mprotect_err

Passed

N/A

0.012841s

mprotect_exec

Skipped

Execute protection callback check not implemented

0.012811s

mprotect_pax

Failed

non-executable mapping made executable

0.013350s

mprotect_write

Passed

N/A

0.013678s

lib/libc/sys/t_msgctl

2.140252s

msgctl_err

Passed

N/A

0.024311s

msgctl_perm

Passed

N/A

0.027546s

msgctl_pid

Passed

N/A

2.035034s

msgctl_set

Passed

N/A

0.026076s

msgctl_time

Passed

N/A

0.024040s

lib/libc/sys/t_msgget

0.119698s

msgget_excl

Passed

N/A

0.023899s

msgget_exit

Passed

N/A

0.026855s

msgget_init

Passed

N/A

0.024157s

msgget_limit

Passed

N/A

0.016413s

msgget_mode

Passed

N/A

0.024883s

lib/libc/sys/t_msgrcv

4.166451s

msgrcv_basic

Passed

N/A

0.024279s

msgrcv_block

Passed

N/A

2.037474s

msgrcv_err

Passed

N/A

0.023997s

msgrcv_mtype

Passed

N/A

0.024906s

msgrcv_nonblock

Passed

N/A

2.027319s

msgrcv_truncate

Passed

N/A

0.024457s

lib/libc/sys/t_msgsnd

4.140838s

msgsnd_block

Passed

N/A

2.030961s

msgsnd_count

Passed

N/A

0.024444s

msgsnd_err

Passed

N/A

0.023585s

msgsnd_nonblock

Passed

N/A

2.029602s

msgsnd_perm

Passed

N/A

0.028927s

lib/libc/sys/t_msync

0.074046s

msync_async

Passed

N/A

0.016516s

msync_err

Passed

N/A

0.021147s

msync_invalidate

Passed

N/A

0.017627s

msync_sync

Passed

N/A

0.016447s

lib/libc/sys/t_nanosleep

1.222655s

nanosleep_basic

Passed

N/A

0.191361s

nanosleep_err

Passed

N/A

0.011820s

nanosleep_sig

Passed

N/A

1.017508s

lib/libc/sys/t_pipe

2.041770s

pipe_restart

Passed

N/A

2.041202s

lib/libc/sys/t_pipe2

0.085524s

pipe2_basic

Passed

N/A

0.012617s

pipe2_cloexec

Passed

N/A

0.011927s

pipe2_consume

Passed

N/A

0.013307s

pipe2_einval

Passed

N/A

0.011820s

pipe2_nonblock

Passed

N/A

0.012954s

pipe2_nosigpipe

Passed

N/A

0.019236s

lib/libc/sys/t_poll

11.105275s

poll_3way

Passed

N/A

10.020571s

poll_basic

Passed

N/A

0.026582s

poll_err

Passed

N/A

0.013161s

pollts_basic

Passed

N/A

1.015652s

pollts_err

Passed

N/A

0.012216s

pollts_sigmask

Passed

N/A

0.013398s

lib/libc/sys/t_posix_fallocate

0.013553s

ebadf

Passed

N/A

0.012879s

lib/libc/sys/t_recvmmsg

0.020875s

recvmmsg_basic

Passed

N/A

0.020341s

lib/libc/sys/t_revoke

0.069397s

revoke_basic

Passed

N/A

0.025352s

revoke_err

Passed

N/A

0.014601s

revoke_perm

Passed

N/A

0.026845s

lib/libc/sys/t_select

1.042376s

pselect_sigmask

Passed

N/A

1.026690s

pselect_timeout

Passed

N/A

0.014484s

lib/libc/sys/t_setrlimit

0.174095s

setrlimit_basic

Passed

N/A

0.012108s

setrlimit_current

Passed

N/A

0.013125s

setrlimit_err

Passed

N/A

0.012800s

setrlimit_fsize

Passed

N/A

0.025620s

setrlimit_memlock

Passed

N/A

0.013863s

setrlimit_nofile_1

Passed

N/A

0.014819s

setrlimit_nofile_2

Passed

N/A

0.015189s

setrlimit_nproc

Passed

N/A

0.015203s

setrlimit_nthr

Passed

N/A

0.013607s

setrlimit_perm

Passed

N/A

0.015080s

setrlimit_stack

Passed

N/A

0.014434s

lib/libc/sys/t_setuid

0.118749s

setuid_perm

Passed

N/A

0.014431s

setuid_real

Passed

N/A

0.011541s

setuid_root

Passed

N/A

0.090537s

lib/libc/sys/t_sigaction

0.044426s

sigaction_basic

Passed

N/A

0.013330s

sigaction_noflags

Passed

N/A

0.014147s

sigaction_resethand

Passed

N/A

0.015171s

lib/libc/sys/t_sigqueue

1.042292s

sigqueue_basic

Passed

N/A

0.011660s

sigqueue_err

Passed

N/A

0.012940s

sigqueue_rt

Passed

N/A

1.015783s

lib/libc/sys/t_sigtimedwait

10.048616s

sigtimedwait_NULL_timeout

Passed

N/A

5.017802s

sigtimedwait_all0timeout

Passed

N/A

0.013038s

sigtimedwait_small_timeout

Passed

N/A

5.015997s

lib/libc/sys/t_socketpair

0.038620s

socketpair_basic

Passed

N/A

0.012902s

socketpair_cloexec

Passed

N/A

0.011808s

socketpair_nonblock

Passed

N/A

0.011719s

lib/libc/sys/t_swapcontext

0.026813s

swapcontext1

Passed

N/A

0.013145s

swapcontext2

Passed

N/A

0.012302s

lib/libc/sys/t_stat

4.090768s

stat_chflags

Passed

N/A

0.024686s

stat_dir

Passed

N/A

0.910417s

stat_err

Passed

N/A

0.013733s

stat_mtime

Passed

N/A

3.047484s

stat_perm

Passed

N/A

0.024990s

stat_size

Passed

N/A

0.026507s

stat_socket

Passed

N/A

0.012279s

stat_symlink

Passed

N/A

0.025221s

lib/libc/sys/t_timer_create

6.090558s

timer_create_err

Passed

N/A

0.012590s

timer_create_mono

Passed

N/A

1.017307s

timer_create_mono_expire

Passed

N/A

2.019013s

timer_create_real

Passed

N/A

1.020234s

timer_create_real_expire

Passed

N/A

2.018400s

lib/libc/sys/t_truncate

0.081952s

ftruncate_basic

Passed

N/A

0.024768s

ftruncate_err

Passed

N/A

0.014803s

truncate_basic

Passed

N/A

0.024532s

truncate_err

Passed

N/A

0.015210s

lib/libc/sys/t_ucontext

0.013945s

ucontext_basic

Passed

N/A

0.013266s

lib/libc/sys/t_umask

0.091409s

umask_fork

Passed

N/A

0.041403s

umask_open

Passed

N/A

0.024688s

umask_previous

Passed

N/A

0.023497s

lib/libc/sys/t_unlink

0.140811s

unlink_basic

Passed

N/A

0.062551s

unlink_err

Passed

N/A

0.022719s

unlink_fifo

Passed

N/A

0.024359s

unlink_perm

Passed

N/A

0.027934s

lib/libc/sys/t_wait

0.102314s

wait6_coredumped

Passed

N/A

0.018115s

wait6_exited

Passed

N/A

0.016292s

wait6_invalid

Passed

N/A

0.012713s

wait6_stop_and_go

Passed

N/A

0.015259s

wait6_stopgo_loop

Passed

N/A

0.020165s

wait6_terminated

Passed

N/A

0.014517s

lib/libc/sys/t_wait_noproc

0.170312s

wait

Passed

N/A

0.012979s

wait3

Passed

N/A

0.013041s

wait3_options

Passed

N/A

0.015044s

wait4

Passed

N/A

0.012216s

wait4_options

Passed

N/A

0.017250s

wait6

Passed

N/A

0.013094s

wait6_options

Passed

N/A

0.015027s

waitid

Passed

N/A

0.013789s

waitid_options

Passed

N/A

0.018391s

waitpid

Passed

N/A

0.013280s

waitpid_options

Passed

N/A

0.017966s

lib/libc/sys/t_wait_noproc_wnohang

0.149172s

wait3

Passed

N/A

0.011920s

wait3_options

Passed

N/A

0.017620s

wait4

Passed

N/A

0.013027s

wait4_options

Passed

N/A

0.015596s

wait6

Passed

N/A

0.012186s

wait6_options

Passed

N/A

0.016850s

waitid

Passed

N/A

0.012319s

waitid_options

Passed

N/A

0.015916s

waitpid

Passed

N/A

0.012223s

waitpid_options

Passed

N/A

0.015036s

lib/libc/sys/t_write

0.101343s

write_err

Passed

N/A

0.024017s

write_pipe

Passed

N/A

0.012842s

write_pos

Passed

N/A

0.024838s

write_ret

Passed

N/A

0.024552s

writev_iovmax

Passed

N/A

0.011979s

lib/libc/sys/t_posix_fadvise

0.078433s

posix_fadvise

Passed

N/A

0.019974s

posix_fadvise_reg

Passed

N/A

0.057324s

lib/libc/termios/t_tcsetpgrp

0.014361s

tcsetpgrp_err

Passed

N/A

0.013619s

lib/libc/time/t_mktime

0.040878s

localtime_r_gmt

Passed

N/A

0.012532s

mktime_negyear

Passed

N/A

0.012703s

timegm_epoch

Passed

N/A

0.013732s

lib/libc/time/t_strptime

0.142139s

Zone

Passed

N/A

0.037652s

common

Passed

N/A

0.011935s

day

Passed

N/A

0.013131s

hour

Passed

N/A

0.011840s

month

Passed

N/A

0.013101s

seconds

Passed

N/A

0.011744s

year

Passed

N/A

0.013562s

zone

Passed

N/A

0.024142s

lib/libc/tls/t_tls_static

0.009365s

t_tls_static

Passed

N/A

0.008657s

lib/libc/tls/t_tls_dynamic

0.024671s

t_tls_dynamic

Passed

N/A

0.024070s

lib/libc/tls/t_tls_dlopen

0.034173s

t_tls_dlopen

Passed

N/A

0.033530s

lib/libc/ttyio/t_ptm

0.029122s

ptm

Passed

N/A

0.013573s

ptmx

Passed

N/A

0.014321s

lib/libc/ttyio/t_ttyio

2.022458s

ioctl

Passed

N/A

2.021543s

lib/libc/ssp/t_ssp

3.226587s

fgets

Passed

N/A

0.183540s

getcwd

Passed

N/A

0.165460s

gets

Passed

N/A

0.170595s

memcpy

Passed

N/A

0.163680s

memmove

Passed

N/A

0.159915s

memset

Passed

N/A

0.160629s

raw

Passed

N/A

0.159101s

read

Passed

N/A

0.169248s

readlink

Passed

N/A

0.157009s

snprintf

Passed

N/A

0.229834s

sprintf

Passed

N/A

0.177136s

stpcpy

Passed

N/A

0.162218s

stpncpy

Passed

N/A

0.157853s

strcat

Passed

N/A

0.165463s

strcpy

Passed

N/A

0.161853s

strncat

Passed

N/A

0.166719s

strncpy

Passed

N/A

0.154649s

vsnprintf

Passed

N/A

0.158423s

vsprintf

Passed

N/A

0.167768s

lib/libc/t_convfp

0.053148s

cast_ulong

Passed

N/A

0.012394s

cast_ulong2

Passed

N/A

0.012903s

conv_uint

Passed

N/A

0.013397s

conv_ulong

Passed

N/A

0.011669s

lib/libc/t_gdtoa

0.021199s

long_format

Passed

N/A

0.020289s

lib/libc/t_cdb

0.114956s

cdb

Passed

N/A

0.114290s

lib/libcrypt/t_crypt

0.025035s

crypt_salts

Passed

N/A

0.024402s

lib/libcurses/t_curses

14.167682s

addch

Passed

N/A

0.389897s

addchnstr

Passed

N/A

0.196274s

addchstr

Passed

N/A

0.188877s

addnstr

Passed

N/A

0.189416s

addstr

Passed

N/A

0.198594s

assume_default_colors

Passed

N/A

0.340619s

attributes

Passed

N/A

0.418680s

background

Passed

N/A

0.429299s

box

Passed

N/A

0.282119s

can_change_color

Passed

N/A

0.186383s

cbreak

Passed

N/A

0.458956s

clear

Passed

N/A

2.389784s

copywin

Passed

N/A

1.569714s

curs_set

Passed

N/A

0.228547s

getch

Passed

N/A

0.188871s

getstr

Passed

N/A

0.363227s

mvwin

Passed

N/A

0.335203s

startup

Passed

N/A

0.159736s

termattrs

Passed

N/A

0.168855s

timeout

Passed

N/A

4.440357s

wborder

Passed

N/A

0.258772s

window

Passed

N/A

0.199068s

wprintw

Passed

N/A

0.219823s

wscrl

Passed

N/A

0.349501s

lib/libevent/t_event

243.417685s

kqueue

Passed

N/A

81.646557s

poll

Passed

N/A

80.856971s

select

Passed

N/A

80.912283s

lib/libexecinfo/t_backtrace

0.031907s

backtrace_fmt_basic

Passed

N/A

0.031150s

lib/libm/t_acos

0.043857s

acos_inrange

Passed

N/A

0.013430s

acos_is_nan

Passed

N/A

0.014311s

acos_is_plus_zero

Passed

N/A

0.013899s

lib/libm/t_asin

0.208217s

asin_inf_neg

Passed

N/A

0.015036s

asin_inf_pos

Passed

N/A

0.013397s

asin_inrange

Passed

N/A

0.014657s

asin_nan

Passed

N/A

0.013246s

asin_range

Passed

N/A

0.014572s

asin_zero_neg

Passed

N/A

0.013212s

asin_zero_pos

Passed

N/A

0.014339s

asinf_inf_neg

Passed

N/A

0.014592s

asinf_inf_pos

Passed

N/A

0.014477s

asinf_inrange

Passed

N/A

0.013135s

asinf_nan

Passed

N/A

0.014538s

asinf_range

Passed

N/A

0.013227s

asinf_zero_neg

Passed

N/A

0.014533s

asinf_zero_pos

Passed

N/A

0.014467s

lib/libm/t_atan

0.057103s

atan_inrange

Passed

N/A

0.013947s

atan_nan

Passed

N/A

0.013311s

atan_zero_neg

Passed

N/A

0.014280s

atan_zero_pos

Passed

N/A

0.012778s

lib/libm/t_casinh

0.014551s

casinh

Passed

N/A

0.013928s

lib/libm/t_cbrt

0.271822s

cbrt_inf_neg

Passed

N/A

0.013397s

cbrt_inf_pos

Passed

N/A

0.015152s

cbrt_nan

Passed

N/A

0.014812s

cbrt_pow

Passed

N/A

0.013722s

cbrt_zero_neg

Passed

N/A

0.014069s

cbrt_zero_pos

Passed

N/A

0.014684s

cbrtf_inf_neg

Passed

N/A

0.014978s

cbrtf_inf_pos

Passed

N/A

0.013472s

cbrtf_nan

Passed

N/A

0.014947s

cbrtf_powf

Passed

N/A

0.013194s

cbrtf_zero_neg

Passed

N/A

0.015263s

cbrtf_zero_pos

Passed

N/A

0.013470s

cbrtl_inf_neg

Passed

N/A

0.015437s

cbrtl_inf_pos

Passed

N/A

0.013538s

cbrtl_nan

Passed

N/A

0.014993s

cbrtl_powl

Passed

N/A

0.014990s

cbrtl_zero_neg

Passed

N/A

0.013349s

cbrtl_zero_pos

Passed

N/A

0.015059s

lib/libm/t_ceil

0.899537s

ceil_basic

Passed

N/A

0.014685s

ceil_inf_neg

Passed

N/A

0.015598s

ceil_inf_pos

Passed

N/A

0.017324s

ceil_nan

Passed

N/A

0.014677s

ceil_zero_neg

Passed

N/A

0.017919s

ceil_zero_pos

Passed

N/A

0.016235s

ceilf_basic

Passed

N/A

0.014621s

ceilf_inf_neg

Passed

N/A

0.016697s

ceilf_inf_pos

Passed

N/A

0.015012s

ceilf_nan

Passed

N/A

0.016515s

ceilf_zero_neg

Passed

N/A

0.015243s

ceilf_zero_pos

Passed

N/A

0.014801s

ceill_basic

Passed

N/A

0.015953s

ceill_inf_neg

Passed

N/A

0.016726s

ceill_inf_pos

Passed

N/A

0.016749s

ceill_nan

Passed

N/A

0.015025s

ceill_zero_neg

Passed

N/A

0.016113s

ceill_zero_pos

Passed

N/A

0.016913s

floor_basic

Passed

N/A

0.014755s

floor_inf_neg

Passed

N/A

0.016298s

floor_inf_pos

Passed

N/A

0.015838s

floor_nan

Passed

N/A

0.016194s

floor_zero_neg

Passed

N/A

0.017577s

floor_zero_pos

Passed

N/A

0.015776s

floorf_basic

Passed

N/A

0.014707s

floorf_inf_neg

Passed

N/A

0.015637s

floorf_inf_pos

Passed

N/A

0.016953s

floorf_nan

Passed

N/A

0.014927s

floorf_zero_neg

Passed

N/A

0.016980s

floorf_zero_pos

Passed

N/A

0.016405s

floorl_basic

Passed

N/A

0.014763s

floorl_inf_neg

Passed

N/A

0.017870s

floorl_inf_pos

Passed

N/A

0.014890s

floorl_nan

Passed

N/A

0.016421s

floorl_zero_neg

Passed

N/A

0.014701s

floorl_zero_pos

Passed

N/A

0.014565s

trunc_basic

Passed

N/A

0.016028s

trunc_inf_neg

Passed

N/A

0.016505s

trunc_inf_pos

Passed

N/A

0.015520s

trunc_nan

Passed

N/A

0.014447s

trunc_zero_neg

Passed

N/A

0.016266s

trunc_zero_pos

Passed

N/A

0.015140s

truncf_basic

Passed

N/A

0.016427s

truncf_inf_neg

Passed

N/A

0.016787s

truncf_inf_pos

Passed

N/A

0.014986s

truncf_nan

Passed

N/A

0.016867s

truncf_zero_neg

Passed

N/A

0.016754s

truncf_zero_pos

Passed

N/A

0.016814s

truncl_basic

Passed

N/A

0.014972s

truncl_inf_neg

Passed

N/A

0.016498s

truncl_inf_pos

Passed

N/A

0.017062s

truncl_nan

Passed

N/A

0.014801s

truncl_zero_neg

Passed

N/A

0.016450s

truncl_zero_pos

Passed

N/A

0.015626s

lib/libm/t_cos

0.183135s

cos_angles

Passed

N/A

0.014532s

cos_inf_neg

Passed

N/A

0.014710s

cos_inf_pos

Passed

N/A

0.014872s

cos_nan

Passed

N/A

0.014530s

cos_zero_neg

Passed

N/A

0.015365s

cos_zero_pos

Passed

N/A

0.013010s

cosf_angles

Passed

N/A

0.014583s

cosf_inf_neg

Passed

N/A

0.014604s

cosf_inf_pos

Passed

N/A

0.015130s

cosf_nan

Passed

N/A

0.015445s

cosf_zero_neg

Passed

N/A

0.012994s

cosf_zero_pos

Passed

N/A

0.014563s

lib/libm/t_cosh

0.178915s

cosh_inf_neg

Passed

N/A

0.014856s

cosh_inf_pos

Passed

N/A

0.013142s

cosh_inrange

Passed

N/A

0.014859s

cosh_nan

Passed

N/A

0.012983s

cosh_zero_neg

Passed

N/A

0.015839s

cosh_zero_pos

Passed

N/A

0.013103s

coshf_inf_neg

Passed

N/A

0.015041s

coshf_inf_pos

Passed

N/A

0.013276s

coshf_inrange

Passed

N/A

0.015157s

coshf_nan

Passed

N/A

0.013298s

coshf_zero_neg

Passed

N/A

0.015080s

coshf_zero_pos

Passed

N/A

0.013207s

lib/libm/t_erf

0.239993s

erf_inf_neg

Passed

N/A

0.013571s

erf_inf_pos

Passed

N/A

0.015425s

erf_nan

Passed

N/A

0.013373s

erf_zero_neg

Passed

N/A

0.015092s

erf_zero_pos

Passed

N/A

0.013247s

erfc_inf_neg

Passed

N/A

0.015224s

erfc_inf_pos

Passed

N/A

0.013524s

erfc_nan

Passed

N/A

0.015264s

erfcf_inf_neg

Passed

N/A

0.013460s

erfcf_inf_pos

Passed

N/A

0.014752s

erfcf_nan

Passed

N/A

0.014862s

erff_inf_neg

Passed

N/A

0.013595s

erff_inf_pos

Passed

N/A

0.014779s

erff_nan

Passed

N/A

0.013290s

erff_zero_neg

Passed

N/A

0.014424s

erff_zero_pos

Passed

N/A

0.013269s

lib/libm/t_exp

0.393697s

exp2_is_nan

Passed

N/A

0.013984s

exp2_is_plus_zero

Passed

N/A

0.014800s

exp2_powers

Passed

N/A

0.015336s

exp2_values

Passed

N/A

0.015551s

exp_inf_neg

Passed

N/A

0.013576s

exp_inf_pos

Passed

N/A

0.014930s

exp_nan

Passed

N/A

0.013504s

exp_product

Passed

N/A

0.015311s

exp_zero_neg

Passed

N/A

0.013443s

exp_zero_pos

Passed

N/A

0.014934s

expf_inf_neg

Passed

N/A

0.013586s

expf_inf_pos

Passed

N/A

0.014945s

expf_nan

Passed

N/A

0.013461s

expf_product

Passed

N/A

0.014953s

expf_zero_neg

Passed

N/A

0.013477s

expf_zero_pos

Passed

N/A

0.015110s

expm1_inf_neg

Passed

N/A

0.013524s

expm1_inf_pos

Passed

N/A

0.015023s

expm1_nan

Passed

N/A

0.013617s

expm1_zero_neg

Passed

N/A

0.015002s

expm1_zero_pos

Passed

N/A

0.013531s

expm1f_inf_neg

Passed

N/A

0.015136s

expm1f_inf_pos

Passed

N/A

0.013601s

expm1f_nan

Passed

N/A

0.015081s

expm1f_zero_neg

Passed

N/A

0.013455s

expm1f_zero_pos

Passed

N/A

0.015120s

lib/libm/t_fenv

0.058530s

feenableexcept

Passed

N/A

0.014334s

fegetexcept

Passed

N/A

0.012781s

fegetround

Passed

N/A

0.014006s

fesetround

Passed

N/A

0.014734s

lib/libm/t_fe_round

0.014884s

fe_round

Passed

N/A

0.014279s

lib/libm/t_fmod

0.015282s

fmod

Passed

N/A

0.014572s

lib/libm/t_hypot

0.043900s

hypot_integer

Passed

N/A

0.014550s

hypotf_integer

Passed

N/A

0.012993s

pr50698

Passed

N/A

0.013918s

lib/libm/t_ilogb

0.013834s

ilogb

Passed

N/A

0.013126s

lib/libm/t_infinity

0.042397s

infinity_double

Passed

N/A

0.013112s

infinity_float

Passed

N/A

0.014189s

infinity_long_double

Passed

N/A

0.012992s

lib/libm/t_ldexp

0.284706s

ldexp_basic

Passed

N/A

0.014084s

ldexp_denormal

Passed

N/A

0.015143s

ldexp_denormal_large

Passed

N/A

0.014303s

ldexp_exp2

Passed

N/A

0.015333s

ldexp_inf_neg

Passed

N/A

0.013358s

ldexp_inf_pos

Passed

N/A

0.015131s

ldexp_infinity

Passed

N/A

0.013461s

ldexp_nan

Passed

N/A

0.014606s

ldexp_overflow

Passed

N/A

0.013745s

ldexp_underflow

Passed

N/A

0.014830s

ldexp_zero

Passed

N/A

0.013676s

ldexp_zero_neg

Passed

N/A

0.014501s

ldexp_zero_pos

Passed

N/A

0.013307s

ldexpf_exp2f

Passed

N/A

0.014699s

ldexpf_inf_neg

Passed

N/A

0.013251s

ldexpf_inf_pos

Passed

N/A

0.014699s

ldexpf_nan

Passed

N/A

0.013611s

ldexpf_zero_neg

Passed

N/A

0.014708s

ldexpf_zero_pos

Passed

N/A

0.013523s

lib/libm/t_log

0.911065s

log10_base

Passed

N/A

0.014626s

log10_inf_neg

Passed

N/A

0.016198s

log10_inf_pos

Passed

N/A

0.016638s

log10_nan

Passed

N/A

0.016614s

log10_one_pos

Passed

N/A

0.014558s

log10_zero_neg

Passed

N/A

0.017787s

log10_zero_pos

Passed

N/A

0.016162s

log10f_base

Passed

N/A

0.014751s

log10f_inf_neg

Passed

N/A

0.016783s

log10f_inf_pos

Passed

N/A

0.015603s

log10f_nan

Passed

N/A

0.016818s

log10f_one_pos

Passed

N/A

0.014813s

log10f_zero_neg

Passed

N/A

0.017246s

log10f_zero_pos

Passed

N/A

0.015677s

log1p_inf_neg

Passed

N/A

0.016533s

log1p_inf_pos

Passed

N/A

0.017300s

log1p_nan

Passed

N/A

0.015545s

log1p_one_neg

Passed

N/A

0.017218s

log1p_zero_neg

Passed

N/A

0.014765s

log1p_zero_pos

Passed

N/A

0.016372s

log1pf_inf_neg

Passed

N/A

0.015156s

log1pf_inf_pos

Passed

N/A

0.016291s

log1pf_nan

Passed

N/A

0.015345s

log1pf_one_neg

Passed

N/A

0.016199s

log1pf_zero_neg

Passed

N/A

0.017174s

log1pf_zero_pos

Passed

N/A

0.016032s

log2_base

Passed

N/A

0.014845s

log2_inf_neg

Passed

N/A

0.016566s

log2_inf_pos

Passed

N/A

0.016771s

log2_nan

Passed

N/A

0.015074s

log2_one_pos

Passed

N/A

0.017056s

log2_zero_neg

Passed

N/A

0.016934s

log2_zero_pos

Passed

N/A

0.016938s

log2f_base

Passed

N/A

0.014738s

log2f_inf_neg

Passed

N/A

0.016470s

log2f_inf_pos

Passed

N/A

0.016992s

log2f_nan

Passed

N/A

0.015080s

log2f_one_pos

Passed

N/A

0.017770s

log2f_zero_neg

Passed

N/A

0.016091s

log2f_zero_pos

Passed

N/A

0.014881s

log_base

Passed

N/A

0.016597s

log_inf_neg

Passed

N/A

0.016792s

log_inf_pos

Passed

N/A

0.016952s

log_nan

Passed

N/A

0.015073s

log_one_pos

Passed

N/A

0.016145s

log_zero_neg

Passed

N/A

0.016922s

log_zero_pos

Passed

N/A

0.015023s

logf_base

Passed

N/A

0.016276s

logf_inf_neg

Passed

N/A

0.016815s

logf_inf_pos

Passed

N/A

0.015336s

logf_nan

Passed

N/A

0.016878s

logf_one_pos

Passed

N/A

0.016470s

logf_zero_neg

Passed

N/A

0.015415s

logf_zero_pos

Passed

N/A

0.016414s

lib/libm/t_modf

0.013764s

modf

Passed

N/A

0.013053s

lib/libm/t_pow

0.303173s

pow_inf_neg_x

Passed

N/A

0.015134s

pow_inf_neg_y

Passed

N/A

0.013408s

pow_inf_pos_x

Passed

N/A

0.014337s

pow_inf_pos_y

Passed

N/A

0.014908s

pow_nan_x

Passed

N/A

0.013881s

pow_nan_y

Passed

N/A

0.015367s

pow_one_neg_x

Passed

N/A

0.013358s

pow_one_pos_x

Passed

N/A

0.014415s

pow_zero_x

Passed

N/A

0.013628s

pow_zero_y

Passed

N/A

0.014508s

powf_inf_neg_x

Passed

N/A

0.013395s

powf_inf_neg_y

Passed

N/A

0.015141s

powf_inf_pos_x

Passed

N/A

0.013312s

powf_inf_pos_y

Passed

N/A

0.014965s

powf_nan_x

Passed

N/A

0.013234s

powf_nan_y

Passed

N/A

0.014779s

powf_one_neg_x

Passed

N/A

0.013233s

powf_one_pos_x

Passed

N/A

0.014651s

powf_zero_x

Passed

N/A

0.015214s

powf_zero_y

Passed

N/A

0.015611s

lib/libm/t_precision

0.014898s

t_precision

Passed

N/A

0.014244s

lib/libm/t_round

0.013881s

round_dir

Passed

N/A

0.013299s

lib/libm/t_scalbn

0.301446s

scalbn_inf_neg

Passed

N/A

0.014054s

scalbn_inf_pos

Passed

N/A

0.014294s

scalbn_ldexp

Passed

N/A

0.015269s

scalbn_nan

Passed

N/A

0.013242s

scalbn_val

Passed

N/A

0.014370s

scalbn_zero_neg

Passed

N/A

0.013206s

scalbn_zero_pos

Passed

N/A

0.014540s

scalbnf_inf_neg

Passed

N/A

0.013442s

scalbnf_inf_pos

Passed

N/A

0.014784s

scalbnf_ldexpf

Passed

N/A

0.014705s

scalbnf_nan

Passed

N/A

0.013378s

scalbnf_val

Passed

N/A

0.015397s

scalbnf_zero_neg

Passed

N/A

0.013190s

scalbnf_zero_pos

Passed

N/A

0.015058s

scalbnl_inf_neg

Passed

N/A

0.013333s

scalbnl_inf_pos

Passed

N/A

0.015500s

scalbnl_nan

Passed

N/A

0.013375s

scalbnl_val

Passed

N/A

0.014959s

scalbnl_zero_neg

Passed

N/A

0.014795s

scalbnl_zero_pos

Passed

N/A

0.015548s

lib/libm/t_sin

0.181104s

sin_angles

Passed

N/A

0.013891s

sin_inf_neg

Passed

N/A

0.015353s

sin_inf_pos

Passed

N/A

0.013061s

sin_nan

Passed

N/A

0.015551s

sin_zero_neg

Passed

N/A

0.013261s

sin_zero_pos

Passed

N/A

0.014977s

sinf_angles

Passed

N/A

0.014921s

sinf_inf_neg

Passed

N/A

0.015568s

sinf_inf_pos

Passed

N/A

0.015319s

sinf_nan

Passed

N/A

0.012936s

sinf_zero_neg

Passed

N/A

0.013003s

sinf_zero_pos

Passed

N/A

0.014496s

lib/libm/t_sinh

0.178252s

sinh_inf_neg

Passed

N/A

0.013782s

sinh_inf_pos

Passed

N/A

0.015919s

sinh_inrange

Passed

N/A

0.013309s

sinh_nan

Passed

N/A

0.014396s

sinh_zero_neg

Passed

N/A

0.013776s

sinh_zero_pos

Passed

N/A

0.014478s

sinhf_inf_neg

Passed

N/A

0.014112s

sinhf_inf_pos

Passed

N/A

0.013258s

sinhf_inrange

Passed

N/A

0.014716s

sinhf_nan

Passed

N/A

0.013246s

sinhf_zero_neg

Passed

N/A

0.014405s

sinhf_zero_pos

Passed

N/A

0.013168s

lib/libm/t_sqrt

0.268084s

sqrt_inf_neg

Passed

N/A

0.013884s

sqrt_inf_pos

Passed

N/A

0.014827s

sqrt_nan

Passed

N/A

0.013535s

sqrt_pow

Passed

N/A

0.014703s

sqrt_zero_neg

Passed

N/A

0.013570s

sqrt_zero_pos

Passed

N/A

0.013153s

sqrtf_inf_neg

Passed

N/A

0.014717s

sqrtf_inf_pos

Passed

N/A

0.013271s

sqrtf_nan

Passed

N/A

0.015852s

sqrtf_powf

Passed

N/A

0.015009s

sqrtf_zero_neg

Passed

N/A

0.013144s

sqrtf_zero_pos

Passed

N/A

0.014831s

sqrtl_inf_neg

Passed

N/A

0.013416s

sqrtl_inf_pos

Passed

N/A

0.014943s

sqrtl_nan

Passed

N/A

0.013410s

sqrtl_powl

Passed

N/A

0.014896s

sqrtl_zero_neg

Passed

N/A

0.013220s

sqrtl_zero_pos

Passed

N/A

0.015051s

lib/libm/t_tan

0.178976s

tan_angles

Passed

N/A

0.014579s

tan_inf_neg

Passed

N/A

0.013163s

tan_inf_pos

Passed

N/A

0.014284s

tan_nan

Passed

N/A

0.014441s

tan_zero_neg

Passed

N/A

0.014293s

tan_zero_pos

Passed

N/A

0.014932s

tanf_angles

Passed

N/A

0.014790s

tanf_inf_neg

Passed

N/A

0.013413s

tanf_inf_pos

Passed

N/A

0.014245s

tanf_nan

Passed

N/A

0.013241s

tanf_zero_neg

Passed

N/A

0.014223s

tanf_zero_pos

Passed

N/A

0.013217s

lib/libm/t_tanh

0.150342s

tanh_inf_neg

Passed

N/A

0.015237s

tanh_inf_pos

Passed

N/A

0.013090s

tanh_nan

Passed

N/A

0.014504s

tanh_zero_neg

Passed

N/A

0.014658s

tanh_zero_pos

Passed

N/A

0.014860s

tanhf_inf_neg

Passed

N/A

0.015562s

tanhf_inf_pos

Passed

N/A

0.013094s

tanhf_nan

Passed

N/A

0.014561s

tanhf_zero_neg

Passed

N/A

0.013066s

tanhf_zero_pos

Passed

N/A

0.014354s

lib/libobjc/t_threads

0.016267s

thread_callback

Passed

N/A

0.015705s

lib/libposix/bsd/t_rename

0.012932s

rename

Passed

N/A

0.012140s

lib/libposix/posix1/t_rename

0.013473s

rename

Passed

N/A

0.012550s

lib/libposix/posix2/t_rename

0.012427s

rename

Passed

N/A

0.011586s

lib/libppath/t_ppath

0.407855s

component_at

Passed

N/A

0.017163s

copydel_bool_success

Passed

N/A

0.016109s

copydel_object_twice_success

Passed

N/A

0.016819s

copyset_bool_success

Passed

N/A

0.015285s

copyset_object_twice_success

Passed

N/A

0.017041s

create_bool_eexist

Passed

N/A

0.014948s

create_bool_success

Passed

N/A

0.016266s

delete_bool_eftype

Passed

N/A

0.014776s

delete_bool_enoent

Passed

N/A

0.016445s

delete_bool_success

Passed

N/A

0.014574s

get_bool_eftype

Passed

N/A

0.016341s

get_bool_enoent

Passed

N/A

0.014697s

get_bool_success

Passed

N/A

0.014680s

get_idx_key

Passed

N/A

0.016064s

get_string_eftype

Passed

N/A

0.014547s

get_string_enoent

Passed

N/A

0.016161s

get_string_success

Passed

N/A

0.014761s

length

Passed

N/A

0.015872s

pop_until_empty

Passed

N/A

0.014276s

ppath_copy

Passed

N/A

0.015973s

push_until_full

Passed

N/A

0.014668s

replace

Passed

N/A

0.016168s

set_bool_eftype

Passed

N/A

0.015261s

set_bool_enoent

Passed

N/A

0.016265s

set_bool_success

Passed

N/A

0.014697s

lib/libprop/t_basic

0.028215s

prop_basic

Passed

N/A

0.013820s

prop_dictionary_equals

Passed

N/A

0.012792s

lib/libpthread/t_barrier

10.056168s

barrier

Passed

N/A

10.055346s

lib/libpthread/t_cond

9.300228s

bogus_timedwaits

Passed

N/A

0.015521s

broadcast

Passed

N/A

0.495242s

cond_timedwait_race

Passed

N/A

2.186211s

condattr

Passed

N/A

0.013960s

destroy_after_cancel

Passed

N/A

0.016926s

signal_before_unlock

Passed

N/A

2.023288s

signal_before_unlock_static_init

Passed

N/A

2.019253s

signal_delay_wait

Passed

N/A

2.019455s

signal_wait_race

Passed

N/A

0.504218s

lib/libpthread/t_condwait

4.045700s

cond_wait_mono

Passed

N/A

2.025093s

cond_wait_real

Passed

N/A

2.019117s

lib/libpthread/t_detach

0.015004s

pthread_detach

Passed

N/A

0.013859s

lib/libpthread/t_equal

0.016146s

pthread_equal

Passed

N/A

0.015487s

lib/libpthread/t_fork

5.022356s

fork

Passed

N/A

5.021497s

lib/libpthread/t_fpu

0.018870s

fpu

Passed

N/A

0.018250s

lib/libpthread/t_join

0.020893s

pthread_join

Passed

N/A

0.019765s

lib/libpthread/t_kill

0.018811s

simple

Passed

N/A

0.018096s

lib/libpthread/t_mutex

53.166668s

mutex1

Passed

N/A

4.034185s

mutex2

Passed

N/A

7.116292s

mutex3

Passed

N/A

6.713449s

mutex4

Passed

N/A

4.027819s

mutex5

Passed

N/A

10.019841s

mutex6

Failed

/usr/src/tests/lib/libpthread/t_mutex.c:524: start != 1

21.219512s

mutexattr1

Passed

N/A

0.015192s

mutexattr2

Passed

N/A

0.014392s

lib/libpthread/t_name

0.014846s

name

Passed

N/A

0.014178s

lib/libpthread/t_once

0.052606s

once1

Passed

N/A

0.014272s

once2

Passed

N/A

0.020484s

once3

Passed

N/A

0.015653s

lib/libpthread/t_preempt

1.020585s

preempt1

Passed

N/A

1.019749s

lib/libpthread/t_rwlock

1.029487s

rwlock1

Passed

N/A

1.014988s

rwlock_static

Passed

N/A

0.013042s

lib/libpthread/t_sem

20.487184s

before_start_no_threads

Passed

N/A

10.025867s

before_start_one_thread

Passed

N/A

10.029362s

named

Passed

N/A

0.014162s

unnamed

Passed

N/A

0.415090s

lib/libpthread/t_sigmask

4.089514s

before_threads

Passed

N/A

0.014245s

incorrect_mask_bug

Passed

N/A

3.038371s

respected_while_running

Passed

N/A

1.019843s

upcalls_not_started

Passed

N/A

0.014245s

lib/libpthread/t_sigsuspend

1.015177s

sigsuspend

Passed

N/A

1.014473s

lib/libpthread/t_siglongjmp

0.016020s

siglongjmp1

Passed

N/A

0.014970s

lib/libpthread/t_sleep

1.017855s

sleep1

Passed

N/A

1.017061s

lib/libpthread/t_swapcontext

0.015217s

swapcontext1

Passed

N/A

0.014420s

lib/libpthread/t_timedmutex

83.164502s

mutex1

Passed

N/A

4.024902s

mutex2

Passed

N/A

21.948133s

mutex3

Passed

N/A

21.815914s

mutex4

Passed

N/A

4.035149s

mutex5

Passed

N/A

10.018833s

mutex6

Failed

/usr/src/tests/lib/libpthread/t_mutex.c:430: mutex_lock(&mutex6, &ts_lengthy): Invalid argument

21.220651s

mutexattr1

Passed

N/A

0.015186s

mutexattr2

Passed

N/A

0.015692s

timedmutex1

Passed

N/A

0.013888s

timedmutex2

Passed

N/A

0.014197s

timedmutex3

Passed

N/A

0.016116s

timedmutex4

Passed

N/A

0.016219s

lib/libpthread/t_atexit

0.142533s

atexit

Passed

N/A

0.141671s

lib/libpthread/t_cancel

0.137525s

register_while_disabled

Passed

N/A

0.136660s

lib/libpthread/t_exit

0.135161s

main_thread

Passed

N/A

0.134311s

lib/libpthread/t_resolv

5.164497s

resolv

Passed

N/A

5.163763s

lib/libpthread_dbg/t_dummy

0.057411s

dummy1

Passed

N/A

0.013835s

dummy2

Passed

N/A

0.018871s

dummy3

Passed

N/A

0.022308s

lib/libpthread_dbg/t_threads

0.167685s

threads1

Passed

N/A

0.016671s

threads2

Passed

N/A

0.016947s

threads3

Passed

N/A

0.018496s

threads4

Passed

N/A

0.019944s

threads5

Passed

N/A

0.018768s

threads6

Passed

N/A

0.016478s

threads7

Passed

N/A

0.018022s

threads8

Passed

N/A

0.018187s

threads9

Passed

N/A

0.017725s

lib/librefuse/t_refuse_opt

0.148163s

t_fuse_opt_add_arg

Passed

N/A

0.014489s

t_fuse_opt_add_opt

Passed

N/A

0.016317s

t_fuse_opt_add_opt_escaped

Passed

N/A

0.014463s

t_fuse_opt_insert_arg

Passed

N/A

0.016632s

t_fuse_opt_match

Passed

N/A

0.015223s

t_fuse_opt_parse

Passed

N/A

0.016834s

t_fuse_opt_parse_null_args

Passed

N/A

0.016612s

t_fuse_opt_parse_null_opts

Passed

N/A

0.014940s

t_fuse_opt_parse_null_proc

Passed

N/A

0.016661s

lib/librt/t_sched

0.115026s

sched_getparam

Passed

N/A

0.013160s

sched_priority

Passed

N/A

0.014060s

sched_rr_get_interval_1

Passed

N/A

0.014681s

sched_rr_get_interval_2

Passed

N/A

0.013286s

sched_setscheduler_1

Passed

N/A

0.013003s

sched_setscheduler_2

Passed

N/A

0.014395s

sched_setscheduler_3

Passed

N/A

0.012947s

sched_setscheduler_4

Passed

N/A

0.013900s

lib/librt/t_sem

20.229441s

basic

Passed

N/A

0.012716s

child

Passed

N/A

20.215361s

lib/libtre/t_regex_att

0.218889s

basic

Passed

N/A

0.074002s

categorization

Passed

N/A

0.021794s

forcedassoc

Passed

N/A

0.021937s

leftassoc

Passed

N/A

0.017661s

nullsubexpr

Passed

N/A

0.018289s

repetition

Passed

N/A

0.039369s

rightassoc

Expected failure

Reason for breakage unknown: /usr/src/tests/lib/libtre/../libc/regex/t_regex_att.c:377: res != matches ((0,4)(0,1)(1,4)(4,4) != (0,4)(0,2)(2,3)(3,4)): at line 3

0.020621s

lib/libtre/t_exhaust

3.823596s

regcomp_too_big

Passed

N/A

3.822613s

lib/libusbhid/t_usbhid

0.093118s

check_hid_get_data

Expected failure

only the 32-bit opcode works, 8 and 16-bit is broken: 4 checks failed as expected; see output for more details

0.013512s

check_hid_logical_range

Expected failure

only the 32-bit opcode works, 8 and 16-bit is broken: 4 checks failed as expected; see output for more details

0.014100s

check_hid_physical_range

Expected failure

only the 32-bit opcode works, 8 and 16-bit is broken: 4 checks failed as expected; see output for more details

0.014591s

check_hid_set_data

Passed

N/A

0.013602s

check_hid_usage

Passed

N/A

0.020324s

check_parse_just_pop

Passed

N/A

0.012540s

lib/libutil/t_efun

0.056468s

ecalloc

Passed

N/A

0.014261s

efopen

Passed

N/A

0.012749s

emalloc

Passed

N/A

0.013942s

erealloc

Passed

N/A

0.012717s

lib/libutil/t_parsedate

2.680928s

atsecs

Passed

N/A

0.016871s

dates

Passed

N/A

0.016687s

dsttimes

Passed

N/A

0.048450s

gibberish

Passed

N/A

0.013875s

relative

Passed

N/A

2.547205s

times

Passed

N/A

0.016189s

zones

Passed

N/A

0.016530s

lib/libutil/t_pidfile

0.121274s

change_basenames

Passed

N/A

0.019549s

change_mix

Passed

N/A

0.020289s

change_paths

Passed

N/A

0.017409s

custom_basename

Passed

N/A

0.020110s

custom_path

Passed

N/A

0.019072s

default_path

Passed

N/A

0.019364s

lib/libutil/t_snprintb

0.028034s

snprintb

Passed

N/A

0.012913s

snprintb_m

Passed

N/A

0.013663s

lib/libutil/t_sockaddr_snprintf

0.073870s

sockaddr_snprintf_at

Passed

N/A

0.014381s

sockaddr_snprintf_dl

Passed

N/A

0.013661s

sockaddr_snprintf_in

Passed

N/A

0.014373s

sockaddr_snprintf_in6

Passed

N/A

0.013371s

sockaddr_snprintf_un

Passed

N/A

0.013949s

lib/semaphore/pthread/t_sem_pth

0.655734s

blocktimedwait

Passed

N/A

0.122142s

blockwait

Passed

N/A

0.239699s

busydestroy

Passed

N/A

0.059066s

destroy

Passed

N/A

0.043784s

initvalue

Passed

N/A

0.046920s

named

Passed

N/A

0.047718s

postwait

Passed

N/A

0.047447s

unlink

Passed

N/A

0.043656s

lib/librumpclient/t_fd

0.389509s

bigenough

Passed

N/A

0.124438s

sigio

Passed

N/A

0.263267s

lib/librumpclient/t_exec

4.234935s

cloexec

Passed

N/A

0.627059s

exec

Passed

N/A

0.604157s

noexec

Passed

N/A

0.588326s

threxec

Passed

N/A

1.709664s

vfork

Passed

N/A

0.695031s

lib/librumphijack/t_asyncio

1.098549s

invafd

Passed

N/A

0.374649s

select_allunset

Passed

N/A

0.379346s

select_timeout

Passed

N/A

0.341567s

lib/librumphijack/t_config

0.345224s

fdoff

Passed

N/A

0.342516s

lib/librumphijack/t_cwd

2.651432s

basic_chdir

Passed

N/A

0.341679s

basic_fchdir

Passed

N/A

0.328282s

slash_chdir

Passed

N/A

0.328935s

slash_fchdir

Passed

N/A

0.326324s

symlink_chdir

Passed

N/A

0.329872s

symlink_fchdir

Passed

N/A

0.323769s

symlink_slash_chdir

Passed

N/A

0.326999s

symlink_slash_fchdir

Passed

N/A

0.336713s

lib/librumphijack/t_sh

0.941734s

redirect

Passed

N/A

0.512646s

runscript

Passed

N/A

0.426844s

lib/librumphijack/t_tcpip

4.775258s

http

Passed

N/A

0.990348s

nfs

Passed

N/A

1.981765s

nfs_autoload

Skipped

test currently valid only on i386

0.245396s

ssh

Expected failure

PR lib/50174: atf-check failed; see the output of the test for details

1.544512s

lib/librumphijack/t_vfs

5.345768s

blanket

Passed

N/A

0.380030s

cpcopy

Passed

N/A

0.785971s

doubleblanket

Passed

N/A

0.512158s

ln_nox

Passed

N/A

0.744352s

ln_x

Passed

N/A

0.388150s

mv_nox

Passed

N/A

0.688329s

mv_x

Passed

N/A

0.586032s

paxcopy

Passed

N/A

0.832540s

runonprefix

Passed

N/A

0.393215s

lib/libdes/t_des

0.220494s

align

Passed

N/A

0.022177s

cbc

Passed

N/A

0.012932s

cbc_cksum

Passed

N/A

0.012872s

cbcm

Passed

N/A

0.014593s

cfb

Passed

N/A

0.013639s

desx_cbc

Passed

N/A

0.014260s

ecb

Passed

N/A

0.013703s

ede_cbc

Passed

N/A

0.012578s

ede_ecb

Passed

N/A

0.014388s

ede_ofb64

Passed

N/A

0.012879s

fast_crypt

Passed

N/A

0.013866s

ofb

Passed

N/A

0.012610s

ofb64

Passed

N/A

0.014051s

pcbc

Passed

N/A

0.012780s

quad_cksum

Passed

N/A

0.013128s

lib/libskey/t_algorithms

0.093034s

md4

Passed

N/A

0.013236s

md5

Passed

N/A

0.014041s

sha1

Passed

N/A

0.063730s

libexec/ld.elf_so/t_dlerror-cleared

0.014426s

rtld_dlerror_cleared

Passed

N/A

0.013784s

libexec/ld.elf_so/t_dlerror-false

0.014039s

rtld_dlerror_false

Passed

N/A

0.013379s

libexec/ld.elf_so/t_dlinfo

0.054687s

rtld_dlinfo_linkmap_dlopen

Passed

N/A

0.013391s

rtld_dlinfo_linkmap_dlopen_iter

Passed

N/A

0.013766s

rtld_dlinfo_linkmap_inval

Passed

N/A

0.011574s

rtld_dlinfo_linkmap_self

Passed

N/A

0.013232s

libexec/ld.elf_so/t_dlvsym

0.072051s

rtld_dlvsym_symbol_nonexistent

Passed

N/A

0.016420s

rtld_dlvsym_v1

Passed

N/A

0.013621s

rtld_dlvsym_v3

Passed

N/A

0.012643s

rtld_dlvsym_version_nonexistent

Passed

N/A

0.012073s

rtld_dlvsym_version_null

Passed

N/A

0.014052s

libexec/ld.elf_so/t_ifunc

0.052240s

rtld_ifunc

Passed

N/A

0.051531s

libexec/ld.elf_so/t_df_1_noopen

0.282930s

df_1_noopen1

Passed

N/A

0.143352s

df_1_noopen2

Passed

N/A

0.137615s

libexec/ld.elf_so/t_dl_symver

0.645672s

dl_symver

Passed

N/A

0.644997s

net/fdpass/t_fdpass

0.718431s

fdpass_compat

Passed

N/A

0.279985s

fdpass_compat_normal

Passed

N/A

0.147204s

fdpass_normal

Passed

N/A

0.136842s

fdpass_normal_compat

Passed

N/A

0.151192s

net/in_cksum/t_in_cksum

22.320661s

mbufs_aligned

Passed

N/A

7.069815s

mbufs_unaligned

Passed

N/A

7.039054s

sizes_aligned

Passed

N/A

4.320290s

sizes_unaligned

Passed

N/A

3.888782s

net/net/t_unix

0.042767s

sockaddr_un_closed

Passed

N/A

0.013761s

sockaddr_un_len_exceed

Passed

N/A

0.013364s

sockaddr_un_len_max

Passed

N/A

0.013280s

net/net/t_tcp

0.039401s

fcntl_reset_nonblock

Passed

N/A

0.012229s

paccept_nonblock

Passed

N/A

0.012960s

paccept_reset_nonblock

Passed

N/A

0.012047s

net/net/t_udp

0.030061s

udp4_send

Passed

N/A

0.013787s

udp6_send

Passed

N/A

0.014947s

net/net/t_pktinfo

0.013424s

pktinfo

Passed

N/A

0.012826s

net/net/t_raw

0.176495s

PRU_SENSE

Passed

N/A

0.175488s

net/net/t_forwarding

67.550262s

ipforwarding_fastforward_v4

Passed

N/A

7.099602s

ipforwarding_fastforward_v6

Passed

N/A

7.060518s

ipforwarding_misc

Passed

N/A

22.479543s

ipforwarding_v4

Passed

N/A

12.848649s

ipforwarding_v6

Passed

N/A

18.043675s

net/net/t_ipaddress

11.487387s

ipaddr_auto_linklocal

Passed

N/A

1.192260s

ipaddr_same_address

Passed

N/A

6.037482s

ipaddr_same_address6

Passed

N/A

4.248872s

net/net/t_ipv6address

40.271893s

linklocal

Passed

N/A

38.266198s

linklocal_ops

Passed

N/A

1.995063s

net/net/t_ipv6_lifetime

29.670380s

basic

Passed

N/A

29.667841s

net/net/t_mtudisc

302.228910s

mtudisc_basic

Failed

Test case timed out after 300 seconds

302.225321s

net/net/t_mtudisc6

13.643286s

mtudisc6_basic

Passed

N/A

13.639440s

net/net/t_ping6_opts

42.771953s

ping6_opts_gateway

Passed

N/A

9.785794s

ping6_opts_hops

Passed

N/A

15.468047s

ping6_opts_interface

Passed

N/A

8.521915s

ping6_opts_sourceaddr

Passed

N/A

8.978241s

net/sys/t_rfc6056

0.051066s

inet4

Passed

N/A

0.024302s

inet6

Passed

N/A

0.025387s

net/arp/t_arp

76.122714s

arp_cache_expiration_10s

Passed

N/A

13.601531s

arp_cache_expiration_5s

Passed

N/A

8.589724s

arp_cache_overwriting

Passed

N/A

1.734659s

arp_command

Passed

N/A

9.455743s

arp_garp

Passed

N/A

6.532707s

arp_link_activation

Passed

N/A

3.816877s

arp_proxy_arp_pub

Passed

N/A

15.254407s

arp_proxy_arp_pubproxy

Passed

N/A

15.620440s

arp_static

Passed

N/A

1.486412s

net/arp/t_dad

17.284158s

dad_basic

Passed

N/A

13.658596s

dad_duplicated

Passed

N/A

3.618953s

net/bpf/t_bpf

0.370823s

bpfwriteleak

Passed

N/A

0.175634s

bpfwritetrunc

Passed

N/A

0.192754s

net/bpf/t_div-by-zero

0.176837s

div_by_zero

Passed

N/A

0.175810s

net/bpf/t_mbuf

3.590332s

bpf_mbuf_ldb_abs

Passed

N/A

0.174822s

bpf_mbuf_ldb_abs_overflow

Passed

N/A

0.182411s

bpf_mbuf_ldb_ind

Passed

N/A

0.179376s

bpf_mbuf_ldb_ind_overflow1

Passed

N/A

0.180282s

bpf_mbuf_ldb_ind_overflow2

Passed

N/A

0.181394s

bpf_mbuf_ldb_ind_overflow3

Passed

N/A

0.175976s

bpf_mbuf_ldh_abs

Passed

N/A

0.175496s

bpf_mbuf_ldh_abs_overflow

Passed

N/A

0.184436s

bpf_mbuf_ldh_ind

Passed

N/A

0.174711s

bpf_mbuf_ldh_ind_overflow1

Passed

N/A

0.173333s

bpf_mbuf_ldh_ind_overflow2

Passed

N/A

0.181840s

bpf_mbuf_ldh_ind_overflow3

Passed

N/A

0.176053s

bpf_mbuf_ldw_abs

Passed

N/A

0.184710s

bpf_mbuf_ldw_abs_overflow

Passed

N/A

0.180889s

bpf_mbuf_ldw_ind

Passed

N/A

0.172952s

bpf_mbuf_ldw_ind_overflow1

Passed

N/A

0.182786s

bpf_mbuf_ldw_ind_overflow2

Passed

N/A

0.176694s

bpf_mbuf_ldw_ind_overflow3

Passed

N/A

0.179434s

bpf_mbuf_msh

Passed

N/A

0.180066s

bpf_mbuf_msh_overflow

Passed

N/A

0.178478s

net/bpfilter/t_bpfilter

1.554443s

bpfilterbadjmp

Passed

N/A

0.182357s

bpfilterbadmem

Passed

N/A

0.187507s

bpfilterbadret

Passed

N/A

0.182454s

bpfiltercontig

Passed

N/A

0.222984s

bpfiltermchain

Passed

N/A

0.218282s

bpfilternegjmp

Passed

N/A

0.182337s

bpfilternoinitA

Passed

N/A

0.182055s

bpfilternoinitX

Passed

N/A

0.182196s

net/carp/t_basic

8.370912s

handover

Passed

N/A

8.369091s

net/icmp/t_forward

1.208130s

returndatabytes

Passed

N/A

1.206336s

net/icmp/t_ping

9.308953s

floodping

Passed

N/A

1.976745s

floodping2

Passed

N/A

3.420886s

ping_of_death

Passed

N/A

0.256587s

pingsize

Passed

N/A

2.936200s

simpleping

Passed

N/A

0.709867s

net/icmp/t_ping2

0.932053s

basic

Passed

N/A

0.931024s

net/icmp/t_icmp_redirect

22.676079s

icmp_redirect

Passed

N/A

7.606885s

icmp_redirect_timeout

Passed

N/A

15.062011s

net/icmp/t_icmp6_redirect

13.545365s

icmp6_redirect_basic

Passed

N/A

13.541973s

net/if/t_compat

0.186641s

OOSIOCGIFBRDADDR

Expected failure

PR kern/51610: rump does not include COMPAT_43: /usr/src/tests/net/if/t_compat.c:72: rump_sys_ioctl(fd, ((((unsigned long)0x80000000|(unsigned long)0x40000000)) | (((sizeof(struct oifreq)) & 0x1fff) << 16) | ((('i')) << 8) | ((18))), &ifreq): Inappropriate ioctl for device

0.184905s

net/if/t_ifconf

1.814290s

basic

Passed

N/A

1.812471s

net/if/t_ifconfig

28.990533s

ifconfig_create_destroy

Passed

N/A

0.954401s

ifconfig_options

Passed

N/A

6.250061s

ifconfig_parameters

Passed

N/A

21.781093s

net/if_bridge/t_bridge

88.596336s

bridge_ipv4

Passed

N/A

14.127361s

bridge_ipv6

Passed

N/A

24.374338s

bridge_member_ipv4

Passed

N/A

20.246041s

bridge_member_ipv6

Passed

N/A

25.794338s

bridge_rtable

Passed

N/A

4.032044s

net/if_gif/t_gif

147.248180s

gif_basic_ipv4overipv4

Passed

N/A

9.964177s

gif_basic_ipv4overipv6

Passed

N/A

9.962622s

gif_basic_ipv6overipv4

Passed

N/A

14.948918s

gif_basic_ipv6overipv6

Passed

N/A

14.990162s

gif_ioctl_ipv4overipv4

Passed

N/A

11.278420s

gif_ioctl_ipv4overipv6

Passed

N/A

11.298813s

gif_ioctl_ipv6overipv4

Passed

N/A

16.364281s

gif_ioctl_ipv6overipv6

Passed

N/A

16.297830s

gif_recursive_ipv4overipv4

Passed

N/A

10.517160s

gif_recursive_ipv4overipv6

Passed

N/A

10.527246s

gif_recursive_ipv6overipv4

Passed

N/A

10.512739s

gif_recursive_ipv6overipv6

Passed

N/A

10.536455s

net/if_loop/t_pr

0.348612s

loopmtu

Passed

N/A

0.172956s

loopmtu_csum

Passed

N/A

0.174022s

net/if_pppoe/t_pppoe

86.735868s

pppoe6_chap

Passed

N/A

20.338913s

pppoe6_pap

Passed

N/A

20.174215s

pppoe_chap

Passed

N/A

22.804942s

pppoe_pap

Passed

N/A

23.403530s

net/if_tap/t_tap

13.065465s

tap_bridged

Passed

N/A

5.096543s

tap_create_destroy

Passed

N/A

0.894679s

tap_stand_alone

Passed

N/A

7.066858s

net/if_tun/t_tun

12.530373s

tun_create_destroy

Passed

N/A

0.613382s

tun_setup

Passed

N/A

11.907492s

net/mcast/t_mcast

22.100235s

mcast_conninet4

Passed

N/A

3.114275s

mcast_conninet6

Passed

N/A

2.870335s

mcast_connmappedbuginet4

Passed

N/A

2.459145s

mcast_connmappedinet4

Passed

N/A

2.982747s

mcast_unconninet4

Passed

N/A

2.720359s

mcast_unconninet6

Passed

N/A

2.352095s

mcast_unconnmappedbuginet4

Passed

N/A

2.958915s

mcast_unconnmappedinet4

Passed

N/A

2.616471s

net/mpls/t_mpls_fw

4.959717s

mplsfw4

Passed

N/A

2.455454s

mplsfw4_expl

Passed

N/A

2.493397s

net/mpls/t_mpls_fw6

5.333615s

mplsfw6

Passed

N/A

2.718539s

mplsfw6_expl

Passed

N/A

2.605106s

net/mpls/t_mpls_fw64

5.522912s

mplsfw64_expl

Passed

N/A

2.749095s

mplsfw64_impl

Passed

N/A

2.763571s

net/mpls/t_rfc4182

2.492448s

rfc4182

Passed

N/A

2.487318s

net/mpls/t_ldp_regen

20.727517s

ldp_regen

Passed

N/A

20.724332s

net/ndp/t_dad

28.648608s

dad_basic

Passed

N/A

5.515181s

dad_count

Passed

N/A

16.287498s

dad_duplicated

Passed

N/A

6.835043s

net/ndp/t_ndp

49.464758s

ndp_cache_expiration

Passed

N/A

24.196487s

ndp_cache_overwriting

Passed

N/A

5.071472s

ndp_commands

Passed

N/A

8.084872s

ndp_link_activation

Passed

N/A

6.977977s

ndp_neighborgcthresh

Passed

N/A

5.121178s

net/ndp/t_ra

141.474117s

ra_basic

Passed

N/A

24.751048s

ra_delete_address

Passed

N/A

14.621806s

ra_flush_defrouter_entries

Passed

N/A

8.015738s

ra_flush_prefix_entries

Passed

N/A

8.231521s

ra_multiple_routers

Passed

N/A

26.782069s

ra_multiple_routers_maxifprefixes

Passed

N/A

35.223394s

ra_multiple_routers_single_prefix

Passed

N/A

23.825422s

net/npf/t_npf

2.298993s

npf_bpf

Passed

N/A

0.438069s

npf_nat

Passed

N/A

0.380071s

npf_nbuf

Passed

N/A

0.367280s

npf_rule

Passed

N/A

0.361265s

npf_state

Passed

N/A

0.377406s

npf_table

Passed

N/A

0.369436s

net/route/t_change

3.879179s

route_change_gateway

Passed

N/A

0.714709s

route_change_ifa

Passed

N/A

0.834617s

route_change_ifp

Passed

N/A

0.880178s

route_change_ifp_ifa

Passed

N/A

0.825825s

route_change_reject2blackhole

Passed

N/A

0.617535s

net/route/t_flags

22.313823s

route_flags_announce

Passed

N/A

1.400712s

route_flags_blackhole

Passed

N/A

2.529895s

route_flags_connected

Passed

N/A

1.390601s

route_flags_default_gateway

Passed

N/A

1.357762s

route_flags_icmp_redirect

Passed

N/A

7.921110s

route_flags_lo

Passed

N/A

1.338374s

route_flags_reject

Passed

N/A

4.894150s

route_flags_static

Passed

N/A

1.455673s

net/route/t_flags6

37.424949s

route_flags_announce6

Passed

N/A

4.916775s

route_flags_blackhole6

Passed

N/A

6.103616s

route_flags_connected6

Passed

N/A

4.378541s

route_flags_default_gateway6

Passed

N/A

4.445124s

route_flags_lo6

Passed

N/A

5.050011s

route_flags_reject6

Passed

N/A

7.744743s

route_flags_static6

Passed

N/A

4.763451s

net/route/t_route

12.518376s

route_command_get

Passed

N/A

2.476930s

route_command_get6

Passed

N/A

7.586950s

route_non_subnet_gateway

Passed

N/A

2.444012s

net/if_vlan/t_vlan

13.087428s

vlan_basic

Passed

N/A

12.471341s

vlan_create_destroy

Passed

N/A

0.612666s

sbin/fsck_ffs/t_enable_quotas

11.633574s

corrupt_be_1

Passed

N/A

0.932208s

corrupt_be_2

Passed

N/A

0.591587s

corrupt_le_1

Passed

N/A

0.598000s

corrupt_le_2

Passed

N/A

0.585775s

dir1_be_1

Passed

N/A

0.492390s

dir1_be_2

Passed

N/A

0.453779s

dir1_le_1

Passed

N/A

0.442851s

dir1_le_2

Passed

N/A

0.441780s

disable_be_1

Passed

N/A

0.667155s

disable_be_2

Passed

N/A

0.675458s

disable_le_1

Passed

N/A

0.652134s

disable_le_2

Passed

N/A

0.627838s

notreg_be_1

Passed

N/A

0.579884s

notreg_be_2

Passed

N/A

0.562175s

notreg_le_1

Passed

N/A

0.574157s

notreg_le_2

Passed

N/A

0.567711s

unallocated_be_1

Passed

N/A

0.550182s

unallocated_be_2

Passed

N/A

0.525807s

unallocated_le_1

Passed

N/A

0.550276s

unallocated_le_2

Passed

N/A

0.531941s

sbin/fsck_ffs/t_check_quotas

31.155306s

corrupt_list_be_1

Passed

N/A

0.595819s

corrupt_list_be_2

Passed

N/A

0.591763s

corrupt_list_le_1

Passed

N/A

0.598167s

corrupt_list_le_2

Passed

N/A

0.586135s

expand1_list_be_1

Passed

N/A

0.727988s

expand1_list_be_2

Passed

N/A

0.640934s

expand1_list_le_1

Passed

N/A

0.670870s

expand1_list_le_2

Passed

N/A

0.652895s

expand2_list_be_1

Passed

N/A

6.356335s

expand2_list_be_2

Passed

N/A

6.349349s

expand2_list_le_1

Passed

N/A

6.298407s

expand2_list_le_2

Passed

N/A

6.307171s

sbin/gpt/t_gpt

4.360939s

backup_2part

Passed

N/A

0.494686s

bootable_2part

Skipped

Required file '/usr/mdec/gptmbr.bin' not found

0.000334s

change_attr_2part

Passed

N/A

0.432542s

change_type_2part

Passed

N/A

0.437481s

create_2part

Passed

N/A

0.321651s

create_empty

Passed

N/A

0.213512s

label_2part

Passed

N/A

0.346759s

migrate_disklabel

Failed

atf-check failed; see the output of the test for details

0.255514s

recover_backup

Failed

atf-check failed; see the output of the test for details

0.311452s

recover_primary

Passed

N/A

0.362411s

remove_2part

Passed

N/A

0.309153s

resize_2part

Passed

N/A

0.415246s

restore_2part

Passed

N/A

0.446907s

sbin/ifconfig/t_nonexistent

0.126889s

nonexistent

Passed

N/A

0.126202s

sbin/newfs/t_enable_quotas

2.964494s

enabled_be_1_both

Passed

N/A

0.265040s

enabled_be_1_group

Passed

N/A

0.250154s

enabled_be_1_user

Passed

N/A

0.244251s

enabled_be_2_both

Passed

N/A

0.220694s

enabled_be_2_group

Passed

N/A

0.238323s

enabled_be_2_user

Passed

N/A

0.328141s

enabled_le_1_both

Passed

N/A

0.244271s

enabled_le_1_group

Passed

N/A

0.237910s

enabled_le_1_user

Passed

N/A

0.225821s

enabled_le_2_both

Passed

N/A

0.226996s

enabled_le_2_group

Passed

N/A

0.232030s

enabled_le_2_user

Passed

N/A

0.232593s

sbin/newfs_msdos/t_create

0.242737s

validfat32

Passed

N/A

0.240468s

sbin/resize_ffs/t_check

0.446944s

check_grow

Passed

N/A

0.443150s

sbin/resize_ffs/t_grow

31.381911s

grow_16M_v0_8192

Passed

N/A

10.295727s

grow_16M_v1_16384

Passed

N/A

10.469186s

grow_16M_v2_32768

Passed

N/A

10.161239s

grow_ffsv1_partial_cg

Passed

N/A

0.372354s

sbin/resize_ffs/t_shrink

37.220499s

shrink_24M_16M_v0_32768

Passed

N/A

13.783673s

shrink_24M_16M_v1_65536

Passed

N/A

12.523945s

shrink_24M_16M_v2_4096

Expected failure

PR bin/44205: atf-check failed; see the output of the test for details

10.460739s

shrink_ffsv1_partial_cg

Passed

N/A

0.371845s

sbin/resize_ffs/t_grow_swapped

30.451929s

grow_16M_v0_65536

Passed

N/A

9.466632s

grow_16M_v1_4096

Passed

N/A

10.330954s

grow_16M_v2_8192

Passed

N/A

10.193183s

grow_ffsv1_partial_cg

Passed

N/A

0.377293s

sbin/resize_ffs/t_shrink_swapped

39.068651s

shrink_24M_16M_v0_4096

Passed

N/A

13.764965s

shrink_24M_16M_v1_8192

Passed

N/A

13.948020s

shrink_24M_16M_v2_16384

Expected failure

PR bin/44205: atf-check failed; see the output of the test for details

10.888165s

shrink_ffsv1_partial_cg

Passed

N/A

0.385676s

sbin/route/t_missing

0.123983s

missing

Passed

N/A

0.123273s

sbin/sysctl/t_perm

24.936405s

sysctl_ddb

Passed

N/A

0.646566s

sysctl_hw

Passed

N/A

3.397245s

sysctl_kern

Passed

N/A

6.407619s

sysctl_machdep

Passed

N/A

0.484084s

sysctl_net

Passed

N/A

10.639748s

sysctl_security

Passed

N/A

1.423616s

sysctl_vfs

Passed

N/A

0.909572s

sysctl_vm

Passed

N/A

1.020416s

sbin/sysctl/t_sysctl

0.236926s

basic

Passed

N/A

0.236084s

sys/net/t_print

0.027197s

dl_print

Passed

N/A

0.012461s

sdl_print

Passed

N/A

0.013328s

sys/netatalk/t_print

0.026669s

at_print

Passed

N/A

0.012298s

sat_print

Passed

N/A

0.012895s

sys/netinet/t_print

0.026428s

in_print

Passed

N/A

0.012064s

sin_print

Passed

N/A

0.013046s

sys/netinet6/t_print

0.025978s

in6_print

Passed

N/A

0.011629s

sin6_print

Passed

N/A

0.013026s

sys/rc/t_rc_d_cli

3.862639s

default_restart_no_args

Passed

N/A

0.537358s

default_restart_with_args

Passed

N/A

0.386549s

default_start_no_args

Passed

N/A

0.256783s

default_start_with_args

Passed

N/A

0.260821s

default_stop_no_args

Passed

N/A

0.313577s

default_stop_with_args

Passed

N/A

0.380072s

no_command

Passed

N/A

0.157802s

overriden_custom_no_args

Passed

N/A

0.192876s

overriden_custom_with_args

Passed

N/A

0.197920s

overriden_restart_no_args

Passed

N/A

0.187450s

overriden_restart_with_args

Passed

N/A

0.204162s

overriden_start_no_args

Passed

N/A

0.188667s

overriden_start_with_args

Passed

N/A

0.197398s

overriden_stop_no_args

Passed

N/A

0.190647s

overriden_stop_with_args

Passed

N/A

0.198724s

usr.bin/awk/t_awk

3.934281s

assign_NF

Passed

N/A

0.176087s

big_regexp

Passed

N/A

0.168293s

empty_rs

Passed

N/A

0.144324s

end

Passed

N/A

0.253583s

modify_subsep

Passed

N/A

0.148948s

multibyte

Passed

N/A

0.324228s

newline_rs

Passed

N/A

0.142516s

period

Passed

N/A

0.189133s

regex_caret_1_rs

Passed

N/A

0.144997s

regex_caret_2_rs

Passed

N/A

0.146193s

regex_dollar_1_rs

Passed

N/A

0.146221s

regex_dollar_2_rs

Passed

N/A

0.145420s

regex_or_1_rs

Passed

N/A

0.146756s

regex_or_2_rs

Passed

N/A

0.141225s

regex_or_3_rs

Passed

N/A

0.143337s

regex_reallocation_rs

Passed

N/A

0.181116s

regex_two_star_rs

Passed

N/A

0.144716s

single_char_regex_group_rs

Passed

N/A

0.144873s

single_char_regex_star_rs

Passed

N/A

0.145792s

single_char_rs

Passed

N/A

0.144900s

string1

Passed

N/A

0.152931s

two_char_regex_group_rs

Passed

N/A

0.139445s

two_char_regex_star_rs

Passed

N/A

0.148831s

two_char_rs

Passed

N/A

0.150001s

usr.bin/basename/t_basename

0.538886s

basic

Passed

N/A

0.316267s

suffix

Passed

N/A

0.221308s

usr.bin/bzip2/t_bzip2

1.008901s

basic

Passed

N/A

1.008021s

usr.bin/cc/t_hello

7.199375s

hello

Passed

N/A

3.783357s

hello32

Passed

N/A

2.070146s

hello_pic

Passed

N/A

0.756104s

hello_pie

Passed

N/A

0.583470s

usr.bin/cmp/t_cmp

0.458172s

missing

Passed

N/A

0.241489s

skip

Passed

N/A

0.214666s

usr.bin/config/t_config

2.353885s

deffs_redef

Passed

N/A

0.265900s

devi

Passed

N/A

0.252560s

loop

Passed

N/A

0.166668s

loop2

Passed

N/A

0.154382s

min

Passed

N/A

0.188244s

no_pseudo

Passed

N/A

0.150645s

no_select

Passed

N/A

0.179125s

no_undefined_opt

Passed

N/A

0.163548s

postponed_orphan

Passed

N/A

0.154860s

pseudo_parent

Passed

N/A

0.155922s

select

Passed

N/A

0.179505s

shadow_instance

Passed

N/A

0.152700s

undefined_opt

Passed

N/A

0.152110s

usr.bin/cut/t_cut

1.228465s

basic

Passed

N/A

0.219945s

dflag

Passed

N/A

0.225839s

dsflag

Passed

N/A

0.221268s

latin1

Passed

N/A

0.165817s

sflag

Passed

N/A

0.221657s

utf8

Passed

N/A

0.168836s

usr.bin/diff/t_diff

0.438950s

mallocv

Passed

N/A

0.148366s

nomallocv

Passed

N/A

0.144374s

same

Passed

N/A

0.144072s

usr.bin/dirname/t_dirname

0.366232s

basic

Passed

N/A

0.365385s

usr.bin/find/t_find

0.789005s

emptyperm

Passed

N/A

0.502996s

exit

Passed

N/A

0.140436s

exit_status

Passed

N/A

0.143118s

usr.bin/gdb/t_regress

10.903496s

pie

Passed

N/A

2.918197s

threads

Passed

N/A

7.982810s

usr.bin/grep/t_grep

2.666347s

basic

Passed

N/A

0.188026s

begin_end

Passed

N/A

0.178239s

binary

Passed

N/A

0.146436s

context

Passed

N/A

0.264186s

context2

Passed

N/A

0.273895s

egrep

Passed

N/A

0.147443s

file_exp

Passed

N/A

0.154811s

ignore_case

Passed

N/A

0.139694s

invert

Passed

N/A

0.130620s

negative

Passed

N/A

0.135300s

nonexistent

Passed

N/A

0.126367s

recurse

Passed

N/A

0.143349s

recurse_symlink

Passed

N/A

0.158248s

whole_line

Passed

N/A

0.141962s

word_regexps

Passed

N/A

0.132657s

zgrep

Passed

N/A

0.189047s

usr.bin/gzip/t_gzip

4.204352s

concatenated

Passed

N/A

0.154763s

crcerror

Passed

N/A

0.136836s

good

Passed

N/A

0.140621s

pipe

Passed

N/A

3.630091s

truncated

Passed

N/A

0.137466s

usr.bin/id/t_groups

0.497300s

correct

Passed

N/A

0.310142s

syntax

Passed

N/A

0.184347s

usr.bin/id/t_id

4.762633s

Gflag

Passed

N/A

0.603475s

default

Passed

N/A

0.447869s

gflag

Passed

N/A

1.138685s

pflag

Passed

N/A

0.484040s

primaries

Passed

N/A

0.931734s

uflag

Passed

N/A

1.147804s

usr.bin/id/t_whoami

0.387741s

correct

Passed

N/A

0.195371s

syntax

Passed

N/A

0.189979s

usr.bin/infocmp/t_terminfo

0.672383s

basic

Passed

N/A

0.483000s

missing

Passed

N/A

0.187878s

usr.bin/jot/t_jot

0.323728s

basic

Passed

N/A

0.137987s

format

Passed

N/A

0.184281s

usr.bin/ld/t_script

4.861263s

multisec

Passed

N/A

0.688670s

order_default

Passed

N/A

1.023330s

order_merge

Passed

N/A

1.051921s

order_reorder

Passed

N/A

1.033686s

order_sort

Passed

N/A

1.049063s

usr.bin/ld/t_section

0.989385s

orphan

Passed

N/A

0.558061s

startstop

Passed

N/A

0.428944s

usr.bin/m4/t_m4

0.275427s

eof

Passed

N/A

0.274373s

usr.bin/make/t_make

41.750817s

comment

Passed

N/A

0.938849s

cond1

Passed

N/A

0.811732s

cond2

Passed

N/A

0.781400s

doterror

Passed

N/A

0.793541s

dotwait

Passed

N/A

12.152115s

error

Passed

N/A

0.759736s

escape

Expected failure

see PR toolchain/49085: atf-check failed; see the output of the test for details

0.995719s

export

Passed

N/A

0.815401s

export_all

Passed

N/A

0.835771s

export_env

Passed

N/A

0.796114s

forloop

Passed

N/A

0.909629s

forsubst

Passed

N/A

0.770720s

hash

Passed

N/A

0.807480s

impsrc

Expected failure

see PR toolchain/49085: atf-check failed; see the output of the test for details

0.869936s

misc

Passed

N/A

0.774069s

moderrs

Passed

N/A

0.859150s

modmatch

Passed

N/A

0.946645s

modmisc

Passed

N/A

0.831016s

modorder

Passed

N/A

0.890200s

modts

Passed

N/A

0.932587s

modword

Passed

N/A

1.547019s

order

Passed

N/A

0.785001s

phony_end

Expected failure

see PR toolchain/49085: atf-check failed; see the output of the test for details

0.820003s

posix

Passed

N/A

0.861476s

posix1

Expected failure

see PR toolchain/49085: atf-check failed; see the output of the test for details

1.340063s

qequals

Passed

N/A

0.756599s

suffixes

Expected failure

see PR toolchain/49085: this uses up all memory and then fails

0.530485s

sunshcmd

Passed

N/A

0.820312s

sysv

Passed

N/A

0.824484s

ternary

Passed

N/A

0.902080s

unexport

Passed

N/A

0.790095s

unexport_env

Passed

N/A

0.788607s

varcmd

Passed

N/A

0.925136s

varmisc

Passed

N/A

0.891414s

varshell

Passed

N/A

0.849107s

usr.bin/mkdep/t_mkdep

1.076451s

prefix

Passed

N/A

0.283075s

prefix_and_suffixes

Passed

N/A

0.271869s

suffixes

Passed

N/A

0.518292s

usr.bin/nbperf/t_nbperf

35.772951s

bdz

Passed

N/A

11.421687s

chm

Passed

N/A

14.024012s

chm3

Passed

N/A

10.308050s

usr.bin/netpgpverify/t_netpgpverify

6.011173s

netpgpverify_testset_1_rsa_signatures

Passed

N/A

2.121127s

netpgpverify_testset_2_dsa_signatures

Passed

N/A

3.878314s

usr.bin/pr/t_basic

0.163337s

basic

Passed

N/A

0.162649s

usr.bin/rump_server/t_disk

2.892957s

data

Passed

N/A

0.434854s

notrunc

Passed

N/A

0.343717s

offset

Passed

N/A

0.347573s

size

Passed

N/A

0.342698s

type_blk

Passed

N/A

0.359795s

type_blk_default

Passed

N/A

0.352503s

type_chr

Passed

N/A

0.351619s

type_reg

Passed

N/A

0.350286s

usr.bin/shmif_dumpbus/t_basic

2.408602s

contents

Passed

N/A

0.358344s

header

Passed

N/A

0.218218s

pcap

Passed

N/A

1.818989s

usr.bin/sdiff/t_sdiff

3.240404s

dot

Passed

N/A

0.207106s

flags

Passed

N/A

0.249816s

iflags

Passed

N/A

0.524208s

merge

Passed

N/A

1.163985s

oneline

Passed

N/A

0.197475s

same

Passed

N/A

0.146624s

short

Passed

N/A

0.163173s

stdin

Passed

N/A

0.197982s

tabends

Passed

N/A

0.236048s

tabs

Passed

N/A

0.146635s

usr.bin/sed/t_sed

1.332502s

c2048

Passed

N/A

0.148075s

emptybackref

Expected failure

PR bin/28126: atf-check failed; see the output of the test for details

0.196675s

longlines

Passed

N/A

0.189080s

preserve_leading_ws_ia

Passed

N/A

0.137777s

rangeselection

Passed

N/A

0.657242s

usr.bin/sort/t_sort

8.528073s

any_char

Passed

N/A

0.233583s

basic

Passed

N/A

0.154918s

bflag

Passed

N/A

0.222862s

cflag

Passed

N/A

0.138934s

empty_file

Passed

N/A

0.195527s

end_of_options

Passed

N/A

0.185791s

kflag_alpha

Passed

N/A

0.603322s

kflag_limits

Passed

N/A

0.146879s

kflag_many_fields

Passed

N/A

0.149938s

kflag_no_end

Passed

N/A

0.148258s

kflag_nonmonotone

Passed

N/A

0.142164s

kflag_one_field

Passed

N/A

0.149087s

kflag_outofbounds

Passed

N/A

0.146780s

kflag_two_fields

Passed

N/A

0.148960s

long_file

Passed

N/A

0.533793s

long_records

Passed

N/A

0.201416s

mflag

Passed

N/A

0.159617s

mflag_uflag

Passed

N/A

0.142638s

mflag_uflag_first

Passed

N/A

0.185545s

missing_newline

Passed

N/A

0.137542s

nflag

Passed

N/A

0.156690s

nflag_rflag

Passed

N/A

0.154734s

null_bytes

Passed

N/A

0.139210s

oflag

Passed

N/A

0.177083s

oflag_displaced

Passed

N/A

0.131351s

plus_as_path

Passed

N/A

0.146076s

plus_bad_tempfile

Passed

N/A

0.136398s

plus_no_end

Passed

N/A

0.152890s

plus_nonmonotone

Passed

N/A

0.147345s

plus_one

Passed

N/A

0.150780s

plus_one_minus_two

Passed

N/A

0.154956s

plus_rflag_invalid

Passed

N/A

0.151539s

plus_tflag

Passed

N/A

0.722057s

plus_zero

Passed

N/A

0.136485s

rflag

Passed

N/A

0.148345s

sflag

Passed

N/A

0.149339s

sflag_many_files

Passed

N/A

0.162228s

tflag

Passed

N/A

0.226523s

tflag_alphabetic

Passed

N/A

0.143468s

tflag_char_pos

Passed

N/A

0.251642s

tflag_whitespace

Passed

N/A

0.312790s

uflag

Passed

N/A

0.150668s

uflag_rflag

Passed

N/A

0.154581s

usr.bin/tmux/t_tmux

2.150256s

stdin

Passed

N/A

2.149395s

usr.bin/tr/t_basic

3.721851s

csubst

Passed

N/A

0.227009s

dopt

Passed

N/A

1.490202s

dsopt

Passed

N/A

0.684013s

sopt

Passed

N/A

0.636338s

subst

Passed

N/A

0.681157s

usr.bin/unifdef/t_basic

0.320111s

basic

Passed

N/A

0.166037s

lastline

Passed

N/A

0.152281s

usr.bin/uniq/t_uniq

0.668170s

basic

Passed

N/A

0.143892s

show_duplicates

Passed

N/A

0.125644s

show_duplicates_from_third_character

Passed

N/A

0.127377s

show_uniques

Passed

N/A

0.129746s

test_counts

Passed

N/A

0.138186s

usr.bin/vmstat/t_vmstat

0.278879s

default

Passed

N/A

0.146979s

opt_s

Passed

N/A

0.130379s

usr.bin/xlint/lint1/t_integration

5.952743s

alignof

Passed

N/A

0.250986s

c99_complex_num

Passed

N/A

0.153167s

c99_complex_split

Passed

N/A

0.153353s

c99_decls_after_stmt

Passed

N/A

0.156942s

c99_decls_after_stmt3

Passed

N/A

0.159823s

c99_for_loops

Passed

N/A

0.149488s

c99_func

Passed

N/A

0.149212s

c99_recursive_init

Passed

N/A

0.149199s

c99_struct_init

Passed

N/A

0.149498s

c99_union_init1

Passed

N/A

0.148055s

c99_union_init2

Passed

N/A

0.157831s

c99_union_init3

Passed

N/A

0.155216s

c9x_array_init

Passed

N/A

0.150934s

c9x_recursive_init

Passed

N/A

0.154006s

cast_init

Passed

N/A

0.157381s

cast_init2

Passed

N/A

0.149552s

cast_lhs

Passed

N/A

0.154215s

compound_literals1

Passed

N/A

0.153789s

compound_literals2

Passed

N/A

0.152486s

constant_conv1

Passed

N/A

0.159112s

constant_conv2

Passed

N/A

0.150915s

cvt_in_ternary

Passed

N/A

0.153448s

ellipsis_in_switch

Passed

N/A

0.153908s

gcc_compound_statements1

Passed

N/A

0.150167s

gcc_compound_statements2

Passed

N/A

0.150782s

gcc_compound_statements3

Passed

N/A

0.155075s

gcc_func

Passed

N/A

0.155565s

gcc_variable_array_init

Passed

N/A

0.156871s

incorrect_array_size

Passed

N/A

0.154981s

long_double_int

Passed

N/A

0.150759s

nested_structs

Passed

N/A

0.157294s

nolimit_init

Passed

N/A

0.149508s

packed_structs

Passed

N/A

0.149810s

shift_to_narrower_type

Passed

N/A

0.152370s

type_conv1

Passed

N/A

0.153534s

type_conv2

Passed

N/A

0.160155s

type_conv3

Passed

N/A

0.155290s

zero_sized_arrays

Passed

N/A

0.155078s

usr.sbin/mtree/t_mtree

2.713173s

mtree_check

Passed

N/A

0.192773s

mtree_convert_C

Passed

N/A

0.120461s

mtree_convert_C_S

Passed

N/A

0.126207s

mtree_convert_D

Passed

N/A

0.116882s

mtree_convert_D_S

Passed

N/A

0.115922s

mtree_create

Passed

N/A

0.163458s

mtree_ignore

Passed

N/A

0.207228s

mtree_merge

Passed

N/A

0.146719s

mtree_nonemptydir

Passed

N/A

0.168685s

netbsd6_check

Passed

N/A

0.154823s

netbsd6_convert_C

Passed

N/A

0.121570s

netbsd6_convert_C_S

Passed

N/A

0.118710s

netbsd6_convert_D

Passed

N/A

0.118155s

netbsd6_convert_D_S

Passed

N/A

0.120562s

netbsd6_create

Passed

N/A

0.161848s

netbsd6_ignore

Passed

N/A

0.210602s

netbsd6_merge

Passed

N/A

0.141903s

netbsd6_nonemptydir

Passed

N/A

0.173624s

usr.sbin/tcpdump/t_tcpdump

10.231125s

promiscuous

Passed

N/A

10.230413s

usr.sbin/traceroute/t_traceroute

2.837467s

basic

Passed

N/A

1.403992s

basic_icmp

Passed

N/A

1.429163s

usr.sbin/useradd/t_useradd

0.346660s

longname

Expected failure

PR bin/39546: atf-check failed; see the output of the test for details

0.346038s

fs/ffs/t_fifos

0.183987s

fifos

Passed

N/A

0.183295s

fs/ffs/t_snapshot

5.540240s

snapshot

Passed

N/A

0.976405s

snapshotstress

Passed

N/A

4.562126s

fs/ffs/t_snapshot_log

5.748552s

snapshot

Passed

N/A

1.138730s

snapshotstress

Passed

N/A

4.608274s

fs/ffs/t_snapshot_v2

5.536379s

snapshot

Passed

N/A

0.997957s

snapshotstress

Passed

N/A

4.536939s

fs/ffs/t_mount

0.425242s

48Kimage

Expected failure

PR kern/43573: mount failed: Invalid argument

0.118455s

fsbsizeovermaxbsize

Passed

N/A

0.153351s

fsbsizeovermaxphys

Passed

N/A

0.147617s

fs/ffs/t_quota2_1

6.999190s

quota_1000_O1_be

Passed

N/A

1.282385s

quota_1000_O1_le

Passed

N/A

1.455019s

quota_1000_O2_be

Passed

N/A

1.250090s

quota_1000_O2_le

Passed

N/A

1.429932s

quota_40_O1_be

Passed

N/A

0.260744s

quota_40_O1_le

Passed

N/A

0.256488s

quota_40_O1_log

Passed

N/A

0.250437s

quota_40_O2_be

Passed

N/A

0.268660s

quota_40_O2_le

Passed

N/A

0.262767s

quota_40_O2_log

Passed

N/A

0.261787s

fs/ffs/t_quota2_remount

0.471949s

quota_10_O1_be

Passed

N/A

0.236894s

quota_10_O1_le

Passed

N/A

0.232838s

fs/ffs/t_getquota

9.682406s

get_be_1_both

Passed

N/A

0.830814s

get_be_1_group

Passed

N/A

0.814644s

get_be_1_user

Passed

N/A

0.799859s

get_be_2_both

Passed

N/A

0.795941s

get_be_2_group

Passed

N/A

0.807855s

get_be_2_user

Passed

N/A

0.788090s

get_le_1_both

Passed

N/A

0.797572s

get_le_1_group

Passed

N/A

0.816824s

get_le_1_user

Passed

N/A

0.807160s

get_le_2_both

Passed

N/A

0.793518s

get_le_2_group

Passed

N/A

0.816022s

get_le_2_user

Passed

N/A

0.795286s

fs/ffs/t_setquota

35.087750s

set_be_1_both

Passed

N/A

1.069370s

set_be_1_group

Passed

N/A

0.986488s

set_be_1_user

Passed

N/A

0.958061s

set_be_2_both

Passed

N/A

0.958960s

set_be_2_group

Passed

N/A

0.986845s

set_be_2_user

Passed

N/A

0.943339s

set_default_be_1_both

Passed

N/A

0.815785s

set_default_be_1_group

Passed

N/A

0.815546s

set_default_be_1_user

Passed

N/A

0.828762s

set_default_be_2_both

Passed

N/A

0.820787s

set_default_be_2_group

Passed

N/A

0.815588s

set_default_be_2_user

Passed

N/A

0.804677s

set_default_le_1_both

Passed

N/A

0.824765s

set_default_le_1_group

Passed

N/A

0.834595s

set_default_le_1_user

Passed

N/A

0.844674s

set_default_le_2_both

Passed

N/A

0.821771s

set_default_le_2_group

Passed

N/A

0.814450s

set_default_le_2_user

Passed

N/A

0.807231s

set_le_1_both

Passed

N/A

0.960311s

set_le_1_group

Passed

N/A

1.017494s

set_le_1_user

Passed

N/A

0.930698s

set_le_2_both

Passed

N/A

0.963268s

set_le_2_group

Passed

N/A

0.969661s

set_le_2_user

Passed

N/A

0.937995s

set_new_be_1_both

Passed

N/A

0.833814s

set_new_be_1_both_log

Passed

N/A

0.832995s

set_new_be_1_group

Passed

N/A

0.861141s

set_new_be_1_user

Passed

N/A

0.834232s

set_new_be_2_both

Passed

N/A

0.827448s

set_new_be_2_both_log

Passed

N/A

0.848682s

set_new_be_2_group

Passed

N/A

0.834371s

set_new_be_2_user

Passed

N/A

0.842042s

set_new_le_1_both

Passed

N/A

0.830302s

set_new_le_1_both_log

Passed

N/A

0.855550s

set_new_le_1_group

Passed

N/A

0.852691s

set_new_le_1_user

Passed

N/A

0.867369s

set_new_le_2_both

Passed

N/A

0.837778s

set_new_le_2_both_log

Passed

N/A

0.853632s

set_new_le_2_group

Passed

N/A

0.826481s

set_new_le_2_user

Passed

N/A

0.853796s

fs/ffs/t_quotalimit

25.866070s

herit_defq_le_1_group

Passed

N/A

1.047161s

herit_defq_le_1_group_log

Passed

N/A

1.006426s

herit_defq_le_1_user

Passed

N/A

0.996886s

herit_defq_le_1_user_log

Passed

N/A

1.013349s

herit_idefq_le_1_group_log

Passed

N/A

1.025042s

herit_idefq_le_1_user_log

Passed

N/A

1.029954s

inolimit_le_1_group

Passed

N/A

0.933748s

inolimit_le_1_group_log

Passed

N/A

0.977114s

inolimit_le_1_user

Passed

N/A

0.968846s

inolimit_le_1_user_log

Passed

N/A

1.014463s

limit_le_1_group

Passed

N/A

0.981551s

limit_le_1_group_log

Passed

N/A

0.979554s

limit_le_1_user

Passed

N/A

1.000482s

limit_le_1_user_log

Passed

N/A

0.946826s

sinolimit_le_1_group

Passed

N/A

2.971304s

sinolimit_le_1_user

Passed

N/A

2.953241s

slimit_le_1_group

Passed

N/A

3.005905s

slimit_le_1_user

Passed

N/A

2.985727s

fs/ffs/t_clearquota

14.777939s

clear_be_1_both

Passed

N/A

0.970384s

clear_be_1_both_log

Passed

N/A

0.987369s

clear_be_1_group

Passed

N/A

0.822137s

clear_be_1_user

Passed

N/A

0.830334s

clear_be_2_both

Passed

N/A

1.070461s

clear_be_2_both_log

Passed

N/A

0.993377s

clear_be_2_group

Passed

N/A

0.861574s

clear_be_2_user

Passed

N/A

0.847907s

clear_le_1_both

Passed

N/A

0.988764s

clear_le_1_both_log

Passed

N/A

1.011750s

clear_le_1_group

Passed

N/A

0.849107s

clear_le_1_user

Passed

N/A

0.845057s

clear_le_2_both

Passed

N/A

0.950163s

clear_le_2_both_log

Passed

N/A

0.959891s

clear_le_2_group

Passed

N/A

0.857867s

clear_le_2_user

Passed

N/A

0.906200s

fs/ffs/t_miscquota

22.037829s

default_deny_user

Passed

N/A

0.861651s

default_deny_user_big

Passed

N/A

8.313603s

log_unlink

Passed

N/A

0.829910s

log_unlink_remount

Passed

N/A

0.825937s

npsnapshot_unconf_user

Passed

N/A

1.429072s

npsnapshot_user

Passed

N/A

1.441659s

psnapshot_unconf_user

Passed

N/A

1.450777s

psnapshot_user

Passed

N/A

1.452829s

walk_list_user

Passed

N/A

5.417078s

fs/fifofs/t_fifo

0.600382s

parent_child

Passed

N/A

0.599592s

fs/hfs/t_pathconvert

0.135284s

colonslash

Passed

N/A

0.131971s

fs/kernfs/t_basic

0.131447s

getdents

Passed

N/A

0.062841s

hostname

Passed

N/A

0.067128s

fs/lfs/t_pr

0.258909s

mknod

Passed

N/A

0.246808s

fs/msdosfs/t_snapshot

5.415129s

snapshot

Passed

N/A

0.947172s

snapshotstress

Passed

N/A

4.466469s

fs/nfs/t_mountd

0.806167s

mountdhup

Expected failure

PR kern/5844: op failed with EACCES

0.801380s

fs/nfs/t_rquotad

14.381207s

get_nfs_be_1_both

Passed

N/A

2.616523s

get_nfs_be_1_group

Passed

N/A

2.347110s

get_nfs_be_1_user

Passed

N/A

2.228623s

get_nfs_le_1_both

Passed

N/A

2.578261s

get_nfs_le_1_group

Passed

N/A

2.363204s

get_nfs_le_1_user

Passed

N/A

2.231430s

fs/nullfs/t_basic

0.134593s

basic

Passed

N/A

0.065985s

twistymount

Passed

N/A

0.066865s

fs/psshfs/t_psshfs

7.608030s

inode_nos

Passed

N/A

2.026684s

ls

Passed

N/A

2.041617s

pwd

Passed

N/A

1.762071s

read_empty_file

Passed

N/A

1.761322s

fs/ptyfs/t_ptyfs

0.073002s

basic

Passed

N/A

0.072364s

fs/ptyfs/t_nullpts

0.075234s

nullrevoke

Passed

N/A

0.074497s

fs/puffs/t_basic

1.535754s

inactive_basic

Passed

N/A

0.164616s

inactive_reclaim

Passed

N/A

0.159355s

mount

Passed

N/A

0.149379s

reclaim_hardlink

Passed

N/A

0.160052s

root_chrdev

Passed

N/A

0.158721s

root_fifo

Passed

N/A

0.149038s

root_lnk

Passed

N/A

0.110434s

root_reg

Passed

N/A

0.157602s

signals

Passed

N/A

0.159694s

unlink_accessible

Passed

N/A

0.159009s

fs/puffs/t_fuzz

1.645721s

mountfuzz0

Passed

N/A

0.183642s

mountfuzz1

Passed

N/A

0.172527s

mountfuzz2

Passed

N/A

0.171938s

mountfuzz3

Passed

N/A

0.169501s

mountfuzz4

Passed

N/A

0.170659s

mountfuzz5

Passed

N/A

0.166866s

mountfuzz6

Passed

N/A

0.156022s

mountfuzz7

Passed

N/A

0.167203s

mountfuzz8

Passed

N/A

0.281053s

fs/puffs/t_io

0.181773s

nocache

Passed

N/A

0.181127s

fs/tmpfs/t_renamerace

4.070094s

renamerace2

Passed

N/A

4.069406s

fs/tmpfs/t_create

1.548839s

attrs

Passed

N/A

0.827942s

create

Passed

N/A

0.328428s

kqueue

Passed

N/A

0.389862s

fs/tmpfs/t_devices

0.470897s

basic

Passed

N/A

0.470048s

fs/tmpfs/t_dots

0.680186s

nesteddir

Passed

N/A

0.352093s

topdir

Passed

N/A

0.326422s

fs/tmpfs/t_exec

0.349541s

basic

Passed

N/A

0.348530s

fs/tmpfs/t_link

1.543396s

basic

Passed

N/A

0.496497s

kqueue

Passed

N/A

0.559431s

subdirs

Passed

N/A

0.484517s

fs/tmpfs/t_mkdir

10.359928s

attrs

Passed

N/A

0.845919s

kqueue

Passed

N/A

0.444375s

many

Passed

N/A

8.367245s

nested

Passed

N/A

0.347947s

single

Passed

N/A

0.350432s

fs/tmpfs/t_mknod

1.980504s

block

Passed

N/A

0.307460s

block_kqueue

Passed

N/A

0.352658s

char

Passed

N/A

0.296222s

char_kqueue

Passed

N/A

0.360464s

pipe

Passed

N/A

0.295664s

pipe_kqueue

Passed

N/A

0.362939s

fs/tmpfs/t_mount

1.653384s

attrs

Passed

N/A

0.276829s

large

Passed

N/A

0.332847s

mntpt

Passed

N/A

0.241114s

negative

Passed

N/A

0.269398s

options

Passed

N/A

0.272793s

plain

Passed

N/A

0.254882s

fs/tmpfs/t_pipes

0.304345s

basic

Passed

N/A

0.303324s

fs/tmpfs/t_read_write

0.789374s

basic

Passed

N/A

0.349816s

kqueue

Passed

N/A

0.437732s

fs/tmpfs/t_readdir

4.486645s

caching

Passed

N/A

0.396104s

dots

Passed

N/A

0.349257s

many

Passed

N/A

3.223850s

types

Passed

N/A

0.514054s

fs/tmpfs/t_remove

1.602833s

dot

Passed

N/A

0.351679s

kqueue

Passed

N/A

0.427925s

single

Passed

N/A

0.386725s

uchg

Passed

N/A

0.432981s

fs/tmpfs/t_rename

5.025901s

basic

Passed

N/A

0.389847s

crossdev

Passed

N/A

0.391154s

dir_to_emptydir

Passed

N/A

0.465511s

dir_to_file

Passed

N/A

0.445232s

dir_to_fulldir

Passed

N/A

0.571921s

dotdot

Passed

N/A

0.941820s

dots

Passed

N/A

0.389011s

file_to_dir

Passed

N/A

0.461487s

kqueue

Passed

N/A

0.961881s

fs/tmpfs/t_rmdir

3.338970s

curdir

Passed

N/A

0.346867s

dots

Passed

N/A

0.391861s

kqueue

Passed

N/A

0.455379s

links

Passed

N/A

0.440826s

mntpt

Passed

N/A

0.278801s

nested

Passed

N/A

0.375959s

non_empty

Passed

N/A

0.434724s

non_existent

Passed

N/A

0.278378s

single

Passed

N/A

0.328522s

fs/tmpfs/t_setattr

3.558212s

chgrp

Passed

N/A

0.346604s

chgrp_kqueue

Passed

N/A

0.381824s

chmod

Passed

N/A

0.324559s

chmod_kqueue

Passed

N/A

0.383437s

chown

Passed

N/A

0.337977s

chown_kqueue

Passed

N/A

0.369023s

chowngrp

Passed

N/A

0.331638s

chowngrp_kqueue

Passed

N/A

0.366640s

chtimes

Passed

N/A

0.337026s

chtimes_kqueue

Passed

N/A

0.370548s

fs/tmpfs/t_sizes

1.961206s

big

Passed

N/A

0.460575s

overflow

Passed

N/A

0.524840s

overwrite

Passed

N/A

0.688374s

small

Passed

N/A

0.283771s

fs/tmpfs/t_sockets

0.426745s

basic

Passed

N/A

0.425727s

fs/tmpfs/t_statvfs

0.276694s

values

Passed

N/A

0.275892s

fs/tmpfs/t_symlink

1.631972s

dir

Passed

N/A

0.478712s

exec

Passed

N/A

0.370076s

file

Passed

N/A

0.360497s

kqueue

Passed

N/A

0.419268s

fs/tmpfs/t_times

6.445033s

empty

Passed

N/A

2.379213s

link

Passed

N/A

1.336729s

non_empty

Passed

N/A

1.329546s

rename

Passed

N/A

1.395629s

fs/tmpfs/t_trail_slash

0.378323s

main

Passed

N/A

0.377513s

fs/tmpfs/t_truncate

0.322693s

basic

Passed

N/A

0.321886s

fs/tmpfs/t_vnd

3.439593s

basic

Passed

N/A

3.438578s

fs/tmpfs/t_vnode_leak

21.078121s

main

Passed

N/A

21.077041s

fs/umapfs/t_basic

0.072579s

basic

Passed

N/A

0.071835s

fs/union/t_pr

0.235861s

devnull1

Passed

N/A

0.077939s

devnull2

Passed

N/A

0.078042s

multilayer

Passed

N/A

0.077876s

fs/vfs/t_full

10.251181s

ext2fs_fillfs

Passed

N/A

0.680628s

ffs_fillfs

Passed

N/A

0.423212s

ffslog_fillfs

Passed

N/A

0.419933s

lfs_fillfs

Passed

N/A

0.742338s

msdosfs_fillfs

Passed

N/A

0.440150s

nfs_fillfs

Passed

N/A

1.417670s

p2k_ffs_fillfs

Skipped

fs does not support explicit block allocation (GOP_ALLOC)

0.392962s

puffs_fillfs

Skipped

fs does not support explicit block allocation (GOP_ALLOC)

0.305026s

rumpfs_fillfs

Skipped

fs does not support explicit block allocation (GOP_ALLOC)

0.284345s

sysvbfs_fillfs

Passed

N/A

0.822785s

tmpfs_fillfs

Passed

N/A

0.349071s

udf_fillfs

Passed

N/A

1.143408s

v7fs_fillfs

Passed

N/A

2.716701s

fs/vfs/t_io

50.759925s

ext2fs_extendfile

Passed

N/A

0.317517s

ext2fs_extendfile_append

Passed

N/A

0.326102s

ext2fs_holywrite

Passed

N/A

0.334984s

ext2fs_overwrite512

Passed

N/A

0.307847s

ext2fs_overwrite64k

Passed

N/A

0.334566s

ext2fs_overwrite_trunc

Passed

N/A

0.334635s

ext2fs_read_after_unlink

Passed

N/A

0.313874s

ext2fs_read_fault

Passed

N/A

0.307844s

ext2fs_shrinkfile

Passed

N/A

0.331657s

ext2fs_wrrd_after_unlink

Passed

N/A

0.334754s

ffs_extendfile

Passed

N/A

0.318445s

ffs_extendfile_append

Passed

N/A

0.325733s

ffs_holywrite

Passed

N/A

0.339773s

ffs_overwrite512

Passed

N/A

0.339798s

ffs_overwrite64k

Passed

N/A

0.342804s

ffs_overwrite_trunc

Passed

N/A

0.336962s

ffs_read_after_unlink

Passed

N/A

0.317959s

ffs_read_fault

Passed

N/A

0.314099s

ffs_shrinkfile

Passed

N/A

0.334955s

ffs_wrrd_after_unlink

Passed

N/A

0.320059s

ffslog_extendfile

Passed

N/A

0.330179s

ffslog_extendfile_append

Passed

N/A

0.344762s

ffslog_holywrite

Passed

N/A

0.344589s

ffslog_overwrite512

Passed

N/A

0.343805s

ffslog_overwrite64k

Passed

N/A

0.344870s

ffslog_overwrite_trunc

Passed

N/A

0.327031s

ffslog_read_after_unlink

Passed

N/A

0.330393s

ffslog_read_fault

Passed

N/A

0.326851s

ffslog_shrinkfile

Passed

N/A

0.322373s

ffslog_wrrd_after_unlink

Passed

N/A

0.322542s

lfs_extendfile

Passed

N/A

0.418756s

lfs_extendfile_append

Passed

N/A

0.397041s

lfs_holywrite

Passed

N/A

0.418865s

lfs_overwrite512

Passed

N/A

0.419489s

lfs_overwrite64k

Passed

N/A

0.406572s

lfs_overwrite_trunc

Passed

N/A

0.399488s

lfs_read_after_unlink

Passed

N/A

0.397492s

lfs_read_fault

Passed

N/A

0.429479s

lfs_shrinkfile

Passed

N/A

0.398404s

lfs_wrrd_after_unlink

Passed

N/A

0.397953s

msdosfs_extendfile

Passed

N/A

0.324501s

msdosfs_extendfile_append

Passed

N/A

0.319858s

msdosfs_holywrite

Passed

N/A

0.325977s

msdosfs_overwrite512

Passed

N/A

0.307307s

msdosfs_overwrite64k

Passed

N/A

0.325436s

msdosfs_overwrite_trunc

Passed

N/A

0.325770s

msdosfs_read_after_unlink

Passed

N/A

0.327624s

msdosfs_read_fault

Passed

N/A

0.326083s

msdosfs_shrinkfile

Passed

N/A

0.323632s

msdosfs_wrrd_after_unlink

Passed

N/A

0.323507s

nfs_extendfile

Passed

N/A

0.667096s

nfs_extendfile_append

Passed

N/A

0.629935s

nfs_holywrite

Passed

N/A

0.616204s

nfs_overwrite512

Passed

N/A

0.653819s

nfs_overwrite64k

Passed

N/A

0.667556s

nfs_overwrite_trunc

Passed

N/A

0.654700s

nfs_read_after_unlink

Passed

N/A

0.638542s

nfs_read_fault

Passed

N/A

0.651055s

nfs_shrinkfile

Passed

N/A

0.645968s

nfs_wrrd_after_unlink

Passed

N/A

0.660526s

p2k_ffs_extendfile

Passed

N/A

0.448896s

p2k_ffs_extendfile_append

Passed

N/A

0.448005s

p2k_ffs_holywrite

Passed

N/A

0.478184s

p2k_ffs_overwrite512

Passed

N/A

0.458263s

p2k_ffs_overwrite64k

Passed

N/A

0.467936s

p2k_ffs_overwrite_trunc

Passed

N/A

0.478125s

p2k_ffs_read_after_unlink

Passed

N/A

0.477974s

p2k_ffs_read_fault

Passed

N/A

0.447944s

p2k_ffs_shrinkfile

Passed

N/A

0.488033s

p2k_ffs_wrrd_after_unlink

Passed

N/A

0.448074s

puffs_extendfile

Passed

N/A

0.357963s

puffs_extendfile_append

Passed

N/A

0.349278s

puffs_holywrite

Passed

N/A

0.349469s

puffs_overwrite512

Passed

N/A

0.349382s

puffs_overwrite64k

Passed

N/A

0.359389s

puffs_overwrite_trunc

Passed

N/A

0.379365s

puffs_read_after_unlink

Passed

N/A

0.349021s

puffs_read_fault

Passed

N/A

0.349489s

puffs_shrinkfile

Passed

N/A

0.359173s

puffs_wrrd_after_unlink

Passed

N/A

0.359130s

rumpfs_extendfile

Passed

N/A

0.279552s

rumpfs_extendfile_append

Passed

N/A

0.278624s

rumpfs_holywrite

Passed

N/A

0.300098s

rumpfs_overwrite512

Passed

N/A

0.280489s

rumpfs_overwrite64k

Passed

N/A

0.303640s

rumpfs_overwrite_trunc

Passed

N/A

0.305465s

rumpfs_read_after_unlink

Passed

N/A

0.280847s

rumpfs_read_fault

Passed

N/A

0.283310s

rumpfs_shrinkfile

Passed

N/A

0.296219s

rumpfs_wrrd_after_unlink

Passed

N/A

0.282730s

sysvbfs_extendfile

Passed

N/A

0.308649s

sysvbfs_extendfile_append

Passed

N/A

0.296610s

sysvbfs_holywrite

Passed

N/A

0.329204s

sysvbfs_overwrite512

Passed

N/A

0.320636s

sysvbfs_overwrite64k

Passed

N/A

0.330540s

sysvbfs_overwrite_trunc

Passed

N/A

0.311238s

sysvbfs_read_after_unlink

Passed

N/A

0.303194s

sysvbfs_read_fault

Passed

N/A

0.301520s

sysvbfs_shrinkfile

Passed

N/A

0.317665s

sysvbfs_wrrd_after_unlink

Passed

N/A

0.299926s

tmpfs_extendfile

Passed

N/A

0.303968s

tmpfs_extendfile_append

Passed

N/A

0.281850s

tmpfs_holywrite

Passed

N/A

0.284712s

tmpfs_overwrite512

Passed

N/A

0.284312s

tmpfs_overwrite64k

Passed

N/A

0.280829s

tmpfs_overwrite_trunc

Passed

N/A

0.283653s

tmpfs_read_after_unlink

Passed

N/A

0.282439s

tmpfs_read_fault

Passed

N/A

0.305331s

tmpfs_shrinkfile

Passed

N/A

0.280039s

tmpfs_wrrd_after_unlink

Passed

N/A

0.282225s

udf_extendfile

Passed

N/A

0.588239s

udf_extendfile_append

Passed

N/A

0.568188s

udf_holywrite

Passed

N/A

0.578941s

udf_overwrite512

Passed

N/A

0.578886s

udf_overwrite64k

Passed

N/A

0.577822s

udf_overwrite_trunc

Passed

N/A

0.587906s

udf_read_after_unlink

Passed

N/A

0.848130s

udf_read_fault

Passed

N/A

0.588896s

udf_shrinkfile

Passed

N/A

0.578644s

udf_wrrd_after_unlink

Passed

N/A

0.568295s

v7fs_extendfile

Passed

N/A

0.336936s

v7fs_extendfile_append

Passed

N/A

0.313786s

v7fs_holywrite

Passed

N/A

0.319338s

v7fs_overwrite512

Passed

N/A

0.319718s

v7fs_overwrite64k

Passed

N/A

0.344753s

v7fs_overwrite_trunc

Passed

N/A

0.385128s

v7fs_read_after_unlink

Passed

N/A

0.322884s

v7fs_read_fault

Passed

N/A

0.316794s

v7fs_shrinkfile

Passed

N/A

0.334941s

v7fs_wrrd_after_unlink

Passed

N/A

0.622853s

fs/vfs/t_renamerace

116.597750s

ext2fs_renamerace

Passed

N/A

5.340880s

ext2fs_renamerace_dirs

Passed

N/A

5.344781s

ffs_renamerace

Passed

N/A

5.329368s

ffs_renamerace_dirs

Passed

N/A

5.327855s

ffslog_renamerace

Passed

N/A

5.336523s

ffslog_renamerace_dirs

Passed

N/A

5.341851s

lfs_renamerace

Passed

N/A

5.727586s

lfs_renamerace_dirs

Passed

N/A

5.765605s

msdosfs_renamerace

Expected failure

PR kern/43626: unmount failed: Device busy

5.312780s

msdosfs_renamerace_dirs

Expected signal

PR kern/43626

1.099159s

nfs_renamerace

Passed

N/A

5.690357s

nfs_renamerace_dirs

Passed

N/A

5.666080s

p2k_ffs_renamerace

Passed

N/A

5.473392s

p2k_ffs_renamerace_dirs

Passed

N/A

5.446767s

puffs_renamerace

Passed

N/A

5.357375s

puffs_renamerace_dirs

Passed

N/A

5.519644s

rumpfs_renamerace

Skipped

rename not supported by file system

0.264526s

rumpfs_renamerace_dirs

Skipped

rename not supported by file system

0.285095s

sysvbfs_renamerace

Skipped

filesystem has not enough inodes

0.297526s

sysvbfs_renamerace_dirs

Skipped

directories not supported by file system

0.305752s

tmpfs_renamerace

Passed

N/A

5.285284s

tmpfs_renamerace_dirs

Passed

N/A

5.297105s

udf_renamerace

Expected failure

PR kern/49046: race did not trigger this time

5.322826s

udf_renamerace_dirs

Passed

N/A

5.566170s

v7fs_renamerace

Passed

N/A

5.362587s

v7fs_renamerace_dirs

Passed

N/A

5.388113s

fs/vfs/t_ro

29.182889s

ext2fs_attrs

Passed

N/A

0.304866s

ext2fs_create

Passed

N/A

0.319764s

ext2fs_createdir

Passed

N/A

0.324900s

ext2fs_createfifo

Passed

N/A

0.300704s

ext2fs_createlink

Passed

N/A

0.300821s

ext2fs_createsymlink

Passed

N/A

0.318431s

ext2fs_fileio

Passed

N/A

0.321790s

ext2fs_rmfile

Passed

N/A

0.322539s

ffs_attrs

Passed

N/A

0.314349s

ffs_create

Passed

N/A

0.315708s

ffs_createdir

Passed

N/A

0.335045s

ffs_createfifo

Passed

N/A

0.306851s

ffs_createlink

Passed

N/A

0.330392s

ffs_createsymlink

Passed

N/A

0.307036s

ffs_fileio

Passed

N/A

0.310371s

ffs_rmfile

Passed

N/A

0.311406s

ffslog_attrs

Passed

N/A

0.340873s

ffslog_create

Passed

N/A

0.319249s

ffslog_createdir

Passed

N/A

0.330649s

ffslog_createfifo

Passed

N/A

0.338014s

ffslog_createlink

Passed

N/A

0.336474s

ffslog_createsymlink

Passed

N/A

0.315633s

ffslog_fileio

Passed

N/A

0.318335s

ffslog_rmfile

Passed

N/A

0.324664s

msdosfs_attrs

Passed

N/A

0.319752s

msdosfs_create

Passed

N/A

0.293521s

msdosfs_createdir

Passed

N/A

0.297403s

msdosfs_createfifo

Passed

N/A

0.312084s

msdosfs_createlink

Passed

N/A

0.317996s

msdosfs_createsymlink

Passed

N/A

0.295086s

msdosfs_fileio

Passed

N/A

0.320942s

msdosfs_rmfile

Passed

N/A

0.306169s

nfs_attrs

Passed

N/A

0.648921s

nfs_create

Passed

N/A

0.671633s

nfs_createdir

Passed

N/A

0.614765s

nfs_createfifo

Passed

N/A

0.608701s

nfs_createlink

Passed

N/A

0.631850s

nfs_createsymlink

Passed

N/A

0.645033s

nfs_fileio

Passed

N/A

0.647629s

nfs_rmfile

Passed

N/A

0.652593s

nfsro_attrs

Passed

N/A

0.641776s

nfsro_create

Passed

N/A

0.622819s

nfsro_createdir

Passed

N/A

0.649864s

nfsro_createfifo

Passed

N/A

0.650489s

nfsro_createlink

Passed

N/A

0.645304s

nfsro_createsymlink

Passed

N/A

0.626186s

nfsro_fileio

Passed

N/A

0.649061s

nfsro_rmfile

Passed

N/A

0.664030s

sysvbfs_attrs

Passed

N/A

0.316391s

sysvbfs_create

Passed

N/A

0.300253s

sysvbfs_createdir

Passed

N/A

0.291454s

sysvbfs_createfifo

Passed

N/A

0.288862s

sysvbfs_createlink

Passed

N/A

0.292675s

sysvbfs_createsymlink

Passed

N/A

0.309920s

sysvbfs_fileio

Passed

N/A

0.296572s

sysvbfs_rmfile

Passed

N/A

0.311451s

udf_attrs

Passed

N/A

0.590848s

udf_create

Passed

N/A

0.324618s

udf_createdir

Passed

N/A

0.324432s

udf_createfifo

Passed

N/A

0.326487s

udf_createlink

Passed

N/A

0.578875s

udf_createsymlink

Passed

N/A

0.324788s

udf_fileio

Passed

N/A

0.592052s

udf_rmfile

Passed

N/A

0.567901s

v7fs_attrs

Passed

N/A

0.332030s

v7fs_create

Passed

N/A

0.340527s

v7fs_createdir

Passed

N/A

0.308950s

v7fs_createfifo

Passed

N/A

0.304483s

v7fs_createlink

Passed

N/A

0.315199s

v7fs_createsymlink

Passed

N/A

0.310176s

v7fs_fileio

Passed

N/A

0.331948s

v7fs_rmfile

Passed

N/A

0.333191s

fs/vfs/t_rmdirrace

124.953835s

ext2fs_race

Passed

N/A

10.329462s

ffs_race

Passed

N/A

10.315864s

ffslog_race

Passed

N/A

10.331230s

lfs_race

Passed

N/A

10.437114s

msdosfs_race

Passed

N/A

10.298609s

nfs_race

Passed

N/A

10.639289s

p2k_ffs_race

Passed

N/A

10.439587s

puffs_race

Passed

N/A

10.348033s

rumpfs_race

Passed

N/A

10.289791s

sysvbfs_race

Skipped

directories not supported by file system

0.293689s

tmpfs_race

Passed

N/A

10.275741s

udf_race

Passed

N/A

10.609516s

v7fs_race

Passed

N/A

10.309077s

fs/vfs/t_union

9.527770s

ext2fs_basic

Skipped

fs does not support VOP_WHITEOUT

0.313800s

ext2fs_whiteout

Skipped

fs does not support VOP_WHITEOUT

0.356192s

ffs_basic

Passed

N/A

0.332795s

ffs_whiteout

Passed

N/A

0.347738s

ffslog_basic

Passed

N/A

0.318832s

ffslog_whiteout

Passed

N/A

0.346411s

lfs_basic

Passed

N/A

0.392924s

lfs_whiteout

Passed

N/A

0.422991s

msdosfs_basic

Skipped

fs does not support VOP_WHITEOUT

0.307678s

msdosfs_whiteout

Skipped

fs does not support VOP_WHITEOUT

0.331622s

nfs_basic

Skipped

fs does not support VOP_WHITEOUT

0.631683s

nfs_whiteout

Skipped

fs does not support VOP_WHITEOUT

0.635609s

p2k_ffs_basic

Skipped

fs does not support VOP_WHITEOUT

0.422087s

p2k_ffs_whiteout

Skipped

fs does not support VOP_WHITEOUT

0.456687s

puffs_basic

Skipped

fs does not support VOP_WHITEOUT

0.316088s

puffs_whiteout

Skipped

fs does not support VOP_WHITEOUT

0.350344s

rumpfs_basic

Passed

N/A

0.275439s

rumpfs_whiteout

Passed

N/A

0.333045s

sysvbfs_basic

Skipped

fs does not support VOP_WHITEOUT

0.311162s

sysvbfs_whiteout

Skipped

fs does not support VOP_WHITEOUT

0.341511s

tmpfs_basic

Passed

N/A

0.288451s

tmpfs_whiteout

Passed

N/A

0.312224s

udf_basic

Skipped

fs does not support VOP_WHITEOUT

0.293165s

udf_whiteout

Skipped

fs does not support VOP_WHITEOUT

0.363863s

v7fs_basic

Skipped

fs does not support VOP_WHITEOUT

0.303912s

v7fs_whiteout

Skipped

fs does not support VOP_WHITEOUT

0.341237s

fs/vfs/t_unpriv

19.077013s

ext2fs_dirperms

Passed

N/A

0.308341s

ext2fs_flags

Passed

N/A

0.298107s

ext2fs_owner

Passed

N/A

0.314083s

ext2fs_times

Passed

N/A

0.333394s

ffs_dirperms

Passed

N/A

0.346556s

ffs_flags

Passed

N/A

0.328902s

ffs_owner

Passed

N/A

0.318022s

ffs_times

Passed

N/A

0.332304s

ffslog_dirperms

Passed

N/A

0.335338s

ffslog_flags

Passed

N/A

0.323751s

ffslog_owner

Passed

N/A

0.315329s

ffslog_times

Passed

N/A

0.317945s

lfs_dirperms

Passed

N/A

0.411185s

lfs_flags

Passed

N/A

0.385613s

lfs_owner

Passed

N/A

0.384472s

lfs_times

Passed

N/A

0.412719s

msdosfs_dirperms

Passed

N/A

0.315443s

msdosfs_flags

Passed

N/A

0.304901s

msdosfs_owner

Skipped

owner not supported by file system

0.291857s

msdosfs_times

Passed

N/A

0.317513s

nfs_dirperms

Passed

N/A

0.652508s

nfs_flags

Skipped

file flags not supported by file system

0.635245s

nfs_owner

Passed

N/A

0.635178s

nfs_times

Passed

N/A

0.668152s

p2k_ffs_dirperms

Passed

N/A

0.439388s

p2k_ffs_flags

Passed

N/A

0.477922s

p2k_ffs_owner

Passed

N/A

0.438076s

p2k_ffs_times

Passed

N/A

0.478346s

puffs_dirperms

Passed

N/A

0.338066s

puffs_flags

Skipped

file flags not supported by file system

0.317328s

puffs_owner

Passed

N/A

0.360935s

puffs_times

Passed

N/A

0.369388s

rumpfs_dirperms

Passed

N/A

0.270120s

rumpfs_flags

Passed

N/A

0.280144s

rumpfs_owner

Passed

N/A

0.269052s

rumpfs_times

Passed

N/A

0.271129s

sysvbfs_dirperms

Skipped

directories not supported by file system

0.288014s

sysvbfs_flags

Skipped

file flags not supported by file system

0.307836s

sysvbfs_owner

Passed

N/A

0.309904s

sysvbfs_times

Passed

N/A

0.298065s

tmpfs_dirperms

Passed

N/A

0.288676s

tmpfs_flags

Passed

N/A

0.274146s

tmpfs_owner

Passed

N/A

0.271668s

tmpfs_times

Passed

N/A

0.279449s

udf_dirperms

Passed

N/A

0.564260s

udf_flags

Skipped

file flags not supported by file system

0.318957s

udf_owner

Passed

N/A

0.309040s

udf_times

Passed

N/A

0.557292s

v7fs_dirperms

Passed

N/A

0.316913s

v7fs_flags

Passed

N/A

0.311041s

v7fs_owner

Passed

N/A

0.328420s

v7fs_times

Passed

N/A

0.331715s

fs/vfs/t_vfsops

27.740578s

ext2fs_tfhinval

Passed

N/A

0.323436s

ext2fs_tfhremove

Passed

N/A

0.300097s

ext2fs_tfilehandle

Passed

N/A

0.300233s

ext2fs_tmount

Passed

N/A

0.316725s

ext2fs_tstatvfs

Passed

N/A

0.318971s

ext2fs_tsync

Passed

N/A

0.299890s

ffs_tfhinval

Passed

N/A

0.328451s

ffs_tfhremove

Passed

N/A

0.316604s

ffs_tfilehandle

Passed

N/A

0.331062s

ffs_tmount

Passed

N/A

0.308268s

ffs_tstatvfs

Passed

N/A

0.327955s

ffs_tsync

Passed

N/A

0.326352s

ffslog_tfhinval

Passed

N/A

0.337015s

ffslog_tfhremove

Passed

N/A

0.316841s

ffslog_tfilehandle

Passed

N/A

0.318566s

ffslog_tmount

Passed

N/A

0.339493s

ffslog_tstatvfs

Passed

N/A

0.332550s

ffslog_tsync

Passed

N/A

0.314974s

lfs_tfhinval

Passed

N/A

0.389841s

lfs_tfhremove

Expected failure

fhopen() for removed file succeeds (PR kern/43745): /usr/src/tests/fs/vfs/t_vfsops.c:152: Expected true value in rump_sys_fhopen(fhp, fhsize, O_RDONLY) == -1

0.380152s

lfs_tfilehandle

Passed

N/A

0.416042s

lfs_tmount

Passed

N/A

0.384964s

lfs_tstatvfs

Passed

N/A

0.409744s

lfs_tsync

Passed

N/A

0.410599s

msdosfs_tfhinval

Passed

N/A

0.295203s

msdosfs_tfhremove

Passed

N/A

0.316419s

msdosfs_tfilehandle

Passed

N/A

0.327058s

msdosfs_tmount

Passed

N/A

0.312777s

msdosfs_tstatvfs

Passed

N/A

0.295702s

msdosfs_tsync

Passed

N/A

0.296287s

nfs_tfhinval

Passed

N/A

0.630498s

nfs_tfhremove

Passed

N/A

0.621369s

nfs_tfilehandle

Passed

N/A

0.638806s

nfs_tmount

Passed

N/A

0.606715s

nfs_tstatvfs

Passed

N/A

0.616282s

nfs_tsync

Passed

N/A

0.640045s

p2k_ffs_tfhinval

Passed

N/A

0.457802s

p2k_ffs_tfhremove

Passed

N/A

0.477608s

p2k_ffs_tfilehandle

Passed

N/A

0.448485s

p2k_ffs_tmount

Passed

N/A

0.427952s

p2k_ffs_tstatvfs

Passed

N/A

0.438368s

p2k_ffs_tsync

Passed

N/A

0.457907s

puffs_tfhinval

Passed

N/A

0.348029s

puffs_tfhremove

Passed

N/A

0.358580s

puffs_tfilehandle

Passed

N/A

0.349153s

puffs_tmount

Passed

N/A

0.359485s

puffs_tstatvfs

Passed

N/A

0.349533s

puffs_tsync

Passed

N/A

0.339195s

rumpfs_tfhinval

Skipped

file handles not supported

0.289356s

rumpfs_tfhremove

Skipped

file handles not supported

0.270513s

rumpfs_tfilehandle

Skipped

file handles not supported

0.271336s

rumpfs_tmount

Passed

N/A

0.269678s

rumpfs_tstatvfs

Passed

N/A

0.269206s

rumpfs_tsync

Passed

N/A

0.287829s

sysvbfs_tfhinval

Skipped

file handles not supported

0.306973s

sysvbfs_tfhremove

Skipped

file handles not supported

0.305240s

sysvbfs_tfilehandle

Skipped

file handles not supported

0.290309s

sysvbfs_tmount

Passed

N/A

0.290499s

sysvbfs_tstatvfs

Passed

N/A

0.313205s

sysvbfs_tsync

Passed

N/A

0.311310s

tmpfs_tfhinval

Passed

N/A

0.297493s

tmpfs_tfhremove

Passed

N/A

0.284980s

tmpfs_tfilehandle

Passed

N/A

0.278105s

tmpfs_tmount

Passed

N/A

0.272794s

tmpfs_tstatvfs

Passed

N/A

0.292319s

tmpfs_tsync

Passed

N/A

0.298263s

udf_tfhinval

Skipped

file handles not supported

0.305032s

udf_tfhremove

Skipped

file handles not supported

0.304611s

udf_tfilehandle

Skipped

file handles not supported

0.303219s

udf_tmount

Passed

N/A

0.319954s

udf_tstatvfs

Passed

N/A

0.318408s

udf_tsync

Passed

N/A

0.297418s

v7fs_tfhinval

Skipped

file handles not supported

0.326885s

v7fs_tfhremove

Skipped

file handles not supported

0.305380s

v7fs_tfilehandle

Skipped

file handles not supported

0.329524s

v7fs_tmount

Passed

N/A

0.327815s

v7fs_tstatvfs

Passed

N/A

0.328422s

v7fs_tsync

Passed

N/A

0.327437s

fs/vfs/t_vnops

161.403927s

ext2fs_access_simple

Passed

N/A

0.352900s

ext2fs_attrs

Passed

N/A

0.354900s

ext2fs_create_exist

Passed

N/A

0.349238s

ext2fs_create_many

Passed

N/A

2.679278s

ext2fs_create_nametoolong

Passed

N/A

0.332981s

ext2fs_create_nonalphanum

Passed

N/A

0.493560s

ext2fs_dir_notempty

Passed

N/A

0.335514s

ext2fs_dir_rmdirdotdot

Passed

N/A

0.326345s

ext2fs_dir_simple

Passed

N/A

0.325063s

ext2fs_fcntl_getlock_pids

Passed

N/A

0.336707s

ext2fs_fcntl_lock

Passed

N/A

0.345306s

ext2fs_lookup_complex

Passed

N/A

0.323210s

ext2fs_lookup_simple

Passed

N/A

0.352834s

ext2fs_lstat_symlink

Passed

N/A

0.323185s

ext2fs_read_directory

Passed

N/A

0.342650s

ext2fs_rename_dir

Passed

N/A

0.327998s

ext2fs_rename_dotdot

Passed

N/A

0.338750s

ext2fs_rename_nametoolong

Passed

N/A

0.344289s

ext2fs_rename_reg_nodir

Passed

N/A

0.354593s

ext2fs_symlink_long

Passed

N/A

0.342396s

ext2fs_symlink_root

Passed

N/A

0.346132s

ext2fs_symlink_zerolen

Passed

N/A

0.345774s

ffs_access_simple

Passed

N/A

0.333716s

ffs_attrs

Passed

N/A

0.332500s

ffs_create_exist

Passed

N/A

0.364936s

ffs_create_many

Passed

N/A

1.533021s

ffs_create_nametoolong

Passed

N/A

0.331492s

ffs_create_nonalphanum

Passed

N/A

0.474778s

ffs_dir_notempty

Passed

N/A

0.335039s

ffs_dir_rmdirdotdot

Passed

N/A

0.341328s

ffs_dir_simple

Passed

N/A

0.354381s

ffs_fcntl_getlock_pids

Passed

N/A

0.361531s

ffs_fcntl_lock

Passed

N/A

0.336182s

ffs_lookup_complex

Passed

N/A

0.335398s

ffs_lookup_simple

Passed

N/A

0.351740s

ffs_lstat_symlink

Passed

N/A

0.333260s

ffs_read_directory

Passed

N/A

0.356736s

ffs_rename_dir

Passed

N/A

0.346360s

ffs_rename_dotdot

Passed

N/A

0.336080s

ffs_rename_nametoolong

Passed

N/A

0.355279s

ffs_rename_reg_nodir

Passed

N/A

0.355154s

ffs_symlink_long

Passed

N/A

0.357683s

ffs_symlink_root

Passed

N/A

0.333081s

ffs_symlink_zerolen

Passed

N/A

0.361654s

ffslog_access_simple

Passed

N/A

0.356728s

ffslog_attrs

Passed

N/A

0.339763s

ffslog_create_exist

Passed

N/A

0.357798s

ffslog_create_many

Passed

N/A

1.278606s

ffslog_create_nametoolong

Passed

N/A

0.341424s

ffslog_create_nonalphanum

Passed

N/A

0.473750s

ffslog_dir_notempty

Passed

N/A

0.341425s

ffslog_dir_rmdirdotdot

Passed

N/A

0.361291s

ffslog_dir_simple

Passed

N/A

0.361078s

ffslog_fcntl_getlock_pids

Passed

N/A

0.363382s

ffslog_fcntl_lock

Passed

N/A

0.347183s

ffslog_lookup_complex

Passed

N/A

0.340200s

ffslog_lookup_simple

Passed

N/A

0.344881s

ffslog_lstat_symlink

Passed

N/A

0.350404s

ffslog_read_directory

Passed

N/A

0.342611s

ffslog_rename_dir

Passed

N/A

0.367899s

ffslog_rename_dotdot

Passed

N/A

0.347875s

ffslog_rename_nametoolong

Passed

N/A

0.339962s

ffslog_rename_reg_nodir

Passed

N/A

0.362085s

ffslog_symlink_long

Passed

N/A

0.368979s

ffslog_symlink_root

Passed

N/A

0.338026s

ffslog_symlink_zerolen

Passed

N/A

0.339129s

lfs_access_simple

Passed

N/A

0.437528s

lfs_attrs

Passed

N/A

0.434115s

lfs_create_exist

Passed

N/A

0.415430s

lfs_create_many

Passed

N/A

3.551912s

lfs_create_nametoolong

Passed

N/A

0.409515s

lfs_create_nonalphanum

Passed

N/A

1.490521s

lfs_dir_notempty

Passed

N/A

0.423621s

lfs_dir_rmdirdotdot

Passed

N/A

0.435075s

lfs_dir_simple

Passed

N/A

0.413166s

lfs_fcntl_getlock_pids

Passed

N/A

0.414461s

lfs_fcntl_lock

Passed

N/A

0.437626s

lfs_lookup_complex

Passed

N/A

0.409679s

lfs_lookup_simple

Passed

N/A

0.434210s

lfs_lstat_symlink

Passed

N/A

0.407143s

lfs_read_directory

Passed

N/A

0.432240s

lfs_rename_dir

Passed

N/A

0.441588s

lfs_rename_dotdot

Passed

N/A

0.410681s

lfs_rename_nametoolong

Passed

N/A

0.407015s

lfs_rename_reg_nodir

Passed

N/A

0.412796s

lfs_symlink_long

Passed

N/A

0.427720s

lfs_symlink_root

Passed

N/A

0.415203s

lfs_symlink_zerolen

Passed

N/A

0.408088s

msdosfs_access_simple

Passed

N/A

0.325876s

msdosfs_attrs

Passed

N/A

0.343176s

msdosfs_create_exist

Passed

N/A

0.324277s

msdosfs_create_many

Passed

N/A

7.836876s

msdosfs_create_nametoolong

Passed

N/A

0.335392s

msdosfs_create_nonalphanum

Passed

N/A

0.440206s

msdosfs_dir_notempty

Passed

N/A

0.340092s

msdosfs_dir_rmdirdotdot

Passed

N/A

0.341317s

msdosfs_dir_simple

Passed

N/A

0.319939s

msdosfs_fcntl_getlock_pids

Passed

N/A

0.325151s

msdosfs_fcntl_lock

Passed

N/A

0.343120s

msdosfs_lookup_complex

Passed

N/A

0.322418s

msdosfs_lookup_simple

Passed

N/A

0.339292s

msdosfs_lstat_symlink

Skipped

symlinks not supported by file system

0.339620s

msdosfs_read_directory

Passed

N/A

0.342420s

msdosfs_rename_dir

Passed

N/A

0.328405s

msdosfs_rename_dotdot

Passed

N/A

0.319651s

msdosfs_rename_nametoolong

Passed

N/A

0.320361s

msdosfs_rename_reg_nodir

Passed

N/A

0.340392s

msdosfs_symlink_long

Skipped

symlinks not supported by file system

0.339473s

msdosfs_symlink_root

Skipped

symlinks not supported by file system

0.317177s

msdosfs_symlink_zerolen

Skipped

symlinks not supported by file system

0.317644s

nfs_access_simple

Passed

N/A

0.667687s

nfs_attrs

Passed

N/A

0.669824s

nfs_create_exist

Passed

N/A

0.677282s

nfs_create_many

Passed

N/A

7.447317s

nfs_create_nametoolong

Passed

N/A

0.663936s

nfs_create_nonalphanum

Passed

N/A

1.361167s

nfs_dir_notempty

Passed

N/A

0.677613s

nfs_dir_rmdirdotdot

Passed

N/A

0.668516s

nfs_dir_simple

Passed

N/A

0.666528s

nfs_fcntl_getlock_pids

Passed

N/A

0.680269s

nfs_fcntl_lock

Passed

N/A

0.673329s

nfs_lookup_complex

Passed

N/A

0.672718s

nfs_lookup_simple

Passed

N/A

0.663657s

nfs_lstat_symlink

Passed

N/A

0.632617s

nfs_read_directory

Passed

N/A

0.637045s

nfs_rename_dir

Passed

N/A

0.685357s

nfs_rename_dotdot

Passed

N/A

0.654470s

nfs_rename_nametoolong

Passed

N/A

0.656978s

nfs_rename_reg_nodir

Passed

N/A

0.657342s

nfs_symlink_long

Passed

N/A

0.728876s

nfs_symlink_root

Passed

N/A

0.670662s

nfs_symlink_zerolen

Passed

N/A

0.635465s

p2k_ffs_access_simple

Passed

N/A

0.466621s

p2k_ffs_attrs

Passed

N/A

0.467983s

p2k_ffs_create_exist

Passed

N/A

0.488226s

p2k_ffs_create_many

Passed

N/A

5.978820s

p2k_ffs_create_nametoolong

Passed

N/A

0.453677s

p2k_ffs_create_nonalphanum

Passed

N/A

1.028977s

p2k_ffs_dir_notempty

Passed

N/A

0.483531s

p2k_ffs_dir_rmdirdotdot

Passed

N/A

0.478112s

p2k_ffs_dir_simple

Passed

N/A

0.498231s

p2k_ffs_fcntl_getlock_pids

Passed

N/A

0.478244s

p2k_ffs_fcntl_lock

Passed

N/A

0.488288s

p2k_ffs_lookup_complex

Passed

N/A

0.468042s

p2k_ffs_lookup_simple

Passed

N/A

0.468222s

p2k_ffs_lstat_symlink

Passed

N/A

0.468151s

p2k_ffs_read_directory

Passed

N/A

0.488050s

p2k_ffs_rename_dir

Passed

N/A

0.538424s

p2k_ffs_rename_dotdot

Passed

N/A

0.487825s

p2k_ffs_rename_nametoolong

Passed

N/A

0.508319s

p2k_ffs_rename_reg_nodir

Passed

N/A

0.498300s

p2k_ffs_symlink_long

Passed

N/A

0.558038s

p2k_ffs_symlink_root

Passed

N/A

0.507801s

p2k_ffs_symlink_zerolen

Passed

N/A

0.488036s

puffs_access_simple

Passed

N/A

0.367937s

puffs_attrs

Passed

N/A

0.389287s

puffs_create_exist

Passed

N/A

0.369227s

puffs_create_many

Passed

N/A

4.280691s

puffs_create_nametoolong

Passed

N/A

0.388223s

puffs_create_nonalphanum

Passed

N/A

0.679289s

puffs_dir_notempty

Passed

N/A

0.368849s

puffs_dir_rmdirdotdot

Passed

N/A

0.369600s

puffs_dir_simple

Passed

N/A

0.359335s

puffs_fcntl_getlock_pids

Passed

N/A

0.388888s

puffs_fcntl_lock

Passed

N/A

0.369194s

puffs_lookup_complex

Passed

N/A

0.369725s

puffs_lookup_simple

Passed

N/A

0.379025s

puffs_lstat_symlink

Passed

N/A

0.369466s

puffs_read_directory

Passed

N/A

0.369482s

puffs_rename_dir

Passed

N/A

0.389187s

puffs_rename_dotdot

Passed

N/A

0.369543s

puffs_rename_nametoolong

Passed

N/A

0.369351s

puffs_rename_reg_nodir

Passed

N/A

0.379237s

puffs_symlink_long

Passed

N/A

0.439364s

puffs_symlink_root

Passed

N/A

0.369659s

puffs_symlink_zerolen

Passed

N/A

0.389119s

rumpfs_access_simple

Passed

N/A

0.297721s

rumpfs_attrs

Passed

N/A

0.321014s

rumpfs_create_exist

Passed

N/A

0.316040s

rumpfs_create_many

Passed

N/A

1.409005s

rumpfs_create_nametoolong

Passed

N/A

0.294898s

rumpfs_create_nonalphanum

Passed

N/A

0.336941s

rumpfs_dir_notempty

Passed

N/A

0.315928s

rumpfs_dir_rmdirdotdot

Passed

N/A

0.292819s

rumpfs_dir_simple

Passed

N/A

0.309587s

rumpfs_fcntl_getlock_pids

Passed

N/A

0.317719s

rumpfs_fcntl_lock

Passed

N/A

0.297184s

rumpfs_lookup_complex

Passed

N/A

0.297818s

rumpfs_lookup_simple

Passed

N/A

0.294258s

rumpfs_lstat_symlink

Passed

N/A

0.319071s

rumpfs_read_directory

Passed

N/A

0.297316s

rumpfs_rename_dir

Skipped

rename not supported by file system

0.293730s

rumpfs_rename_dotdot

Skipped

rename not supported by file system

0.316310s

rumpfs_rename_nametoolong

Skipped

rename not supported by file system

0.311718s

rumpfs_rename_reg_nodir

Skipped

rename not supported by file system

0.291803s

rumpfs_symlink_long

Passed

N/A

0.320906s

rumpfs_symlink_root

Passed

N/A

0.293599s

rumpfs_symlink_zerolen

Passed

N/A

0.301541s

sysvbfs_access_simple

Passed

N/A

0.336869s

sysvbfs_attrs

Passed

N/A

0.335770s

sysvbfs_create_exist

Passed

N/A

0.334202s

sysvbfs_create_many

Passed

N/A

0.347639s

sysvbfs_create_nametoolong

Passed

N/A

0.335324s

sysvbfs_create_nonalphanum

Passed

N/A

0.337761s

sysvbfs_dir_notempty

Skipped

directories not supported by file system

0.335293s

sysvbfs_dir_rmdirdotdot

Skipped

directories not supported by file system

0.330594s

sysvbfs_dir_simple

Skipped

directories not supported by file system

0.333147s

sysvbfs_fcntl_getlock_pids

Passed

N/A

0.340978s

sysvbfs_fcntl_lock

Passed

N/A

0.342351s

sysvbfs_lookup_complex

Skipped

directories not supported by file system

0.332671s

sysvbfs_lookup_simple

Passed

N/A

0.334685s

sysvbfs_lstat_symlink

Skipped

symlinks not supported by file system

0.332408s

sysvbfs_read_directory

Passed

N/A

0.326143s

sysvbfs_rename_dir

Skipped

directories not supported by file system

0.317899s

sysvbfs_rename_dotdot

Skipped

directories not supported by file system

0.333503s

sysvbfs_rename_nametoolong

Passed

N/A

0.329009s

sysvbfs_rename_reg_nodir

Passed

N/A

0.318159s

sysvbfs_symlink_long

Skipped

symlinks not supported by file system

0.314449s

sysvbfs_symlink_root

Skipped

symlinks not supported by file system

0.323637s

sysvbfs_symlink_zerolen

Skipped

symlinks not supported by file system

0.336142s

tmpfs_access_simple

Passed

N/A

0.319029s

tmpfs_attrs

Passed

N/A

0.303474s

tmpfs_create_exist

Passed

N/A

0.307450s

tmpfs_create_many

Passed

N/A

1.035893s

tmpfs_create_nametoolong

Passed

N/A

0.328084s

tmpfs_create_nonalphanum

Passed

N/A

0.356125s

tmpfs_dir_notempty

Passed

N/A

0.320999s

tmpfs_dir_rmdirdotdot

Passed

N/A

0.320492s

tmpfs_dir_simple

Passed

N/A

0.300474s

tmpfs_fcntl_getlock_pids

Passed

N/A

0.321226s

tmpfs_fcntl_lock

Passed

N/A

0.320254s

tmpfs_lookup_complex

Passed

N/A

0.322228s

tmpfs_lookup_simple

Passed

N/A

0.301733s

tmpfs_lstat_symlink

Passed

N/A

0.305218s

tmpfs_read_directory

Passed

N/A

0.302349s

tmpfs_rename_dir

Passed

N/A

0.304124s

tmpfs_rename_dotdot

Passed

N/A

0.318823s

tmpfs_rename_nametoolong

Passed

N/A

0.318371s

tmpfs_rename_reg_nodir

Passed

N/A

0.300359s

tmpfs_symlink_long

Passed

N/A

0.312277s

tmpfs_symlink_root

Passed

N/A

0.324046s

tmpfs_symlink_zerolen

Passed

N/A

0.301410s

udf_access_simple

Passed

N/A

0.584407s

udf_attrs

Passed

N/A

0.608156s

udf_create_exist

Passed

N/A

0.607780s

udf_create_many

Passed

N/A

1.902711s

udf_create_nametoolong

Passed

N/A

0.335209s

udf_create_nonalphanum

Passed

N/A

0.676682s

udf_dir_notempty

Passed

N/A

0.349240s

udf_dir_rmdirdotdot

Passed

N/A

0.587032s

udf_dir_simple

Passed

N/A

0.589254s

udf_fcntl_getlock_pids

Passed

N/A

0.588735s

udf_fcntl_lock

Passed

N/A

0.608286s

udf_lookup_complex

Passed

N/A

0.578563s

udf_lookup_simple

Passed

N/A

0.348624s

udf_lstat_symlink

Passed

N/A

0.607737s

udf_read_directory

Passed

N/A

0.322954s

udf_rename_dir

Passed

N/A

0.594481s

udf_rename_dotdot

Passed

N/A

0.598349s

udf_rename_nametoolong

Passed

N/A

0.608865s

udf_rename_reg_nodir

Passed

N/A

0.588063s

udf_symlink_long

Passed

N/A

0.608378s

udf_symlink_root

Passed

N/A

0.588856s

udf_symlink_zerolen

Passed

N/A

0.588451s

v7fs_access_simple

Passed

N/A

0.342297s

v7fs_attrs

Passed

N/A

0.364154s

v7fs_create_exist

Passed

N/A

0.355006s

v7fs_create_many

Passed

N/A

9.141863s

v7fs_create_nametoolong

Passed

N/A

0.350407s

v7fs_create_nonalphanum

Passed

N/A

0.701372s

v7fs_dir_notempty

Passed

N/A

0.335590s

v7fs_dir_rmdirdotdot

Passed

N/A

0.338137s

v7fs_dir_simple

Passed

N/A

0.336363s

v7fs_fcntl_getlock_pids

Passed

N/A

0.338200s

v7fs_fcntl_lock

Passed

N/A

0.334380s

v7fs_lookup_complex

Passed

N/A

0.355671s

v7fs_lookup_simple

Passed

N/A

0.331532s

v7fs_lstat_symlink

Passed

N/A

0.334669s

v7fs_read_directory

Passed

N/A

0.336988s

v7fs_rename_dir

Passed

N/A

0.364919s

v7fs_rename_dotdot

Passed

N/A

0.354964s

v7fs_rename_nametoolong

Passed

N/A

0.336906s

v7fs_rename_reg_nodir

Passed

N/A

0.339427s

v7fs_symlink_long

Passed

N/A

0.381517s

v7fs_symlink_root

Passed

N/A

0.352469s

v7fs_symlink_zerolen

Passed

N/A

0.337584s

fs/cd9660/t_high_ino_big_file

0.319133s

pr_kern_48787

Skipped

not enough free disk space, have 1048344 Kbytes, need ~ 4500000 Kbytes

0.318513s

rump/rumpkern/t_copy

0.206668s

copy_efault

Passed

N/A

0.019330s

copyinstr

Passed

N/A

0.063096s

copyoutstr

Passed

N/A

0.058585s

copystr

Passed

N/A

0.062934s

rump/rumpkern/t_kern

0.553682s

lockme_DESTROYHELD

Passed

N/A

0.096054s

lockme_DOUBLEFREE

Passed

N/A

0.096658s

lockme_DOUBLEINIT

Skipped

test requires LOCKDEBUG kernel

0.021394s

lockme_MEMFREE

Skipped

test requires LOCKDEBUG kernel

0.019430s

lockme_MTX

Passed

N/A

0.091517s

lockme_RWDOUBLEX

Passed

N/A

0.089038s

lockme_RWRX

Skipped

test requires LOCKDEBUG kernel

0.019257s

lockme_RWXR

Passed

N/A

0.090973s

rump/rumpkern/t_lwproc

0.550313s

inherit

Passed

N/A

0.064277s

lwps

Passed

N/A

0.072753s

makelwp

Passed

N/A

0.063576s

nolwp

Passed

N/A

0.057945s

nolwprelease

Passed

N/A

0.089767s

nullswitch

Passed

N/A

0.060466s

proccreds

Passed

N/A

0.064462s

rfork

Passed

N/A

0.065980s

rump/rumpkern/t_modcmd

0.067538s

cmsg_modcmd

Passed

N/A

0.066882s

rump/rumpkern/t_modlinkset

0.071196s

modlinkset

Passed

N/A

0.070465s

rump/rumpkern/t_signals

0.208780s

sigignore

Passed

N/A

0.057378s

sigpanic

Passed

N/A

0.083647s

sigraise

Passed

N/A

0.061147s

rump/rumpkern/t_threads

0.160919s

kthread

Passed

N/A

0.080277s

threadjoin

Passed

N/A

0.079215s

rump/rumpkern/t_tsleep

0.189950s

tsleep

Passed

N/A

0.189294s

rump/rumpkern/t_vm

10.220676s

busypage

Passed

N/A

0.064200s

uvmwait

Passed

N/A

10.154776s

rump/rumpkern/t_sp

27.594278s

basic

Passed

N/A

0.316142s

fork_fakeauth

Passed

N/A

0.333216s

fork_pipecomm

Passed

N/A

0.332887s

fork_simple

Passed

N/A

0.339147s

reconnect

Passed

N/A

2.333668s

signal

Passed

N/A

0.337347s

sigsafe

Passed

N/A

5.696834s

stress_killer

Passed

N/A

7.335133s

stress_long

Passed

N/A

6.177848s

stress_short

Passed

N/A

4.381563s

rump/rumpnet/t_shmif

7.422442s

crossping

Passed

N/A

7.420598s

rump/rumpvfs/t_basic

0.058907s

lseekrv

Passed

N/A

0.058199s

rump/rumpvfs/t_etfs

0.556775s

key

Passed

N/A

0.060095s

large_blk

Passed

N/A

0.199320s

range_blk

Passed

N/A

0.115548s

reregister_blk

Passed

N/A

0.115182s

reregister_reg

Passed

N/A

0.061762s

rump/rumpvfs/t_p2kifs

0.065031s

makecn

Passed

N/A

0.064379s

rump/modautoload/t_modautoload

0.022849s

modautoload

Skipped

host kernel modules not supported

0.022240s

modules/t_modctl

0.680982s

cmd_load

Passed

N/A

0.059005s

cmd_load_props

Passed

N/A

0.098335s

cmd_load_recurse

Passed

N/A

0.156475s

cmd_stat

Passed

N/A

0.099180s

cmd_unload

Passed

N/A

0.264741s

modules/t_builtin

0.330674s

busydisable

Passed

N/A

0.062765s

disable

Passed

N/A

0.068612s

disabledstat

Passed

N/A

0.066604s

forcereload

Passed

N/A

0.065030s

noauto

Passed

N/A

0.064303s

modules/t_abi_uvm

0.388676s

PAGE_SIZE

Passed

N/A

0.387955s

modules/t_modload

2.361595s

bflag

Passed

N/A

0.593951s

iflag

Passed

N/A

0.747279s

plain

Passed

N/A

0.436014s

sflag

Passed

N/A

0.579908s

crypto/libcrypto/t_certs

0.139243s

x509v3

Passed

N/A

0.138608s

crypto/libcrypto/t_ciphers

4.179546s

bf

Passed

N/A

0.162105s

cast

Passed

N/A

3.034729s

des

Passed

N/A

0.148249s

evp

Passed

N/A

0.295023s

idea

Passed

N/A

0.136768s

rc2

Passed

N/A

0.133496s

rc4

Passed

N/A

0.165328s

rc5

Skipped

RC5 support not available; system built with MKCRYPTO_RC5=no

0.098086s

crypto/libcrypto/t_hashes

0.965901s

hmac

Passed

N/A

0.144492s

md2

Passed

N/A

0.131319s

md4

Passed

N/A

0.134119s

md5

Passed

N/A

0.135078s

mdc2

Passed

N/A

0.134605s

ripemd

Passed

N/A

0.130649s

sha

Passed

N/A

0.150116s

crypto/libcrypto/t_libcrypto

8.764704s

bn

Passed

N/A

7.838350s

conf

Passed

N/A

0.168684s

engine

Passed

N/A

0.250703s

lhash

Passed

N/A

0.144319s

rand

Passed

N/A

0.138079s

threads

Passed

N/A

0.219698s

crypto/libcrypto/t_pubkey

25.205060s

dh

Passed

N/A

0.430740s

dsa

Passed

N/A

0.484253s

ec

Passed

N/A

8.648845s

ecdh

Passed

N/A

1.351456s

ecdsa

Passed

N/A

8.920419s

rsa

Passed

N/A

5.083817s

srp

Passed

N/A

0.280523s

crypto/opencrypto/t_opencrypto

5.389674s

aesctr1

Passed

N/A

0.472408s

aesctr2

Passed

N/A

0.376495s

arc4

Skipped

ARC4 not implemented by swcrypto

0.267485s

camellia

Passed

N/A

0.376727s

cbcdes

Passed

N/A

0.386960s

comp

Passed

N/A

0.429817s

comp_deflate

Passed

N/A

0.380218s

comp_zlib_rnd

Passed

N/A

0.401627s

gcm

Passed

N/A

0.367772s

md5

Passed

N/A

0.381518s

md5_hmac

Passed

N/A

0.384823s

null

Passed

N/A

0.372595s

sha1_hmac

Passed

N/A

0.384476s

xcbcmac

Passed

N/A

0.387367s

ipf/t_filter_exec

16.285820s

f1

Passed

N/A

0.542704s

f10

Passed

N/A

1.053153s

f11

Passed

N/A

0.495238s

f12

Passed

N/A

0.442097s

f13

Passed

N/A

0.587962s

f14

Passed

N/A

0.526025s

f15

Passed

N/A

0.175474s

f16

Passed

N/A

0.177489s

f17

Passed

N/A

0.181062s

f18

Passed

N/A

0.171789s

f19

Passed

N/A

0.240199s

f2

Passed

N/A

0.439678s

f20

Passed

N/A

0.175317s

f24

Passed

N/A

0.168642s

f25

Passed

N/A

0.180981s

f26

Expected failure

Known to be broken: results differ

0.455837s

f27

Expected failure

Known to be broken: results differ

0.435310s

f3

Passed

N/A

0.526019s

f30

Passed

N/A

0.331787s

f4

Passed

N/A

0.529836s

f5

Passed

N/A

2.541823s

f6

Passed

N/A

2.537981s

f7

Passed

N/A

0.586534s

f8

Passed

N/A

0.428961s

f9

Passed

N/A

1.023027s

ipv6_1

Passed

N/A

0.218362s

ipv6_2

Passed

N/A

0.326431s

ipv6_3

Passed

N/A

0.210446s

ipv6_5

Passed

N/A

0.268874s

ipv6_6

Passed

N/A

0.265257s

ipf/t_filter_parse

3.837544s

i1

Passed

N/A

0.206927s

i10

Passed

N/A

0.159106s

i11

Passed

N/A

0.162688s

i12

Passed

N/A

0.146527s

i13

Passed

N/A

0.144878s

i14

Passed

N/A

0.151790s

i15

Passed

N/A

0.146946s

i16

Passed

N/A

0.144699s

i17

Expected failure

Known to be broken: atf-check failed; see the output of the test for details

0.172543s

i18

Passed

N/A

0.145968s

i19

Passed

N/A

0.264920s

i2

Passed

N/A

0.148530s

i20

Passed

N/A

0.299661s

i21

Passed

N/A

0.144341s

i22

Passed

N/A

0.152342s

i23

Passed

N/A

0.139617s

i3

Passed

N/A

0.146507s

i4

Passed

N/A

0.151661s

i5

Passed

N/A

0.149113s

i6

Passed

N/A

0.147826s

i7

Passed

N/A

0.152944s

i8

Passed

N/A

0.182657s

i9

Passed

N/A

0.152861s

ipf/t_logging

1.423088s

l1

Passed

N/A

1.421061s

ipf/t_nat_exec

10.521203s

n1

Passed

N/A

0.363953s

n10

Passed

N/A

0.316783s

n100

Passed

N/A

0.211544s

n101

Passed

N/A

0.217265s

n102

Passed

N/A

0.220619s

n103

Passed

N/A

0.217923s

n104

Passed

N/A

0.219046s

n105

Passed

N/A

0.213292s

n106

Passed

N/A

0.217289s

n11

Passed

N/A

0.335669s

n11_6

Passed

N/A

0.327844s

n12

Passed

N/A

0.214419s

n12_6

Passed

N/A

0.218789s

n13

Passed

N/A

0.226049s

n14

Passed

N/A

0.231544s

n15_6

Passed

N/A

0.262856s

n16

Passed

N/A

0.221933s

n17

Passed

N/A

0.213502s

n1_6

Passed

N/A

0.339297s

n2

Passed

N/A

0.385016s

n200

Passed

N/A

0.207354s

n2_6

Passed

N/A

0.397034s

n3

Passed

N/A

0.264531s

n4

Passed

N/A

0.502207s

n4_6

Passed

N/A

0.493979s

n5

Passed

N/A

0.513105s

n5_6

Passed

N/A

0.511928s

n6

Passed

N/A

0.433041s

n6_6

Passed

N/A

0.444688s

n7

Passed

N/A

0.335702s

n7_6

Passed

N/A

0.322434s

n8

Passed

N/A

0.206262s

n8_6

Expected failure

See PR kern/47665: results differ

0.223738s

n9

Passed

N/A

0.213100s

n9_6

Expected failure

See PR kern/47665: results differ

0.223226s

ipf/t_nat_ipf_exec

4.636780s

ni1

Passed

N/A

0.186554s

ni10

Passed

N/A

0.198067s

ni11

Passed

N/A

0.209416s

ni12

Passed

N/A

0.197929s

ni13

Passed

N/A

0.212270s

ni14

Passed

N/A

0.203153s

ni15

Passed

N/A

0.202558s

ni16

Passed

N/A

0.214651s

ni17

Passed

N/A

0.182269s

ni18

Passed

N/A

0.181990s

ni19

Passed

N/A

0.212858s

ni2

Passed

N/A

0.209375s

ni20

Passed

N/A

0.222049s

ni21

Passed

N/A

0.192960s

ni23

Passed

N/A

0.194290s

ni3

Passed

N/A

0.201135s

ni4

Passed

N/A

0.199469s

ni5

Passed

N/A

0.394618s

ni6

Passed

N/A

0.189216s

ni7

Passed

N/A

0.199199s

ni8

Passed

N/A

0.197809s

ni9

Passed

N/A

0.198369s

ipf/t_nat_parse

3.123412s

in1

Passed

N/A

0.213205s

in100

Passed

N/A

0.154787s

in100_6

Passed

N/A

0.144982s

in101

Passed

N/A

0.148875s

in101_6

Passed

N/A

0.145510s

in102

Passed

N/A

0.151454s

in102_6

Passed

N/A

0.147159s

in1_6

Passed

N/A

0.164503s

in2

Passed

N/A

0.167852s

in2_6

Passed

N/A

0.163192s

in3

Passed

N/A

0.152580s

in3_6

Passed

N/A

0.147885s

in4

Passed

N/A

0.150055s

in4_6

Passed

N/A

0.149818s

in5

Passed

N/A

0.155308s

in5_6

Passed

N/A

0.154374s

in6

Passed

N/A

0.146495s

in6_6

Passed

N/A

0.147222s

in7

Passed

N/A

0.146280s

in8_6

Passed

N/A

0.152664s

ipf/t_pools

3.062214s

f28

Passed

N/A

0.195257s

f29

Passed

N/A

0.169664s

ip1

Passed

N/A

0.214774s

ip2

Passed

N/A

0.172418s

ip3

Passed

N/A

0.157742s

p1

Passed

N/A

0.178351s

p10

Passed

N/A

0.170922s

p11

Passed

N/A

0.177184s

p12

Passed

N/A

0.181024s

p13

Passed

N/A

0.174345s

p2

Passed

N/A

0.169527s

p3

Passed

N/A

0.179644s

p4

Passed

N/A

0.177385s

p5

Passed

N/A

0.179672s

p6

Passed

N/A

0.166053s

p7

Passed

N/A

0.184454s

p9

Passed

N/A

0.188767s

share/examples/t_asm

0.375261s

hello

Skipped

Example program not implemented on this platform

0.374610s

share/mk/t_lib

2.642550s

defaults__build_and_install

Passed

N/A

2.636528s

share/mk/t_own

0.641209s

makeconf__missing

Passed

N/A

0.250057s

makeconf__ok

Passed

N/A

0.388818s

share/mk/t_prog

2.428807s

defaults__build_and_install

Passed

N/A

1.518376s

without_man__build_and_install

Passed

N/A

0.901008s

share/mk/t_test

8.672178s

one_c

Passed

N/A

1.208802s

one_cxx

Passed

N/A

6.713320s

one_sh

Passed

N/A

0.738810s

atf/atf-c/detail/dynstr_test

5.473967s

append_ap

Passed

N/A

1.150740s

append_fmt

Passed

N/A

1.136748s

clear

Passed

N/A

0.013882s

copy

Passed

N/A

0.013869s

cstring

Passed

N/A

0.012423s

equal_cstring

Passed

N/A

0.014002s

equal_dynstr

Passed

N/A

0.012542s

fini_disown

Passed

N/A

0.013609s

init

Passed

N/A

0.012802s

init_ap

Passed

N/A

0.013657s

init_fmt

Passed

N/A

0.012464s

init_raw

Passed

N/A

0.012506s

init_rep

Passed

N/A

0.404253s

init_substr

Passed

N/A

0.012664s

length

Passed

N/A

0.034340s

prepend_ap

Passed

N/A

1.290882s

prepend_fmt

Passed

N/A

1.287646s

rfind_ch

Passed

N/A

0.012699s

atf/atf-c/detail/env_test

0.052117s

get

Passed

N/A

0.012255s

has

Passed

N/A

0.013754s

set

Passed

N/A

0.011845s

unset

Passed

N/A

0.011619s

atf/atf-c/detail/fs_test

0.379034s

eaccess

Passed

N/A

0.021410s

exists

Passed

N/A

0.014739s

getcwd

Passed

N/A

0.014080s

mkdtemp_err

Passed

N/A

0.016534s

mkdtemp_ok

Passed

N/A

0.013318s

mkdtemp_umask

Passed

N/A

0.015239s

mkstemp_err

Passed

N/A

0.014965s

mkstemp_ok

Passed

N/A

0.014587s

mkstemp_umask

Passed

N/A

0.014080s

path_append

Passed

N/A

0.014789s

path_branch_path

Passed

N/A

0.014150s

path_copy

Passed

N/A

0.014128s

path_equal

Passed

N/A

0.012783s

path_is_absolute

Passed

N/A

0.017135s

path_is_root

Passed

N/A

0.013192s

path_leaf_name

Passed

N/A

0.016403s

path_normalize

Passed

N/A

0.020464s

path_to_absolute

Passed

N/A

0.013803s

rmdir_empty

Passed

N/A

0.014416s

rmdir_enotempty

Passed

N/A

0.013868s

rmdir_eperm

Passed

N/A

0.012811s

stat_mode

Passed

N/A

0.014141s

stat_perms

Passed

N/A

0.013560s

stat_type

Passed

N/A

0.013898s

atf/atf-c/detail/list_test

0.131325s

list_append

Passed

N/A

0.013331s

list_append_list

Passed

N/A

0.013256s

list_for_each

Passed

N/A

0.020483s

list_for_each_c

Passed

N/A

0.014945s

list_index

Passed

N/A

0.013160s

list_index_c

Passed

N/A

0.013537s

list_init

Passed

N/A

0.012798s

list_to_charpp_empty

Passed

N/A

0.011962s

list_to_charpp_some

Passed

N/A

0.012191s

atf/atf-c/detail/map_test

0.185765s

find

Passed

N/A

0.013090s

find_c

Passed

N/A

0.012250s

map_for_each

Passed

N/A

0.015481s

map_for_each_c

Passed

N/A

0.019250s

map_init

Passed

N/A

0.012778s

map_init_charpp_empty

Passed

N/A

0.012616s

map_init_charpp_null

Passed

N/A

0.013071s

map_init_charpp_short

Passed

N/A

0.013105s

map_init_charpp_some

Passed

N/A

0.014032s

map_insert

Passed

N/A

0.012469s

stable_keys

Passed

N/A

0.013788s

to_charpp_empty

Passed

N/A

0.012498s

to_charpp_some

Passed

N/A

0.013510s

atf/atf-c/detail/process_test

2.068570s

child_pid

Passed

N/A

0.017959s

child_wait_eintr

Passed

N/A

1.024999s

exec_failure

Passed

N/A

0.026491s

exec_list

Passed

N/A

0.023728s

exec_prehook

Passed

N/A

0.018828s

exec_success

Passed

N/A

0.021206s

fork_cookie

Passed

N/A

0.020119s

fork_out_capture_err_capture

Passed

N/A

0.020011s

fork_out_capture_err_connect

Passed

N/A

0.018964s

fork_out_capture_err_default

Passed

N/A

0.021069s

fork_out_capture_err_inherit

Passed

N/A

0.019776s

fork_out_capture_err_redirect_fd

Passed

N/A

0.019951s

fork_out_capture_err_redirect_path

Passed

N/A

0.020912s

fork_out_connect_err_capture

Passed

N/A

0.019394s

fork_out_connect_err_connect

Passed

N/A

0.019445s

fork_out_connect_err_default

Passed

N/A

0.019649s

fork_out_connect_err_inherit

Passed

N/A

0.019686s

fork_out_connect_err_redirect_fd

Passed

N/A

0.019542s

fork_out_connect_err_redirect_path

Passed

N/A

0.019532s

fork_out_default_err_capture

Passed

N/A

0.019588s

fork_out_default_err_connect

Passed

N/A

0.019722s

fork_out_default_err_default

Passed

N/A

0.019823s

fork_out_default_err_inherit

Passed

N/A

0.018983s

fork_out_default_err_redirect_fd

Passed

N/A

0.020804s

fork_out_default_err_redirect_path

Passed

N/A

0.020810s

fork_out_inherit_err_capture

Passed

N/A

0.019106s

fork_out_inherit_err_connect

Passed

N/A

0.019370s

fork_out_inherit_err_default

Passed

N/A

0.019569s

fork_out_inherit_err_inherit

Passed

N/A

0.021576s

fork_out_inherit_err_redirect_fd

Passed

N/A

0.019367s

fork_out_inherit_err_redirect_path

Passed

N/A

0.019685s

fork_out_redirect_fd_err_capture

Passed

N/A

0.020886s

fork_out_redirect_fd_err_connect

Passed

N/A

0.020823s

fork_out_redirect_fd_err_default

Passed

N/A

0.021377s

fork_out_redirect_fd_err_inherit

Passed

N/A

0.021549s

fork_out_redirect_fd_err_redirect_fd

Passed

N/A

0.021625s

fork_out_redirect_fd_err_redirect_path

Passed

N/A

0.021159s

fork_out_redirect_path_err_capture

Passed

N/A

0.019398s

fork_out_redirect_path_err_connect

Passed

N/A

0.020558s

fork_out_redirect_path_err_default

Passed

N/A

0.022148s

fork_out_redirect_path_err_inherit

Passed

N/A

0.021493s

fork_out_redirect_path_err_redirect_fd

Passed

N/A

0.021534s

fork_out_redirect_path_err_redirect_path

Passed

N/A

0.021312s

status_coredump

Passed

N/A

0.023186s

status_exited

Passed

N/A

0.020952s

status_signaled

Passed

N/A

0.019047s

stream_init_capture

Passed

N/A

0.015577s

stream_init_connect

Passed

N/A

0.014339s

stream_init_inherit

Passed

N/A

0.014499s

stream_init_redirect_fd

Passed

N/A

0.015843s

stream_init_redirect_path

Passed

N/A

0.015329s

atf/atf-c/detail/sanity_test

0.103368s

inv

Passed

N/A

0.024008s

post

Passed

N/A

0.024496s

pre

Passed

N/A

0.024568s

unreachable

Passed

N/A

0.023880s

atf/atf-c/detail/text_test

0.099306s

for_each_word

Passed

N/A

0.013242s

format

Passed

N/A

0.012104s

format_ap

Passed

N/A

0.013452s

split

Passed

N/A

0.014259s

split_delims

Passed

N/A

0.015547s

to_bool

Passed

N/A

0.012435s

to_long

Passed

N/A

0.013404s

atf/atf-c/detail/user_test

0.053695s

euid

Passed

N/A

0.012076s

is_member_of_group

Passed

N/A

0.014577s

is_root

Passed

N/A

0.012617s

is_unprivileged

Passed

N/A

0.011961s

atf/atf-c/atf_c_test

0.215148s

include

Passed

N/A

0.214046s

atf/atf-c/build_test

0.227842s

c_o

Passed

N/A

0.014227s

cpp

Passed

N/A

0.014950s

cxx_o

Passed

N/A

0.018811s

equal_arrays

Passed

N/A

0.011691s

include

Passed

N/A

0.164778s

atf/atf-c/check_test

2.480693s

build_c_o

Passed

N/A

0.277650s

build_cpp

Passed

N/A

0.355096s

build_cxx_o

Passed

N/A

1.542920s

exec_array

Passed

N/A

0.023476s

exec_cleanup

Passed

N/A

0.022024s

exec_exitstatus

Passed

N/A

0.036165s

exec_stdout_stderr

Passed

N/A

0.032788s

exec_umask

Passed

N/A

0.012627s

exec_unknown

Passed

N/A

0.018100s

include

Passed

N/A

0.150508s

atf/atf-c/config_test

0.172216s

get

Passed

N/A

0.014997s

include

Passed

N/A

0.155572s

atf/atf-c/error_test

0.466718s

error_new

Passed

N/A

0.013104s

error_new_wo_memory

Passed

N/A

0.014015s

format

Passed

N/A

0.013200s

include

Passed

N/A

0.167079s

include_fwd

Passed

N/A

0.155272s

is_error

Passed

N/A

0.014226s

libc_format

Passed

N/A

0.014699s

libc_new

Passed

N/A

0.013978s

no_error

Passed

N/A

0.012234s

no_memory_format

Passed

N/A

0.013930s

no_memory_new

Passed

N/A

0.012366s

no_memory_twice

Passed

N/A

0.013488s

atf/atf-c/macros_test

1.337553s

check

Passed

N/A

0.034929s

check_eq

Passed

N/A

0.053082s

check_errno

Passed

N/A

0.031830s

check_match

Passed

N/A

0.037071s

check_streq

Passed

N/A

0.058840s

detect_unused_tests

Expected failure

PR 49187: Build of unused_test.c passed; unused test cases are not properly detected

0.359085s

include

Passed

N/A

0.224727s

msg_embedded_fmt

Passed

N/A

0.036000s

require

Passed

N/A

0.032479s

require_eq

Passed

N/A

0.048979s

require_errno

Passed

N/A

0.029419s

require_match

Passed

N/A

0.038040s

require_streq

Passed

N/A

0.052108s

use

Passed

N/A

0.285008s

atf/atf-c/tc_test

0.220541s

config

Passed

N/A

0.012453s

include

Passed

N/A

0.166283s

init

Passed

N/A

0.013724s

init_pack

Passed

N/A

0.012506s

vars

Passed

N/A

0.011975s

atf/atf-c/tp_test

0.165082s

getopt

Passed

N/A

0.013697s

include

Passed

N/A

0.149741s

atf/atf-c/utils_test

0.694119s

cat_file__empty

Passed

N/A

0.015316s

cat_file__no_newline_eof

Passed

N/A

0.013174s

cat_file__one_line

Passed

N/A

0.015008s

cat_file__several_lines

Passed

N/A

0.014336s

compare_file__empty__match

Passed

N/A

0.012799s

compare_file__empty__not_match

Passed

N/A

0.014233s

compare_file__long__match

Passed

N/A

0.013308s

compare_file__long__not_match

Passed

N/A

0.013271s

compare_file__short__match

Passed

N/A

0.014164s

compare_file__short__not_match

Passed

N/A

0.013481s

copy_file__empty

Passed

N/A

0.014026s

copy_file__some_contents

Passed

N/A

0.013237s

create_file

Passed

N/A

0.014007s

file_exists

Passed

N/A

0.013896s

fork

Passed

N/A

0.015488s

free_charpp__empty

Passed

N/A

0.013766s

free_charpp__some

Passed

N/A

0.012694s

grep_file

Passed

N/A

0.014827s

grep_string

Passed

N/A

0.015125s

include

Passed

N/A

0.202530s

readline__none

Passed

N/A

0.014627s

readline__some

Passed

N/A

0.014726s

redirect__other

Passed

N/A

0.014099s

redirect__stderr

Passed

N/A

0.013529s

redirect__stdout

Passed

N/A

0.014329s

wait__invalid_exitstatus

Passed

N/A

0.019288s

wait__invalid_stderr

Passed

N/A

0.020449s

wait__invalid_stdout

Passed

N/A

0.021792s

wait__ok

Passed

N/A

0.019972s

wait__save_stderr

Passed

N/A

0.021886s

wait__save_stdout

Passed

N/A

0.022354s

atf/atf-c/pkg_config_test

0.003907s

build

Skipped

Required program 'pkg-config' not found in the PATH

0.001940s

version

Skipped

Required program 'pkg-config' not found in the PATH

0.001857s

atf/atf-c++/detail/application_test

0.024368s

getopt

Passed

N/A

0.023722s

atf/atf-c++/detail/auto_array_test

0.227975s

auto_array_access

Passed

N/A

0.024142s

auto_array_assign

Passed

N/A

0.026067s

auto_array_assign_ref

Passed

N/A

0.023771s

auto_array_copy

Passed

N/A

0.025885s

auto_array_copy_ref

Passed

N/A

0.025902s

auto_array_get

Passed

N/A

0.023363s

auto_array_release

Passed

N/A

0.026435s

auto_array_reset

Passed

N/A

0.023434s

auto_array_scope

Passed

N/A

0.022938s

atf/atf-c++/detail/env_test

0.074001s

has_get

Passed

N/A

0.023108s

set

Passed

N/A

0.025985s

unset

Passed

N/A

0.022843s

atf/atf-c++/detail/exceptions_test

0.116591s

throw_atf_error_libc

Passed

N/A

0.040200s

throw_atf_error_no_memory

Passed

N/A

0.038319s

throw_atf_error_unknown

Passed

N/A

0.036015s

atf/atf-c++/detail/fs_test

0.509607s

directory_file_info

Passed

N/A

0.028082s

directory_names

Passed

N/A

0.024549s

directory_read

Passed

N/A

0.027779s

exists

Passed

N/A

0.034995s

file_info_perms

Passed

N/A

0.029384s

file_info_stat

Passed

N/A

0.024110s

is_executable

Passed

N/A

0.027612s

path_branch_path

Passed

N/A

0.026943s

path_compare_different

Passed

N/A

0.026537s

path_compare_equal

Passed

N/A

0.024046s

path_concat

Passed

N/A

0.026339s

path_is_absolute

Passed

N/A

0.026276s

path_is_root

Passed

N/A

0.023805s

path_leaf_name

Passed

N/A

0.026406s

path_normalize

Passed

N/A

0.024021s

path_op_less

Passed

N/A

0.027073s

path_to_absolute

Passed

N/A

0.026710s

remove

Passed

N/A

0.037041s

atf/atf-c++/detail/process_test

0.272516s

argv_array_assign

Passed

N/A

0.023503s

argv_array_copy

Passed

N/A

0.026248s

argv_array_exec_argv

Passed

N/A

0.023759s

argv_array_init_carray

Passed

N/A

0.023023s

argv_array_init_col

Passed

N/A

0.026750s

argv_array_init_empty

Passed

N/A

0.023215s

argv_array_init_varargs

Passed

N/A

0.026990s

argv_array_iter

Passed

N/A

0.024801s

exec_failure

Passed

N/A

0.034187s

exec_success

Passed

N/A

0.034248s

atf/atf-c++/detail/sanity_test

0.025819s

nothing

Passed

N/A

0.025291s

atf/atf-c++/detail/text_test

0.320580s

duplicate

Passed

N/A

0.023086s

join

Passed

N/A

0.025074s

match

Passed

N/A

0.043755s

split

Passed

N/A

0.029826s

split_delims

Passed

N/A

0.026358s

to_bool

Passed

N/A

0.038212s

to_bytes

Passed

N/A

0.037097s

to_string

Passed

N/A

0.026538s

to_type

Passed

N/A

0.037878s

trim

Passed

N/A

0.026125s

atf/atf-c++/atf_c++_test

1.761232s

include

Passed

N/A

1.760246s

atf/atf-c++/build_test

0.951014s

c_o

Passed

N/A

0.028870s

cpp

Passed

N/A

0.025410s

cxx_o

Passed

N/A

0.024367s

equal_argvs

Passed

N/A

0.022353s

include

Passed

N/A

0.846389s

atf/atf-c++/check_test

3.291370s

build_c_o

Passed

N/A

0.306979s

build_cpp

Passed

N/A

0.197698s

build_cxx_o

Passed

N/A

1.500246s

exec_cleanup

Passed

N/A

0.036559s

exec_exitstatus

Passed

N/A

0.051202s

exec_stdout_stderr

Passed

N/A

0.043240s

exec_unknown

Passed

N/A

0.034989s

include

Passed

N/A

1.112050s

atf/atf-c++/config_test

1.065074s

get

Passed

N/A

0.026681s

get_all

Passed

N/A

0.023268s

has

Passed

N/A

0.026121s

include

Passed

N/A

0.985482s

atf/atf-c++/macros_test

7.173883s

check_errno

Passed

N/A

0.054271s

detect_unused_tests

Expected failure

PR 49187: Build of unused_test.cpp passed; unused test cases are not properly detected

2.557856s

fail

Passed

N/A

0.031055s

include

Passed

N/A

1.834495s

pass

Passed

N/A

0.034348s

require

Passed

N/A

0.056885s

require_eq

Passed

N/A

0.056672s

require_errno

Passed

N/A

0.047983s

require_in

Passed

N/A

0.071454s

require_match

Passed

N/A

0.040221s

require_not_in

Passed

N/A

0.066151s

require_throw

Passed

N/A

0.078060s

require_throw_re

Passed

N/A

0.101274s

skip

Passed

N/A

0.033859s

use

Passed

N/A

2.090627s

atf/atf-c++/tests_test

1.043022s

atf_tp_writer

Passed

N/A

0.023848s

include

Passed

N/A

1.017314s

atf/atf-c++/utils_test

1.737216s

cat_file__empty

Passed

N/A

0.025004s

cat_file__no_newline_eof

Passed

N/A

0.027562s

cat_file__one_line

Passed

N/A

0.024511s

cat_file__several_lines

Passed

N/A

0.027038s

compare_file__empty__match

Passed

N/A

0.023729s

compare_file__empty__not_match

Passed

N/A

0.026959s

compare_file__long__match

Passed

N/A

0.024252s

compare_file__long__not_match

Passed

N/A

0.027566s

compare_file__short__match

Passed

N/A

0.023949s

compare_file__short__not_match

Passed

N/A

0.026780s

copy_file__empty

Passed

N/A

0.026564s

copy_file__some_contents

Passed

N/A

0.024149s

create_file

Passed

N/A

0.026477s

file_exists

Passed

N/A

0.024105s

fork

Passed

N/A

0.033474s

grep_collection__set

Passed

N/A

0.026765s

grep_collection__vector

Passed

N/A

0.024315s

grep_file

Passed

N/A

0.029599s

grep_string

Passed

N/A

0.024096s

include

Passed

N/A

0.900469s

redirect__other

Passed

N/A

0.027170s

redirect__stderr

Passed

N/A

0.024528s

redirect__stdout

Passed

N/A

0.026910s

wait__invalid_exitstatus

Passed

N/A

0.036724s

wait__invalid_stderr

Passed

N/A

0.040589s

wait__invalid_stdout

Passed

N/A

0.040600s

wait__ok

Passed

N/A

0.037521s

wait__save_stderr

Passed

N/A

0.036954s

wait__save_stdout

Passed

N/A

0.041053s

atf/atf-c++/pkg_config_test

0.003685s

build

Skipped

Required program 'pkg-config' not found in the PATH

0.001717s

version

Skipped

Required program 'pkg-config' not found in the PATH

0.001880s

atf/atf-sh/atf-check_test

6.535452s

eflag_empty

Passed

N/A

0.197970s

eflag_file

Passed

N/A

0.299371s

eflag_ignore

Passed

N/A

0.186697s

eflag_inline

Passed

N/A

0.493785s

eflag_match

Passed

N/A

0.316770s

eflag_multiple

Passed

N/A

0.269548s

eflag_negated

Passed

N/A

0.291333s

eflag_save

Passed

N/A

0.153835s

invalid_umask

Passed

N/A

0.149588s

oflag_empty

Passed

N/A

0.203554s

oflag_file

Passed

N/A

0.300389s

oflag_ignore

Passed

N/A

0.181727s

oflag_inline

Passed

N/A

0.488483s

oflag_match

Passed

N/A

0.315529s

oflag_multiple

Passed

N/A

0.278018s

oflag_negated

Passed

N/A

0.285149s

oflag_save

Passed

N/A

0.151963s

sflag_eq_ne

Passed

N/A

0.453844s

sflag_exit

Passed

N/A

0.567840s

sflag_ignore

Passed

N/A

0.217180s

sflag_signal

Passed

N/A

0.384796s

stdin

Passed

N/A

0.134269s

xflag

Passed

N/A

0.189052s

atf/atf-sh/atf_check_test

12.385507s

equal

Passed

N/A

0.645041s

experr_mismatch

Passed

N/A

0.306020s

expout_mismatch

Passed

N/A

0.297430s

flush_stdout_on_timeout

Passed

N/A

10.132883s

info_ok

Passed

N/A

0.417904s

null_stderr

Passed

N/A

0.295069s

null_stdout

Passed

N/A

0.283998s

atf/atf-sh/config_test

0.954937s

get

Passed

N/A

0.453448s

has

Passed

N/A

0.499967s

atf/atf-sh/integration_test

0.535090s

arguments

Passed

N/A

0.244218s

missing_script

Passed

N/A

0.144957s

no_args

Passed

N/A

0.142810s

atf/atf-sh/normalize_test

0.268883s

main

Passed

N/A

0.268021s

atf/atf-sh/tc_test

0.753345s

default_status

Passed

N/A

0.542853s

missing_body

Passed

N/A

0.209333s

atf/atf-sh/tp_test

0.261742s

srcdir

Passed

N/A

0.260131s

atf/test-programs/config_test

1.345767s

vflag

Passed

N/A

1.344948s

atf/test-programs/expect_test

4.582159s

expect_death

Passed

N/A

0.896935s

expect_exit

Passed

N/A

0.864185s

expect_fail

Passed

N/A

0.792652s

expect_pass

Passed

N/A

0.765046s

expect_signal

Passed

N/A

0.888035s

expect_timeout

Passed

N/A

0.371654s

atf/test-programs/meta_data_test

3.610577s

no_descr

Passed

N/A

1.802877s

no_head

Passed

N/A

1.806431s

atf/test-programs/result_test

2.233969s

atf_run_warnings

Passed

N/A

0.267382s

result_exception

Passed

N/A

0.154403s

result_on_stdout

Passed

N/A

0.624198s

result_to_file

Passed

N/A

0.853587s

result_to_file_fail

Passed

N/A

0.327808s

atf/test-programs/srcdir_test

4.101972s

default

Passed

N/A

0.610598s

libtool

Passed

N/A

0.623971s

relative

Passed

N/A

2.030852s

sflag

Passed

N/A

0.825914s

atf/tools/application_test

0.026696s

getopt

Passed

N/A

0.026124s

atf/tools/atffile_test

0.545937s

atffile_1

Passed

N/A

0.037505s

atffile_2

Passed

N/A

0.024323s

atffile_3

Passed

N/A

0.027679s

atffile_4

Passed

N/A

0.024763s

atffile_5

Passed

N/A

0.024802s

atffile_50

Passed

N/A

0.041693s

atffile_51

Passed

N/A

0.038588s

atffile_52

Passed

N/A

0.043268s

atffile_53

Passed

N/A

0.041869s

atffile_54

Passed

N/A

0.038662s

atffile_6

Passed

N/A

0.027635s

atffile_getters

Passed

N/A

0.024028s

read_missing_test_program

Passed

N/A

0.043172s

read_missing_test_suite

Passed

N/A

0.038983s

read_ok_simple

Passed

N/A

0.025543s

read_ok_some_globs

Passed

N/A

0.029861s

atf/tools/auto_array_test

0.230098s

auto_array_access

Passed

N/A

0.023993s

auto_array_assign

Passed

N/A

0.026474s

auto_array_assign_ref

Passed

N/A

0.023690s

auto_array_copy

Passed

N/A

0.026588s

auto_array_copy_ref

Passed

N/A

0.023847s

auto_array_get

Passed

N/A

0.023448s

auto_array_release

Passed

N/A

0.025974s

auto_array_reset

Passed

N/A

0.023886s

auto_array_scope

Passed

N/A

0.025937s

atf/tools/config_file_test

0.442161s

config_1

Passed

N/A

0.029504s

config_2

Passed

N/A

0.024044s

config_3

Passed

N/A

0.027614s

config_4

Passed

N/A

0.024192s

config_50

Passed

N/A

0.040869s

config_51

Passed

N/A

0.037903s

config_52

Passed

N/A

0.040745s

config_53

Passed

N/A

0.038454s

config_54

Passed

N/A

0.041315s

merge_configs_both_empty

Passed

N/A

0.023873s

merge_configs_lower_empty

Passed

N/A

0.023549s

merge_configs_mixed

Passed

N/A

0.026561s

merge_configs_upper_empty

Passed

N/A

0.023763s

read_config_files_none

Passed

N/A

0.029756s

atf/tools/config_test

0.080464s

get

Passed

N/A

0.028820s

get_all

Passed

N/A

0.026219s

has

Passed

N/A

0.023256s

atf/tools/env_test

0.074560s

has_get

Passed

N/A

0.023392s

set

Passed

N/A

0.025831s

unset

Passed

N/A

0.023171s

atf/tools/expand_test

0.155163s

expand_glob_base

Passed

N/A

0.025169s

expand_glob_tps

Passed

N/A

0.026153s

is_glob

Passed

N/A

0.023568s

matches_glob_plain

Passed

N/A

0.026020s

matches_glob_question

Passed

N/A

0.023782s

matches_glob_star

Passed

N/A

0.026260s

atf/tools/fs_test

0.746856s

change_directory

Passed

N/A

0.039641s

cleanup

Passed

N/A

0.039238s

cleanup_eacces_on_root

Passed

N/A

0.024448s

cleanup_eacces_on_subdir

Passed

N/A

0.042071s

directory_file_info

Passed

N/A

0.024761s

directory_names

Passed

N/A

0.027680s

directory_read

Passed

N/A

0.024593s

exists

Passed

N/A

0.041018s

file_info_perms

Passed

N/A

0.027241s

file_info_stat

Passed

N/A

0.027618s

get_current_dir

Passed

N/A

0.024885s

is_executable

Passed

N/A

0.041016s

path_branch_path

Passed

N/A

0.025012s

path_compare_different

Passed

N/A

0.023787s

path_compare_equal

Passed

N/A

0.027237s

path_concat

Passed

N/A

0.024350s

path_is_absolute

Passed

N/A

0.027525s

path_is_root

Passed

N/A

0.024203s

path_leaf_name

Passed

N/A

0.026722s

path_normalize

Passed

N/A

0.026856s

path_op_less

Passed

N/A

0.024406s

path_to_absolute

Passed

N/A

0.027453s

remove

Passed

N/A

0.037465s

temp_dir_raii

Passed

N/A

0.041880s

atf/tools/io_test

4.008310s

file_handle_copy

Passed

N/A

0.026796s

file_handle_ctor

Passed

N/A

0.023969s

file_handle_get

Passed

N/A

0.026359s

file_handle_posix_remap

Passed

N/A

0.026196s

muxer_large_buffer

Passed

N/A

2.514181s

muxer_small_buffer

Passed

N/A

1.207810s

pistream

Passed

N/A

0.024031s

systembuf_long_read

Passed

N/A

0.052417s

systembuf_long_write

Passed

N/A

0.046927s

systembuf_short_read

Passed

N/A

0.027353s

systembuf_short_write

Passed

N/A

0.024824s

atf/tools/parser_test

0.804221s

headers_1

Passed

N/A

0.040177s

headers_10

Passed

N/A

0.038870s

headers_11

Passed

N/A

0.042042s

headers_12

Passed

N/A

0.039758s

headers_2

Passed

N/A

0.040801s

headers_3

Passed

N/A

0.037996s

headers_4

Passed

N/A

0.041220s

headers_5

Passed

N/A

0.041093s

headers_6

Passed

N/A

0.041624s

headers_7

Passed

N/A

0.038791s

headers_8

Passed

N/A

0.041877s

headers_9

Passed

N/A

0.037950s

parse_error_to_string

Passed

N/A

0.027205s

parse_errors_what

Passed

N/A

0.024455s

token_getters

Passed

N/A

0.026986s

tokenizer_delims_nows

Passed

N/A

0.024420s

tokenizer_delims_ws

Passed

N/A

0.026989s

tokenizer_keywords_nows

Passed

N/A

0.046874s

tokenizer_keywords_ws

Passed

N/A

0.024395s

tokenizer_minimal_nows

Passed

N/A

0.027884s

tokenizer_minimal_ws

Passed

N/A

0.024980s

tokenizer_quotes_nows

Passed

N/A

0.026957s

tokenizer_quotes_ws

Passed

N/A

0.024470s

atf/tools/process_test

0.279380s

argv_array_assign

Passed

N/A

0.024615s

argv_array_copy

Passed

N/A

0.026319s

argv_array_exec_argv

Passed

N/A

0.023883s

argv_array_init_carray

Passed

N/A

0.026194s

argv_array_init_col

Passed

N/A

0.023593s

argv_array_init_empty

Passed

N/A

0.025387s

argv_array_init_varargs

Passed

N/A

0.026888s

argv_array_iter

Passed

N/A

0.023900s

exec_failure

Passed

N/A

0.037912s

exec_success

Passed

N/A

0.033668s

atf/tools/reader_test

0.858138s

tps_1

Passed

N/A

0.026428s

tps_2

Passed

N/A

0.024563s

tps_3

Passed

N/A

0.028431s

tps_4

Passed

N/A

0.025762s

tps_5

Passed

N/A

0.027696s

tps_50

Passed

N/A

0.038837s

tps_51

Passed

N/A

0.037887s

tps_52

Passed

N/A

0.041566s

tps_53

Passed

N/A

0.038312s

tps_54

Passed

N/A

0.044661s

tps_55

Passed

N/A

0.041399s

tps_56

Passed

N/A

0.043040s

tps_57

Passed

N/A

0.038173s

tps_58

Passed

N/A

0.041317s

tps_59

Passed

N/A

0.041037s

tps_6

Passed

N/A

0.024672s

tps_60

Passed

N/A

0.041410s

tps_61

Passed

N/A

0.037451s

tps_62

Passed

N/A

0.040738s

tps_63

Passed

N/A

0.037746s

tps_64

Passed

N/A

0.039146s

tps_65

Passed

N/A

0.040480s

tps_66

Passed

N/A

0.041027s

atf/tools/requirements_test

0.956722s

require_arch_many_fail

Passed

N/A

0.031520s

require_arch_many_ok

Passed

N/A

0.024751s

require_arch_one_fail

Passed

N/A

0.023852s

require_arch_one_ok

Passed

N/A

0.027074s

require_config_many_fail

Passed

N/A

0.023935s

require_config_many_ok

Passed

N/A

0.023386s

require_config_one_fail

Passed

N/A

0.026746s

require_config_one_ok

Passed

N/A

0.023548s

require_files_many_fail

Passed

N/A

0.041628s

require_files_many_missing

Passed

N/A

0.038309s

require_files_many_ok

Passed

N/A

0.026870s

require_files_one_fail

Passed

N/A

0.037984s

require_files_one_missing

Passed

N/A

0.040375s

require_files_one_ok

Passed

N/A

0.023563s

require_machine_many_fail

Passed

N/A

0.027287s

require_machine_many_ok

Passed

N/A

0.023738s

require_machine_one_fail

Passed

N/A

0.026843s

require_machine_one_ok

Passed

N/A

0.023826s

require_memory_fail

Passed

N/A

0.040802s

require_memory_not_enough

Passed

N/A

0.024554s

require_memory_ok

Passed

N/A

0.023913s

require_progs_many_fail

Passed

N/A

0.040909s

require_progs_many_missing

Passed

N/A

0.040069s

require_progs_many_ok

Passed

N/A

0.042025s

require_progs_one_fail

Passed

N/A

0.038309s

require_progs_one_missing

Passed

N/A

0.042601s

require_progs_one_ok

Passed

N/A

0.038840s

require_user_fail

Passed

N/A

0.036870s

require_user_root

Passed

N/A

0.026704s

require_user_unprivileged

Passed

N/A

0.025367s

atf/tools/signals_test

0.154806s

reset

Passed

N/A

0.027326s

signal_holder_destructor

Passed

N/A

0.023352s

signal_holder_preserve

Passed

N/A

0.026755s

signal_holder_process

Passed

N/A

0.023841s

signal_programmer_preserve

Passed

N/A

0.026248s

signal_programmer_program

Passed

N/A

0.023325s

atf/tools/test_program_test

1.406919s

atf_tps_writer

Passed

N/A

0.108249s

get_metadata_bad

Passed

N/A

0.065694s

get_metadata_several_tcs

Passed

N/A

0.044949s

get_metadata_zero_tcs

Passed

N/A

0.059394s

parse_test_case_result_expected_death

Passed

N/A

0.042528s

parse_test_case_result_expected_exit

Passed

N/A

0.038999s

parse_test_case_result_expected_failure

Passed

N/A

0.041117s

parse_test_case_result_expected_signal

Passed

N/A

0.039150s

parse_test_case_result_expected_timeout

Passed

N/A

0.041275s

parse_test_case_result_failed

Passed

N/A

0.039039s

parse_test_case_result_passed

Passed

N/A

0.038876s

parse_test_case_result_skipped

Passed

N/A

0.041685s

parse_test_case_result_unknown

Passed

N/A

0.041591s

read_test_case_result_empty_file

Passed

N/A

0.037898s

read_test_case_result_failed

Passed

N/A

0.024570s

read_test_case_result_invalid

Passed

N/A

0.041954s

read_test_case_result_multiline

Passed

N/A

0.027816s

read_test_case_result_no_file

Passed

N/A

0.038985s

read_test_case_result_skipped

Passed

N/A

0.028167s

tp_1

Passed

N/A

0.025799s

tp_2

Passed

N/A

0.028549s

tp_3

Passed

N/A

0.025222s

tp_4

Passed

N/A

0.028139s

tp_50

Passed

N/A

0.038460s

tp_51

Passed

N/A

0.042277s

tp_52

Passed

N/A

0.025080s

tp_53

Passed

N/A

0.042445s

tp_54

Passed

N/A

0.039079s

tp_55

Passed

N/A

0.042924s

tp_56

Passed

N/A

0.038591s

tp_57

Passed

N/A

0.042759s

tp_58

Passed

N/A

0.039052s

tp_59

Passed

N/A

0.041845s

tp_60

Passed

N/A

0.039236s

atf/tools/text_test

0.316287s

duplicate

Passed

N/A

0.023254s

join

Passed

N/A

0.031763s

match

Passed

N/A

0.041937s

split

Passed

N/A

0.025870s

split_delims

Passed

N/A

0.022722s

to_bool

Passed

N/A

0.036917s

to_bytes

Passed

N/A

0.040114s

to_string

Passed

N/A

0.022970s

to_type

Passed

N/A

0.041064s

trim

Passed

N/A

0.022913s

atf/tools/ui_test

0.159108s

paragraphs

Passed

N/A

0.024195s

w_tag_col

Passed

N/A

0.028107s

w_tag_no_repeat

Passed

N/A

0.029272s

w_tag_repeat

Passed

N/A

0.023420s

wo_tag

Passed

N/A

0.026332s

wo_tag_col

Passed

N/A

0.023764s

atf/tools/user_test

0.098724s

euid

Passed

N/A

0.022408s

is_member_of_group

Passed

N/A

0.025918s

is_root

Passed

N/A

0.025092s

is_unprivileged

Passed

N/A

0.022377s

atf/tools/atf-config_test

12.059304s

list_all

Passed

N/A

0.641751s

override_env

Passed

N/A

5.419263s

query_mixture

Passed

N/A

1.630899s

query_multiple

Passed

N/A

0.177567s

query_one

Passed

N/A

1.327632s

query_one_terse

Passed

N/A

2.707335s

query_unknown

Passed

N/A

0.148344s

atf/tools/atf-report_test

5.606868s

default

Passed

N/A

0.575989s

expect

Passed

N/A

1.649516s

oflag

Passed

N/A

1.167395s

output_csv

Passed

N/A

0.559333s

output_ticker

Passed

N/A

0.559838s

output_xml

Passed

N/A

0.555897s

output_xml_space

Passed

N/A

0.370596s

too_many_args

Passed

N/A

0.150284s

atf/tools/atf-run_test

61.485724s

atffile

Passed

N/A

2.789438s

atffile_recursive

Passed

N/A

1.437952s

broken_results

Passed

N/A

0.805087s

broken_tp_list

Passed

N/A

0.725970s

cleanup_curdir

Passed

N/A

0.802395s

cleanup_fail

Passed

N/A

0.808543s

cleanup_mount

Passed

N/A

1.124779s

cleanup_pass

Passed

N/A

0.788836s

cleanup_signal

Passed

N/A

0.109239s

cleanup_skip

Passed

N/A

0.802321s

cleanup_symlink

Passed

N/A

1.145276s

config

Passed

N/A

2.741632s

exit_codes

Passed

N/A

0.798544s

expect

Passed

N/A

1.939290s

fds

Passed

N/A

0.774652s

hooks

Passed

N/A

2.417717s

ignore_deprecated_use_fs

Passed

N/A

0.764620s

isolation_env

Passed

N/A

1.310318s

isolation_home

Passed

N/A

0.777763s

isolation_stdin

Passed

N/A

0.779628s

isolation_umask

Passed

N/A

0.758031s

missing_results

Passed

N/A

0.827826s

mux_streams

Passed

N/A

6.336947s

no_warnings

Passed

N/A

0.758206s

require_arch

Passed

N/A

5.788809s

require_config

Passed

N/A

1.929466s

require_files

Passed

N/A

3.217398s

require_machine

Passed

N/A

5.811093s

require_progs

Passed

N/A

3.230508s

require_user_bad

Passed

N/A

0.744607s

require_user_root

Passed

N/A

0.781906s

require_user_unprivileged

Passed

N/A

0.724002s

signaled

Passed

N/A

0.876729s

timeout

Passed

N/A

1.755541s

timeout_forkexit

Passed

N/A

0.782647s

vflag

Passed

N/A

2.708895s

zero_tcs

Passed

N/A

0.757456s

Failed test cases summary

Test case

Result

Reason

Duration

dev/audio/t_pad

0.990042s

pad_output

Failed

atf-check failed; see the output of the test for details

0.989103s

kernel/t_ptrace_wait

0.988475s

fpregs2

Failed

/usr/src/tests/kernel/t_ptrace_wait.c:3894: ptrace(PT_SETFPREGS, child, &r, 0) != -1 not met

0.019861s

kernel/t_ptrace_wait3

1.017154s

fpregs2

Failed

/usr/src/tests/kernel/t_ptrace_wait.c:3894: ptrace(PT_SETFPREGS, child, &r, 0) != -1 not met

0.021023s

kernel/t_ptrace_wait4

1.226303s

fork1

Failed

/usr/src/tests/kernel/t_ptrace_wait.h:295: Reported exited process

0.021472s

fpregs2

Failed

/usr/src/tests/kernel/t_ptrace_wait.c:3894: ptrace(PT_SETFPREGS, child, &r, 0) != -1 not met

0.020703s

kernel/t_ptrace_wait6

1.230549s

fork1

Failed

/usr/src/tests/kernel/t_ptrace_wait.h:295: Reported exited process

0.023892s

fpregs2

Failed

/usr/src/tests/kernel/t_ptrace_wait.c:3894: ptrace(PT_SETFPREGS, child, &r, 0) != -1 not met

0.019967s

kernel/t_ptrace_waitid

301.206123s

fork1

Failed

/usr/src/tests/kernel/t_ptrace_wait.c:1152: ptrace(PT_GET_PROCESS_STATE, child2, &state, slen) != -1 not met

0.022433s

fpregs2

Failed

/usr/src/tests/kernel/t_ptrace_wait.c:3894: ptrace(PT_SETFPREGS, child, &r, 0) != -1 not met

0.019958s

vfork1

Failed

Test case timed out after 300 seconds

300.007141s

kernel/t_ptrace_waitpid

1.264028s

fork1

Failed

/usr/src/tests/kernel/t_ptrace_wait.h:295: Reported exited process

0.022888s

fpregs2

Failed

/usr/src/tests/kernel/t_ptrace_wait.c:3894: ptrace(PT_SETFPREGS, child, &r, 0) != -1 not met

0.022549s

lib/libc/sys/t_mprotect

0.079700s

mprotect_pax

Failed

non-executable mapping made executable

0.013350s

lib/libpthread/t_mutex

53.166668s

mutex6

Failed

/usr/src/tests/lib/libpthread/t_mutex.c:524: start != 1

21.219512s

lib/libpthread/t_timedmutex

83.164502s

mutex6

Failed

/usr/src/tests/lib/libpthread/t_mutex.c:430: mutex_lock(&mutex6, &ts_lengthy): Invalid argument

21.220651s

net/net/t_mtudisc

302.228910s

mtudisc_basic

Failed

Test case timed out after 300 seconds

302.225321s

sbin/gpt/t_gpt

4.360939s

migrate_disklabel

Failed

atf-check failed; see the output of the test for details

0.255514s

recover_backup

Failed

atf-check failed; see the output of the test for details

0.311452s

Expected failures summary

Test case

Result

Reason

Duration

include/t_errno

0.014859s

errno_constants

Expected failure

PR standards/44921: 2 checks failed as expected; see output for more details

0.014241s

include/t_netdb

0.014082s

netdb_constants

Expected failure

PR standards/44777: 2 checks failed as expected; see output for more details

0.013111s

kernel/t_ptrace_wait4

1.226303s

vfork1

Expected failure

PR kern/51630: /usr/src/tests/kernel/t_ptrace_wait.h:305: WSTOPSIG(status) != expected: Unexpected stop signal received [Child exited] != [Trace/BPT trap]

0.021627s

kernel/t_ptrace_wait6

1.230549s

vfork1

Expected failure

PR kern/51630: /usr/src/tests/kernel/t_ptrace_wait.h:305: WSTOPSIG(status) != expected: Unexpected stop signal received [Child exited] != [Trace/BPT trap]

0.023626s

kernel/t_ptrace_waitpid

1.264028s

vfork1

Expected failure

PR kern/51630: /usr/src/tests/kernel/t_ptrace_wait.h:305: WSTOPSIG(status) != expected: Unexpected stop signal received [Child exited] != [Trace/BPT trap]

0.020432s

lib/libc/c063/t_fexecve

0.018781s

fexecve

Expected failure

fexecve not implemented: /usr/src/tests/lib/libc/c063/t_fexecve.c:85: access("test", F_OK) == 0 not met

0.018124s

lib/libc/regex/t_regex_att

0.152287s

leftassoc

Expected failure

Reason for breakage unknown: /usr/src/tests/lib/libc/regex/t_regex_att.c:377: res != matches ((0,4)(0,2)(2,3)(3,4) != (0,4)(0,1)(1,4)(4,4)): at line 3

0.013375s

lib/libc/sys/t_getrusage

9.232301s

getrusage_utime_back

Expected failure

PR kern/30115: anticipated error did not occur

9.189723s

getrusage_utime_zero

Expected failure

PR kern/30115: zero user time from getrusage(2)

0.013712s

lib/libtre/t_regex_att

0.218889s

rightassoc

Expected failure

Reason for breakage unknown: /usr/src/tests/lib/libtre/../libc/regex/t_regex_att.c:377: res != matches ((0,4)(0,1)(1,4)(4,4) != (0,4)(0,2)(2,3)(3,4)): at line 3

0.020621s

lib/libusbhid/t_usbhid

0.093118s

check_hid_get_data

Expected failure

only the 32-bit opcode works, 8 and 16-bit is broken: 4 checks failed as expected; see output for more details

0.013512s

check_hid_logical_range

Expected failure

only the 32-bit opcode works, 8 and 16-bit is broken: 4 checks failed as expected; see output for more details

0.014100s

check_hid_physical_range

Expected failure

only the 32-bit opcode works, 8 and 16-bit is broken: 4 checks failed as expected; see output for more details

0.014591s

lib/librumphijack/t_tcpip

4.775258s

ssh

Expected failure

PR lib/50174: atf-check failed; see the output of the test for details

1.544512s

net/if/t_compat

0.186641s

OOSIOCGIFBRDADDR

Expected failure

PR kern/51610: rump does not include COMPAT_43: /usr/src/tests/net/if/t_compat.c:72: rump_sys_ioctl(fd, ((((unsigned long)0x80000000|(unsigned long)0x40000000)) | (((sizeof(struct oifreq)) & 0x1fff) << 16) | ((('i')) << 8) | ((18))), &ifreq): Inappropriate ioctl for device

0.184905s

sbin/resize_ffs/t_shrink

37.220499s

shrink_24M_16M_v2_4096

Expected failure

PR bin/44205: atf-check failed; see the output of the test for details

10.460739s

sbin/resize_ffs/t_shrink_swapped

39.068651s

shrink_24M_16M_v2_16384

Expected failure

PR bin/44205: atf-check failed; see the output of the test for details

10.888165s

usr.bin/make/t_make

41.750817s

escape

Expected failure

see PR toolchain/49085: atf-check failed; see the output of the test for details

0.995719s

impsrc

Expected failure

see PR toolchain/49085: atf-check failed; see the output of the test for details

0.869936s

phony_end

Expected failure

see PR toolchain/49085: atf-check failed; see the output of the test for details

0.820003s

posix1

Expected failure

see PR toolchain/49085: atf-check failed; see the output of the test for details

1.340063s

suffixes

Expected failure

see PR toolchain/49085: this uses up all memory and then fails

0.530485s

usr.bin/sed/t_sed

1.332502s

emptybackref

Expected failure

PR bin/28126: atf-check failed; see the output of the test for details

0.196675s

usr.sbin/useradd/t_useradd

0.346660s

longname

Expected failure

PR bin/39546: atf-check failed; see the output of the test for details

0.346038s

fs/ffs/t_mount

0.425242s

48Kimage

Expected failure

PR kern/43573: mount failed: Invalid argument

0.118455s

fs/nfs/t_mountd

0.806167s

mountdhup

Expected failure

PR kern/5844: op failed with EACCES

0.801380s

fs/vfs/t_renamerace

116.597750s

msdosfs_renamerace

Expected failure

PR kern/43626: unmount failed: Device busy

5.312780s

msdosfs_renamerace_dirs

Expected signal

PR kern/43626

1.099159s

udf_renamerace

Expected failure

PR kern/49046: race did not trigger this time

5.322826s

fs/vfs/t_vfsops

27.740578s

lfs_tfhremove

Expected failure

fhopen() for removed file succeeds (PR kern/43745): /usr/src/tests/fs/vfs/t_vfsops.c:152: Expected true value in rump_sys_fhopen(fhp, fhsize, O_RDONLY) == -1

0.380152s

ipf/t_filter_exec

16.285820s

f26

Expected failure

Known to be broken: results differ

0.455837s

f27

Expected failure

Known to be broken: results differ

0.435310s

ipf/t_filter_parse

3.837544s

i17

Expected failure

Known to be broken: atf-check failed; see the output of the test for details

0.172543s

ipf/t_nat_exec

10.521203s

n8_6

Expected failure

See PR kern/47665: results differ

0.223738s

n9_6

Expected failure

See PR kern/47665: results differ

0.223226s

atf/atf-c/macros_test

1.337553s

detect_unused_tests

Expected failure

PR 49187: Build of unused_test.c passed; unused test cases are not properly detected

0.359085s

atf/atf-c++/macros_test

7.173883s

detect_unused_tests

Expected failure

PR 49187: Build of unused_test.cpp passed; unused test cases are not properly detected

2.557856s

Skipped test cases summary

Test case

Result

Reason

Duration

include/t_paths

0.012974s

paths

Skipped

PR port-sparc/45580

0.012272s

kernel/t_ptrace

0.074240s

attach_pid1_securelevel

Skipped

Test must be run with securelevel >= 1

0.012582s

lib/libc/gen/exect/t_exect

0.013091s

t_exect_null

Skipped

exect(3) misdesigned and hangs - PR port-amd64/51700

0.012478s

lib/libc/string/t_popcount

0.026907s

popcount_basic

Skipped

config variable "run_popcount" not set to YES/TRUE

0.013349s

popcountll_basic

Skipped

config variable "run_popcount" not set to YES/TRUE

0.011881s

lib/libc/sys/t_kevent

0.103287s

kqueue_desc_passing

Skipped

PR kern/46523

0.016622s

lib/libc/sys/t_mmap

0.186010s

mmap_block

Skipped

The test case causes a panic (PR kern/38889, kern/46592)

0.012335s

lib/libc/sys/t_mprotect

0.079700s

mprotect_exec

Skipped

Execute protection callback check not implemented

0.012811s

lib/librumphijack/t_tcpip

4.775258s

nfs_autoload

Skipped

test currently valid only on i386

0.245396s

sbin/gpt/t_gpt

4.360939s

bootable_2part

Skipped

Required file '/usr/mdec/gptmbr.bin' not found

0.000334s

fs/vfs/t_full

10.251181s

p2k_ffs_fillfs

Skipped

fs does not support explicit block allocation (GOP_ALLOC)

0.392962s

puffs_fillfs

Skipped

fs does not support explicit block allocation (GOP_ALLOC)

0.305026s

rumpfs_fillfs

Skipped

fs does not support explicit block allocation (GOP_ALLOC)

0.284345s

fs/vfs/t_renamerace

116.597750s

rumpfs_renamerace

Skipped

rename not supported by file system

0.264526s

rumpfs_renamerace_dirs

Skipped

rename not supported by file system

0.285095s

sysvbfs_renamerace

Skipped

filesystem has not enough inodes

0.297526s

sysvbfs_renamerace_dirs

Skipped

directories not supported by file system

0.305752s

fs/vfs/t_rmdirrace

124.953835s

sysvbfs_race

Skipped

directories not supported by file system

0.293689s

fs/vfs/t_union

9.527770s

ext2fs_basic

Skipped

fs does not support VOP_WHITEOUT

0.313800s

ext2fs_whiteout

Skipped

fs does not support VOP_WHITEOUT

0.356192s

msdosfs_basic

Skipped

fs does not support VOP_WHITEOUT

0.307678s

msdosfs_whiteout

Skipped

fs does not support VOP_WHITEOUT

0.331622s

nfs_basic

Skipped

fs does not support VOP_WHITEOUT

0.631683s

nfs_whiteout

Skipped

fs does not support VOP_WHITEOUT

0.635609s

p2k_ffs_basic

Skipped

fs does not support VOP_WHITEOUT

0.422087s

p2k_ffs_whiteout

Skipped

fs does not support VOP_WHITEOUT

0.456687s

puffs_basic

Skipped

fs does not support VOP_WHITEOUT

0.316088s

puffs_whiteout

Skipped

fs does not support VOP_WHITEOUT

0.350344s

sysvbfs_basic

Skipped

fs does not support VOP_WHITEOUT

0.311162s

sysvbfs_whiteout

Skipped

fs does not support VOP_WHITEOUT

0.341511s

udf_basic

Skipped

fs does not support VOP_WHITEOUT

0.293165s

udf_whiteout

Skipped

fs does not support VOP_WHITEOUT

0.363863s

v7fs_basic

Skipped

fs does not support VOP_WHITEOUT

0.303912s

v7fs_whiteout

Skipped

fs does not support VOP_WHITEOUT

0.341237s

fs/vfs/t_unpriv

19.077013s

msdosfs_owner

Skipped

owner not supported by file system

0.291857s

nfs_flags

Skipped

file flags not supported by file system

0.635245s

puffs_flags

Skipped

file flags not supported by file system

0.317328s

sysvbfs_dirperms

Skipped

directories not supported by file system

0.288014s

sysvbfs_flags

Skipped

file flags not supported by file system

0.307836s

udf_flags

Skipped

file flags not supported by file system

0.318957s

fs/vfs/t_vfsops

27.740578s

rumpfs_tfhinval

Skipped

file handles not supported

0.289356s

rumpfs_tfhremove

Skipped

file handles not supported

0.270513s

rumpfs_tfilehandle

Skipped

file handles not supported

0.271336s

sysvbfs_tfhinval

Skipped

file handles not supported

0.306973s

sysvbfs_tfhremove

Skipped

file handles not supported

0.305240s

sysvbfs_tfilehandle

Skipped

file handles not supported

0.290309s

udf_tfhinval

Skipped

file handles not supported

0.305032s

udf_tfhremove

Skipped

file handles not supported

0.304611s

udf_tfilehandle

Skipped

file handles not supported

0.303219s

v7fs_tfhinval

Skipped

file handles not supported

0.326885s

v7fs_tfhremove

Skipped

file handles not supported

0.305380s

v7fs_tfilehandle

Skipped

file handles not supported

0.329524s

fs/vfs/t_vnops

161.403927s

msdosfs_lstat_symlink

Skipped

symlinks not supported by file system

0.339620s

msdosfs_symlink_long

Skipped

symlinks not supported by file system

0.339473s

msdosfs_symlink_root

Skipped

symlinks not supported by file system

0.317177s

msdosfs_symlink_zerolen

Skipped

symlinks not supported by file system

0.317644s

rumpfs_rename_dir

Skipped

rename not supported by file system

0.293730s

rumpfs_rename_dotdot

Skipped

rename not supported by file system

0.316310s

rumpfs_rename_nametoolong

Skipped

rename not supported by file system

0.311718s

rumpfs_rename_reg_nodir

Skipped

rename not supported by file system

0.291803s

sysvbfs_dir_notempty

Skipped

directories not supported by file system

0.335293s

sysvbfs_dir_rmdirdotdot

Skipped

directories not supported by file system

0.330594s

sysvbfs_dir_simple

Skipped

directories not supported by file system

0.333147s

sysvbfs_lookup_complex

Skipped

directories not supported by file system

0.332671s

sysvbfs_lstat_symlink

Skipped

symlinks not supported by file system

0.332408s

sysvbfs_rename_dir

Skipped

directories not supported by file system

0.317899s

sysvbfs_rename_dotdot

Skipped

directories not supported by file system

0.333503s

sysvbfs_symlink_long

Skipped

symlinks not supported by file system

0.314449s

sysvbfs_symlink_root

Skipped

symlinks not supported by file system

0.323637s

sysvbfs_symlink_zerolen

Skipped

symlinks not supported by file system

0.336142s

fs/cd9660/t_high_ino_big_file

0.319133s

pr_kern_48787

Skipped

not enough free disk space, have 1048344 Kbytes, need ~ 4500000 Kbytes

0.318513s

rump/rumpkern/t_kern

0.553682s

lockme_DOUBLEINIT

Skipped

test requires LOCKDEBUG kernel

0.021394s

lockme_MEMFREE

Skipped

test requires LOCKDEBUG kernel

0.019430s

lockme_RWRX

Skipped

test requires LOCKDEBUG kernel

0.019257s

rump/modautoload/t_modautoload

0.022849s

modautoload

Skipped

host kernel modules not supported

0.022240s

crypto/libcrypto/t_ciphers

4.179546s

rc5

Skipped

RC5 support not available; system built with MKCRYPTO_RC5=no

0.098086s

crypto/opencrypto/t_opencrypto

5.389674s

arc4

Skipped

ARC4 not implemented by swcrypto

0.267485s

share/examples/t_asm

0.375261s

hello

Skipped

Example program not implemented on this platform

0.374610s

atf/atf-c/pkg_config_test

0.003907s

build

Skipped

Required program 'pkg-config' not found in the PATH

0.001940s

version

Skipped

Required program 'pkg-config' not found in the PATH

0.001857s

atf/atf-c++/pkg_config_test

0.003685s

build

Skipped

Required program 'pkg-config' not found in the PATH

0.001717s

version

Skipped

Required program 'pkg-config' not found in the PATH

0.001880s

Execution details

Environment variables

Test case: dev/audio/t_pad/pad_output

Duration: 0.989103 seconds

Termination reason

FAILED: atf-check failed; see the output of the test for details

Standard output stream

Executing command [ uudecode /usr/tests/dev/audio/t_pad_output.bz2.uue ]
Executing command [ bunzip2 t_pad_output.bz2 ]
Executing command [ /usr/tests/dev/audio/h_pad ]

Standard error stream

Fail: stdout does not match golden output
Binary files t_pad_output and /tmp/check.vaYpQf/stdout differ
Error while running diff(3)

Test case: include/t_errno/errno_constants

Duration: 0.014241 seconds

Termination reason

XFAIL: PR standards/44921: 2 checks failed as expected; see output for more details

Standard error stream

*** Expected check failure: PR standards/44921: ENOTRECOVERABLE not defined
*** Expected check failure: PR standards/44921: EOWNERDEAD not defined

Test case: include/t_netdb/netdb_constants

Duration: 0.013111 seconds

Termination reason

XFAIL: PR standards/44777: 2 checks failed as expected; see output for more details

Standard error stream

*** Expected check failure: PR standards/44777: AI_V4MAPPED not defined
*** Expected check failure: PR standards/44777: AI_ALL not defined

Test case: include/t_paths/paths

Duration: 0.012272 seconds

Termination reason

SKIPPED: PR port-sparc/45580

Test case: kernel/t_ptrace/attach_pid1_securelevel

Duration: 0.012582 seconds

Termination reason

SKIPPED: Test must be run with securelevel >= 1

Test case: kernel/t_ptrace_wait/fpregs2

Duration: 0.019861 seconds

Termination reason

FAILED: /usr/src/tests/kernel/t_ptrace_wait.c:3894: ptrace(PT_SETFPREGS, child, &r, 0) != -1 not met

Standard output stream

Before forking process PID=11446
Parent process PID=11446, child's PID=11006
Before calling wait() for the child
Before calling PT_TRACE_ME from child 11006
Before raising Stopped (signal) from child
Call GETFPREGS for the child process
Call SETFPREGS for the child (without changed regs)

Test case: kernel/t_ptrace_wait3/fpregs2

Duration: 0.021023 seconds

Termination reason

FAILED: /usr/src/tests/kernel/t_ptrace_wait.c:3894: ptrace(PT_SETFPREGS, child, &r, 0) != -1 not met

Standard output stream

Before forking process PID=11105
Before calling PT_TRACE_ME from child 10958
Before raising Stopped (signal) from child
Parent process PID=11105, child's PID=10958
Before calling wait3() for the child
Call GETFPREGS for the child process
Call SETFPREGS for the child (without changed regs)

Test case: kernel/t_ptrace_wait4/fork1

Duration: 0.021472 seconds

Termination reason

FAILED: /usr/src/tests/kernel/t_ptrace_wait.h:295: Reported exited process

Standard output stream

Before forking process PID=11524
Parent process PID=11524, child's PID=11576
Before calling wait4() for the child
Before calling PT_TRACE_ME from child 11576
Before raising Stopped (signal) from child
Enable PTRACE_FORK in EVENT_MASK for the child 11576
Before resuming the child process where it left off and without signal to be sent
Before calling wait4() for the child 11576
Reported PTRACE_FORK event with forkee 23036
Before calling wait4() for the forkee 23036 of the child 11576

Test case: kernel/t_ptrace_wait4/fpregs2

Duration: 0.020703 seconds

Termination reason

FAILED: /usr/src/tests/kernel/t_ptrace_wait.c:3894: ptrace(PT_SETFPREGS, child, &r, 0) != -1 not met

Standard output stream

Before forking process PID=11766
Parent process PID=11766, child's PID=21002
Before calling wait4() for the child
Before calling PT_TRACE_ME from child 21002
Before raising Stopped (signal) from child
Call GETFPREGS for the child process
Call SETFPREGS for the child (without changed regs)

Test case: kernel/t_ptrace_wait4/vfork1

Duration: 0.021627 seconds

Termination reason

XFAIL: PR kern/51630: /usr/src/tests/kernel/t_ptrace_wait.h:305: WSTOPSIG(status) != expected: Unexpected stop signal received [Child exited] != [Trace/BPT trap]

Standard output stream

Before forking process PID=11704
Before calling PT_TRACE_ME from child 22274
Before raising Stopped (signal) from child
Parent process PID=11704, child's PID=22274
Before calling wait4() for the child
Enable PTRACE_VFORK in EVENT_MASK for the child 22274
Before resuming the child process where it left off and without signal to be sent
Before calling wait4() for the child 22274

Test case: kernel/t_ptrace_wait6/fork1

Duration: 0.023892 seconds

Termination reason

FAILED: /usr/src/tests/kernel/t_ptrace_wait.h:295: Reported exited process

Standard output stream

Before forking process PID=10629
Before calling PT_TRACE_ME from child 21777
Before raising Stopped (signal) from child
Parent process PID=10629, child's PID=21777
Before calling wait6() for the child
Enable PTRACE_FORK in EVENT_MASK for the child 21777
Before resuming the child process where it left off and without signal to be sent
Before calling wait6() for the child 21777
Reported PTRACE_FORK event with forkee 20842
Before calling wait6() for the forkee 20842 of the child 21777

Test case: kernel/t_ptrace_wait6/fpregs2

Duration: 0.019967 seconds

Termination reason

FAILED: /usr/src/tests/kernel/t_ptrace_wait.c:3894: ptrace(PT_SETFPREGS, child, &r, 0) != -1 not met

Standard output stream

Before forking process PID=23228
Before calling PT_TRACE_ME from child 11716
Before raising Stopped (signal) from child
Parent process PID=23228, child's PID=11716
Before calling wait6() for the child
Call GETFPREGS for the child process
Call SETFPREGS for the child (without changed regs)

Test case: kernel/t_ptrace_wait6/vfork1

Duration: 0.023626 seconds

Termination reason

XFAIL: PR kern/51630: /usr/src/tests/kernel/t_ptrace_wait.h:305: WSTOPSIG(status) != expected: Unexpected stop signal received [Child exited] != [Trace/BPT trap]

Standard output stream

Before forking process PID=21905
Parent process PID=21905, child's PID=20308
Before calling wait6() for the child
Before calling PT_TRACE_ME from child 20308
Before raising Stopped (signal) from child
Enable PTRACE_VFORK in EVENT_MASK for the child 20308
Before resuming the child process where it left off and without signal to be sent
Before calling wait6() for the child 20308

Test case: kernel/t_ptrace_waitid/fork1

Duration: 0.022433 seconds

Termination reason

FAILED: /usr/src/tests/kernel/t_ptrace_wait.c:1152: ptrace(PT_GET_PROCESS_STATE, child2, &state, slen) != -1 not met

Standard output stream

Before forking process PID=23708
Parent process PID=23708, child's PID=22128
Before calling waitid() for the child
Before calling PT_TRACE_ME from child 22128
Before raising Stopped (signal) from child
Enable PTRACE_FORK in EVENT_MASK for the child 22128
Before resuming the child process where it left off and without signal to be sent
Before calling waitid() for the child 22128
Reported PTRACE_FORK event with forkee 22415
Before calling waitid() for the forkee 22415 of the child 22128

Test case: kernel/t_ptrace_waitid/fpregs2

Duration: 0.019958 seconds

Termination reason

FAILED: /usr/src/tests/kernel/t_ptrace_wait.c:3894: ptrace(PT_SETFPREGS, child, &r, 0) != -1 not met

Standard output stream

Before forking process PID=21034
Parent process PID=21034, child's PID=10821
Before calling waitid() for the child
Before calling PT_TRACE_ME from child 10821
Before raising Stopped (signal) from child
Call GETFPREGS for the child process
Call SETFPREGS for the child (without changed regs)

Test case: kernel/t_ptrace_waitid/vfork1

Duration: 300.007141 seconds

Termination reason

FAILED: Test case timed out after 300 seconds

Standard output stream

Before forking process PID=22256
Parent process PID=22256, child's PID=10144
Before calling waitid() for the child
Before calling PT_TRACE_ME from child 10144
Before raising Stopped (signal) from child
Enable PTRACE_VFORK in EVENT_MASK for the child 10144
Before resuming the child process where it left off and without signal to be sent
Before calling waitid() for the child 10144
Reported PTRACE_VFORK event with forkee 0
Before calling waitid() for the forkee 0 of the child 10144

Test case: kernel/t_ptrace_waitpid/fork1

Duration: 0.022888 secon