ATF Tests Results

Execution summary

Item

Value

ATF

Version

Automated Testing Framework 0.20 (atf-0.20)

Timings

Start time of tests

Tue Dec 20 15:11:06 CET 2016

End time of tests

Tue Dec 20 16:35:28 CET 2016

System information

Host name

thirdstage.duskware.de

Operating system

NetBSD

Operating system release

7.99.51

Operating system version

NetBSD 7.99.51 (MODULAR) #584: Tue Dec 20 14:12:53 CET 2016 martin@thirdstage.duskware.de:/usr/src/sys/arch/sparc64/compile/MODULAR

Platform

sparc64

Tests results

Root

/usr/tests

Test programs

676

Bogus test programs

0

Test cases

4788

Passed test cases

4652

Failed test cases

17

Expected failures

37

Skipped test cases

82

See more execution details

Test cases summary

Test case

Result

Reason

Duration

bin/cat/t_cat

0.653038s

align

Passed

N/A

0.366413s

nonexistent

Passed

N/A

0.148721s

se_output

Passed

N/A

0.135170s

bin/cp/t_cp

2.346556s

dir_to_dir

Passed

N/A

0.493765s

dir_to_file

Passed

N/A

0.169362s

file_over_link

Passed

N/A

0.156643s

file_to_file

Passed

N/A

0.369137s

file_to_link

Passed

N/A

0.153376s

file_to_linkdir

Passed

N/A

0.233511s

files_to_dir

Passed

N/A

0.193521s

link_over_file

Passed

N/A

0.168810s

link_to_file

Passed

N/A

0.190580s

linkdir_to_file

Passed

N/A

0.197230s

bin/dd/t_dd

0.987152s

io

Passed

N/A

0.499859s

length

Passed

N/A

0.194384s

seek

Passed

N/A

0.290346s

bin/df/t_df

0.298452s

hflag

Passed

N/A

0.154101s

normal

Passed

N/A

0.142733s

bin/expr/t_expr

2.000342s

arithmetic_ops

Passed

N/A

0.151438s

basic_functional

Passed

N/A

0.123049s

basic_math

Passed

N/A

0.103382s

colon_vs_math

Passed

N/A

0.113410s

compare_ops

Passed

N/A

0.223064s

compare_ops_precedence

Passed

N/A

0.105141s

gtkmm

Passed

N/A

0.162759s

lang

Passed

N/A

0.205593s

math_precedence

Passed

N/A

0.104139s

multiply

Passed

N/A

0.115882s

negative

Passed

N/A

0.146766s

overflow

Passed

N/A

0.224631s

precedence

Passed

N/A

0.106721s

regex

Passed

N/A

0.106311s

bin/pax/t_pax

0.288271s

append

Passed

N/A

0.286867s

bin/ps/t_ps

3.018083s

default_columns

Passed

N/A

0.885191s

duplicate_column

Passed

N/A

0.217497s

minus_O

Passed

N/A

0.306494s

minus_o

Passed

N/A

0.366854s

override_heading_all_null

Passed

N/A

0.261630s

override_heading_embedded_specials

Passed

N/A

0.316126s

override_heading_simple

Passed

N/A

0.294996s

override_heading_some_null

Passed

N/A

0.362899s

bin/sh/dotcmd/t_dotcmd

38.216697s

case_break_case

Passed

N/A

0.213526s

case_break_compound

Passed

N/A

0.200028s

case_break_file

Passed

N/A

0.190230s

case_break_for

Passed

N/A

0.196502s

case_break_func

Passed

N/A

0.190473s

case_break_subshell

Passed

N/A

0.193156s

case_break_until

Passed

N/A

0.193721s

case_break_while

Passed

N/A

0.188632s

case_continue_case

Passed

N/A

0.192958s

case_continue_compound

Passed

N/A

0.194675s

case_continue_file

Passed

N/A

0.192179s

case_continue_for

Passed

N/A

0.194881s

case_continue_func

Passed

N/A

0.208764s

case_continue_subshell

Passed

N/A

0.201234s

case_continue_until

Passed

N/A

0.198588s

case_continue_while

Passed

N/A

0.188587s

case_return_case

Passed

N/A

0.203647s

case_return_compound

Passed

N/A

0.197113s

case_return_file

Passed

N/A

0.202296s

case_return_for

Passed

N/A

0.196652s

case_return_func

Passed

N/A

0.197745s

case_return_subshell

Passed

N/A

0.200371s

case_return_until

Passed

N/A

0.199290s

case_return_while

Passed

N/A

0.188443s

compound_break_case

Passed

N/A

0.197966s

compound_break_compound

Passed

N/A

0.195134s

compound_break_file

Passed

N/A

0.202890s

compound_break_for

Passed

N/A

0.197516s

compound_break_func

Passed

N/A

0.198431s

compound_break_subshell

Passed

N/A

0.200948s

compound_break_until

Passed

N/A

0.206289s

compound_break_while

Passed

N/A

0.199946s

compound_continue_case

Passed

N/A

0.197244s

compound_continue_compound

Passed

N/A

0.200002s

compound_continue_file

Passed

N/A

0.196859s

compound_continue_for

Passed

N/A

0.193247s

compound_continue_func

Passed

N/A

0.191512s

compound_continue_subshell

Passed

N/A

0.193431s

compound_continue_until

Passed

N/A

0.207900s

compound_continue_while

Passed

N/A

0.194794s

compound_return_case

Passed

N/A

0.197086s

compound_return_compound

Passed

N/A

0.198796s

compound_return_file

Passed

N/A

0.197288s

compound_return_for

Passed

N/A

0.202299s

compound_return_func

Passed

N/A

0.200649s

compound_return_subshell

Passed

N/A

0.198890s

compound_return_until

Passed

N/A

0.198105s

compound_return_while

Passed

N/A

0.200146s

file_break_case

Passed

N/A

0.213004s

file_break_compound

Passed

N/A

0.209180s

file_break_file

Passed

N/A

0.203678s

file_break_for

Passed

N/A

0.190925s

file_break_func

Passed

N/A

0.192126s

file_break_subshell

Passed

N/A

0.198105s

file_break_until

Passed

N/A

0.195817s

file_break_while

Passed

N/A

0.192286s

file_continue_case

Passed

N/A

0.188616s

file_continue_compound

Passed

N/A

0.190841s

file_continue_file

Passed

N/A

0.190169s

file_continue_for

Passed

N/A

0.195226s

file_continue_func

Passed

N/A

0.195733s

file_continue_subshell

Passed

N/A

0.199035s

file_continue_until

Passed

N/A

0.189926s

file_continue_while

Passed

N/A

0.195921s

file_return_case

Passed

N/A

0.206200s

file_return_compound

Passed

N/A

0.194653s

file_return_file

Passed

N/A

0.190000s

file_return_for

Passed

N/A

0.194337s

file_return_func

Passed

N/A

0.189799s

file_return_subshell

Passed

N/A

0.195330s

file_return_until

Passed

N/A

0.201905s

file_return_while

Passed

N/A

0.199399s

for_break_case

Passed

N/A

0.197532s

for_break_compound

Passed

N/A

0.191910s

for_break_file

Passed

N/A

0.189330s

for_break_for

Passed

N/A

0.188122s

for_break_func

Passed

N/A

0.188910s

for_break_subshell

Passed

N/A

0.200308s

for_break_until

Passed

N/A

0.190005s

for_break_while

Passed

N/A

0.189536s

for_continue_case

Passed

N/A

0.189627s

for_continue_compound

Passed

N/A

0.189850s

for_continue_file

Passed

N/A

0.198664s

for_continue_for

Passed

N/A

0.196824s

for_continue_func

Passed

N/A

0.199937s

for_continue_subshell

Passed

N/A

0.202812s

for_continue_until

Passed

N/A

0.196960s

for_continue_while

Passed

N/A

0.198346s

for_return_case

Passed

N/A

0.197547s

for_return_compound

Passed

N/A

0.197233s

for_return_file

Passed

N/A

0.202641s

for_return_for

Passed

N/A

0.190476s

for_return_func

Passed

N/A

0.188052s

for_return_subshell

Passed

N/A

0.208424s

for_return_until

Passed

N/A

0.198212s

for_return_while

Passed

N/A

0.197840s

func_break_case

Passed

N/A

0.196505s

func_break_compound

Passed

N/A

0.200585s

func_break_file

Passed

N/A

0.199668s

func_break_for

Passed

N/A

0.200359s

func_break_func

Passed

N/A

0.210552s

func_break_subshell

Passed

N/A

0.195878s

func_break_until

Passed

N/A

0.196944s

func_break_while

Passed

N/A

0.198634s

func_continue_case

Passed

N/A

0.191540s

func_continue_compound

Passed

N/A

0.193959s

func_continue_file

Passed

N/A

0.190963s

func_continue_for

Passed

N/A

0.193772s

func_continue_func

Passed

N/A

0.196911s

func_continue_subshell

Passed

N/A

0.194952s

func_continue_until

Passed

N/A

0.192983s

func_continue_while

Passed

N/A

0.204115s

func_return_case

Passed

N/A

0.198303s

func_return_compound

Passed

N/A

0.199270s

func_return_file

Passed

N/A

0.196916s

func_return_for

Passed

N/A

0.199118s

func_return_func

Passed

N/A

0.195407s

func_return_subshell

Passed

N/A

0.204327s

func_return_until

Passed

N/A

0.204777s

func_return_while

Passed

N/A

0.197806s

subshell_break_case

Passed

N/A

0.207470s

subshell_break_compound

Passed

N/A

0.201325s

subshell_break_file

Passed

N/A

0.201892s

subshell_break_for

Passed

N/A

0.199940s

subshell_break_func

Passed

N/A

0.202722s

subshell_break_subshell

Passed

N/A

0.203009s

subshell_break_until

Passed

N/A

0.200735s

subshell_break_while

Passed

N/A

0.204972s

subshell_continue_case

Passed

N/A

0.200454s

subshell_continue_compound

Passed

N/A

0.205971s

subshell_continue_file

Passed

N/A

0.203305s

subshell_continue_for

Passed

N/A

0.196342s

subshell_continue_func

Passed

N/A

0.203886s

subshell_continue_subshell

Passed

N/A

0.203916s

subshell_continue_until

Passed

N/A

0.200264s

subshell_continue_while

Passed

N/A

0.202621s

subshell_return_case

Passed

N/A

0.196511s

subshell_return_compound

Passed

N/A

0.200676s

subshell_return_file

Passed

N/A

0.200493s

subshell_return_for

Passed

N/A

0.208902s

subshell_return_func

Passed

N/A

0.203683s

subshell_return_subshell

Passed

N/A

0.201337s

subshell_return_until

Passed

N/A

0.200887s

subshell_return_while

Passed

N/A

0.193876s

until_break_case

Passed

N/A

0.190780s

until_break_compound

Passed

N/A

0.202456s

until_break_file

Passed

N/A

0.192433s

until_break_for

Passed

N/A

0.194523s

until_break_func

Passed

N/A

0.198509s

until_break_subshell

Passed

N/A

0.209640s

until_break_until

Passed

N/A

0.217783s

until_break_while

Passed

N/A

0.197599s

until_continue_case

Passed

N/A

0.198376s

until_continue_compound

Passed

N/A

0.203373s

until_continue_file

Passed

N/A

0.205586s

until_continue_for

Passed

N/A

0.198794s

until_continue_func

Passed

N/A

0.204196s

until_continue_subshell

Passed

N/A

0.207204s

until_continue_until

Passed

N/A

0.201928s

until_continue_while

Passed

N/A

0.191369s

until_return_case

Passed

N/A

0.193998s

until_return_compound

Passed

N/A

0.191796s

until_return_file

Passed

N/A

0.197857s

until_return_for

Passed

N/A

0.192250s

until_return_func

Passed

N/A

0.206416s

until_return_subshell

Passed

N/A

0.205124s

until_return_until

Passed

N/A

0.203524s

until_return_while

Passed

N/A

0.197084s

while_break_case

Passed

N/A

0.203697s

while_break_compound

Passed

N/A

0.190374s

while_break_file

Passed

N/A

0.198355s

while_break_for

Passed

N/A

0.198238s

while_break_func

Passed

N/A

0.195778s

while_break_subshell

Passed

N/A

0.205505s

while_break_until

Passed

N/A

0.199360s

while_break_while

Passed

N/A

0.201628s

while_continue_case

Passed

N/A

0.198126s

while_continue_compound

Passed

N/A

0.198373s

while_continue_file

Passed

N/A

0.200614s

while_continue_for

Passed

N/A

0.199173s

while_continue_func

Passed

N/A

0.209730s

while_continue_subshell

Passed

N/A

0.204042s

while_continue_until

Passed

N/A

0.197285s

while_continue_while

Passed

N/A

0.200476s

while_return_case

Passed

N/A

0.197381s

while_return_compound

Passed

N/A

0.201284s

while_return_file

Passed

N/A

0.199926s

while_return_for

Passed

N/A

0.197609s

while_return_func

Passed

N/A

0.197724s

while_return_subshell

Passed

N/A

0.203522s

while_return_until

Passed

N/A

0.200283s

while_return_while

Passed

N/A

0.197378s

bin/sh/t_arith

12.672531s

constants

Passed

N/A

0.754541s

do_unary_minus

Passed

N/A

0.394281s

do_unary_not

Passed

N/A

0.332860s

do_unary_plus

Passed

N/A

0.324868s

do_unary_tilde

Passed

N/A

0.299838s

elementary_add

Passed

N/A

0.520849s

elementary_div

Passed

N/A

0.485872s

elementary_eq

Passed

N/A

0.609466s

elementary_ge

Passed

N/A

0.300805s

elementary_gt

Passed

N/A

0.554012s

elementary_le

Passed

N/A

0.452487s

elementary_lt

Passed

N/A

0.426370s

elementary_mul

Passed

N/A

0.556314s

elementary_ne

Passed

N/A

0.501900s

elementary_rem

Passed

N/A

0.657944s

elementary_shl

Passed

N/A

0.429590s

elementary_shr

Passed

N/A

0.522809s

elementary_sub

Passed

N/A

0.470202s

fiddle_bits_and

Passed

N/A

0.392973s

fiddle_bits_or

Passed

N/A

0.377156s

fiddle_bits_xor

Passed

N/A

0.378175s

logical_and

Passed

N/A

0.349118s

logical_or

Passed

N/A

0.355189s

make_selection

Passed

N/A

0.346013s

operator_precedence

Passed

N/A

0.948758s

parentheses

Passed

N/A

0.910043s

bin/sh/t_cmdsub

7.442282s

a_basic_cmdsub

Passed

N/A

0.612718s

b_basic_backticks

Passed

N/A

0.605705s

c_nested_cmdsub

Passed

N/A

0.220008s

d_nested_backticks

Passed

N/A

0.224292s

e_perverse_mixing

Passed

N/A

0.305566s

f_redirect_in_cmdsub

Passed

N/A

0.339249s

g_redirect_in_backticks

Passed

N/A

0.338604s

h_vars_in_cmdsub

Passed

N/A

0.449167s

i_vars_in_backticks

Passed

N/A

0.411330s

j_cmdsub_in_varexpand

Passed

N/A

0.234252s

k_backticks_in_varexpand

Passed

N/A

0.234609s

l_arithmetic_in_cmdsub

Passed

N/A

0.205803s

m_arithmetic_in_backticks

Passed

N/A

0.205154s

n_cmdsub_in_arithmetic

Passed

N/A

0.205779s

o_backticks_in_arithmetic

Passed

N/A

0.214638s

p_cmdsub_in_heredoc

Passed

N/A

0.146263s

q_backticks_in_heredoc

Passed

N/A

0.147037s

r_heredoc_in_cmdsub

Passed

N/A

0.248010s

s_heredoc_in_backticks

Passed

N/A

0.194574s

t_nested_cmdsubs_in_heredoc

Passed

N/A

0.282334s

u_nested_backticks_in_heredoc

Passed

N/A

0.282104s

v_cmdsub_paren_tests

Passed

N/A

0.634765s

w_heredoc_outside_cmdsub

Passed

N/A

0.250847s

x_heredoc_outside_backticks

Passed

N/A

0.189711s

z_absurd_heredoc_cmdsub_combos

Passed

N/A

0.240812s

bin/sh/t_evaltested

0.110365s

evaltested

Passed

N/A

0.109399s

bin/sh/t_exit

2.299694s

background

Passed

N/A

0.159187s

function

Passed

N/A

0.133807s

readout

Passed

N/A

0.127935s

simple_exit

Passed

N/A

0.629851s

subshell_background

Passed

N/A

0.157938s

subshell_exit

Passed

N/A

0.690715s

trap_subshell

Passed

N/A

0.140785s

trap_zero__explicit_exit

Passed

N/A

0.127075s

trap_zero__implicit_exit

Passed

N/A

0.126322s

bin/sh/t_expand

2.418482s

arithmetic

Passed

N/A

0.196858s

dollar_at

Passed

N/A

0.208174s

dollar_at_with_text

Passed

N/A

0.489007s

iteration_on_null_or_missing_parameter

Passed

N/A

0.123787s

iteration_on_null_or_null_parameter

Passed

N/A

0.128689s

iteration_on_null_parameter

Passed

N/A

0.126817s

iteration_on_quoted_null_parameter

Passed

N/A

0.124941s

shell_params

Passed

N/A

0.412679s

strip

Passed

N/A

0.474853s

varpattern_backslashes

Passed

N/A

0.125607s

bin/sh/t_fsplit

3.331796s

default_val

Passed

N/A

0.748787s

dollar_at

Passed

N/A

0.618675s

for

Passed

N/A

0.114209s

ifs

Passed

N/A

0.326477s

ifs_alpha

Passed

N/A

0.236144s

quote

Passed

N/A

0.171698s

replacement_val

Passed

N/A

0.915434s

var_length

Passed

N/A

0.194354s

bin/sh/t_here

11.037354s

do_simple

Passed

N/A

0.792996s

end_markers

Passed

N/A

8.089460s

incomplete

Passed

N/A

0.554081s

lineends

Passed

N/A

0.484375s

multiple

Passed

N/A

0.286069s

nested

Passed

N/A

0.220483s

quoting

Passed

N/A

0.249411s

side_effects

Passed

N/A

0.142514s

vicious

Passed

N/A

0.211319s

bin/sh/t_option

6.913397s

Option_switching

Passed

N/A

1.467147s

restore_local_opts

Passed

N/A

0.187367s

set_C

Passed

N/A

0.430017s

set_a

Passed

N/A

0.258440s

set_e

Passed

N/A

0.266116s

set_f

Passed

N/A

0.253921s

set_n

Passed

N/A

2.429667s

set_u

Passed

N/A

0.594376s

set_v

Passed

N/A

0.317726s

set_x

Passed

N/A

0.271388s

vi_emacs_VE_toggle

Passed

N/A

0.293178s

xx_bogus

Passed

N/A

0.132382s

bin/sh/t_redir

32.136138s

basic_test_method_test

Passed

N/A

0.427302s

do_input_redirections

Passed

N/A

0.718206s

do_output_redirections

Passed

N/A

0.699176s

fd_redirections

Passed

N/A

1.155585s

incorrect_redirections

Passed

N/A

0.572323s

local_redirections

Passed

N/A

0.272390s

named_fd_redirections

Passed

N/A

0.370581s

redir_here_doc

Passed

N/A

0.148000s

redir_in_case

Passed

N/A

0.216680s

subshell_redirections

Passed

N/A

0.298575s

ulimit_redirection_interaction

Passed

N/A

0.298710s

validate_fn_redirects

Passed

N/A

26.931790s

bin/sh/t_redircloexec

1.181841s

compound_redir_open

Passed

N/A

0.134907s

exec_redir_closed

Passed

N/A

0.294044s

exec_redir_open

Passed

N/A

0.302383s

loop_redir_open

Passed

N/A

0.144635s

simple_redir_open

Passed

N/A

0.144272s

subshell_redir_open

Passed

N/A

0.157677s

bin/sh/t_set_e

2.565132s

all

Passed

N/A

2.564221s

bin/sh/t_shift

1.743024s

basic_shift_test

Passed

N/A

0.518258s

excessive_shift

Passed

N/A

0.418013s

function_shift

Passed

N/A

0.097245s

non_numeric_shift

Passed

N/A

0.415964s

too_many_args

Passed

N/A

0.290307s

bin/sh/t_ulimit

0.199872s

limits

Passed

N/A

0.198878s

bin/sh/t_varquote

0.410662s

all

Passed

N/A

0.116398s

default_assignment_with_arith

Passed

N/A

0.161308s

nested_quotes_multiword

Passed

N/A

0.130210s

bin/sh/t_varval

4.853472s

aaa

Passed

N/A

0.295317s

assignment

Passed

N/A

1.026655s

cmdline

Passed

N/A

1.059371s

read

Passed

N/A

1.151186s

redirect

Passed

N/A

1.217693s

bin/sh/t_wait

21.762753s

basic_wait

Passed

N/A

6.268828s

individual

Passed

N/A

3.127293s

jobs

Passed

N/A

7.179953s

kill

Passed

N/A

5.182787s

bin/sleep/t_sleep

2.147008s

fraction

Passed

N/A

0.811547s

hex

Passed

N/A

1.129440s

nonnumeric

Passed

N/A

0.203733s

bin/tar/t_tar

0.239655s

append

Passed

N/A

0.238136s

dev/cgd/t_cgd_3des

0.366931s

cgd_3des_cbc_192_encblkno1

Passed

N/A

0.289265s

cgd_3des_cbc_192_encblkno8

Passed

N/A

0.076539s

dev/cgd/t_cgd_aes

0.641062s

cgd_aes_cbc_128_encblkno1

Passed

N/A

0.076590s

cgd_aes_cbc_128_encblkno8

Passed

N/A

0.076336s

cgd_aes_cbc_192_encblkno1

Passed

N/A

0.075200s

cgd_aes_cbc_192_encblkno8

Passed

N/A

0.077159s

cgd_aes_cbc_256_encblkno1

Passed

N/A

0.076962s

cgd_aes_cbc_256_encblkno8

Passed

N/A

0.079436s

cgd_aes_xts_256

Passed

N/A

0.091255s

cgd_aes_xts_512

Passed

N/A

0.083602s

dev/cgd/t_cgd_blowfish

0.508035s

cgd_bf_cbc_128_encblkno1

Passed

N/A

0.084307s

cgd_bf_cbc_128_encblkno8

Passed

N/A

0.083073s

cgd_bf_cbc_256_encblkno1

Passed

N/A

0.084374s

cgd_bf_cbc_256_encblkno8

Passed

N/A

0.083679s

cgd_bf_cbc_448_encblkno1

Passed

N/A

0.085001s

cgd_bf_cbc_448_encblkno8

Passed

N/A

0.083924s

dev/cgd/t_cgd

2.924990s

basic

Passed

N/A

0.644704s

unaligned_write

Passed

N/A

1.634148s

wrongpass

Passed

N/A

0.642177s

dev/clock_subr/t_clock_subr

0.026951s

secs_to_ymdhms

Passed

N/A

0.012720s

ymdhms_to_secs

Passed

N/A

0.012708s

dev/fss/t_fss

0.555222s

basic

Passed

N/A

0.550835s

dev/raidframe/t_raid

19.677275s

raid1_comp0fail

Passed

N/A

3.788929s

raid1_compfail

Passed

N/A

3.788912s

raid1_normal

Passed

N/A

3.767679s

raid5_compfail

Passed

N/A

3.802462s

raid5_normal

Passed

N/A

3.784800s

smalldisk

Passed

N/A

0.425375s

dev/audio/t_pad

0.966846s

pad_output

Passed

N/A

0.965739s

dev/md/t_md

0.502802s

basic

Passed

N/A

0.501585s

dev/scsipi/t_cd

0.093281s

noisyeject

Passed

N/A

0.092439s

dev/sysmon/t_swwdog

5.499289s

disarm

Passed

N/A

2.494475s

panic

Passed

N/A

1.523670s

reboot

Passed

N/A

1.473745s

dev/sysmon/t_swsensor

121.094900s

alarm_sensor

Passed

N/A

28.312915s

entropy_interrupt_sensor

Passed

N/A

16.862033s

entropy_polled_sensor

Passed

N/A

32.122934s

limit_sensor

Passed

N/A

26.992340s

simple_sensor

Passed

N/A

16.796050s

dev/usb/t_hid

0.092144s

khid

Passed

N/A

0.045640s

khid_parse_just_pop

Passed

N/A

0.044953s

games/t_factor

0.694725s

loop1

Passed

N/A

0.214956s

loop2

Passed

N/A

0.165946s

overflow1

Passed

N/A

0.154813s

overflow2

Passed

N/A

0.155693s

include/machine/t_bswap

0.074001s

bswap16_basic

Passed

N/A

0.011773s

bswap16_unconst

Passed

N/A

0.012640s

bswap32_basic

Passed

N/A

0.011561s

bswap32_unconst

Passed

N/A

0.011464s

bswap64_basic

Passed

N/A

0.011507s

bswap64_unconst

Passed

N/A

0.011480s

include/sys/t_bitops

0.081922s

bitmap_basic

Passed

N/A

0.014393s

fast_divide32

Passed

N/A

0.012661s

ffsfls

Passed

N/A

0.012715s

ilog2_32bit

Passed

N/A

0.012467s

ilog2_64bit

Passed

N/A

0.012516s

ilog2_const

Passed

N/A

0.013095s

include/sys/t_bootblock

0.024480s

mbr_partition

Passed

N/A

0.011969s

mbr_sector

Passed

N/A

0.011193s

include/sys/t_cdefs

0.106008s

sissigned

Passed

N/A

0.011767s

stypefit

Passed

N/A

0.011549s

stypemask

Passed

N/A

0.011547s

stypeminmax

Passed

N/A

0.012383s

uissigned

Passed

N/A

0.013499s

utypefit

Passed

N/A

0.013133s

utypemask

Passed

N/A

0.013084s

utypeminmax

Passed

N/A

0.012795s

include/sys/t_pslist

0.014339s

misc

Passed

N/A

0.013412s

include/sys/t_tree

0.501419s

tree_rbstress

Passed

N/A

0.500516s

include/sys/t_types

0.042732s

types_limits

Passed

N/A

0.013712s

types_signed

Passed

N/A

0.013397s

types_unsigned

Passed

N/A

0.013064s

include/sys/t_socket

0.257794s

cmsg_sendfd

Passed

N/A

0.087445s

cmsg_sendfd_bounds

Passed

N/A

0.083121s

sock_cloexec

Passed

N/A

0.085464s

include/t_bitstring

0.273554s

bits_27

Passed

N/A

0.085271s

bits_32

Passed

N/A

0.034024s

bits_49

Passed

N/A

0.042616s

bits_64

Passed

N/A

0.036292s

bits_67

Passed

N/A

0.038125s

bits_8

Passed

N/A

0.032251s

include/t_errno

0.014494s

errno_constants

Expected failure

PR standards/44921: 2 checks failed as expected; see output for more details

0.013314s

include/t_glob

0.014437s

glob_types

Passed

N/A

0.013517s

include/t_inttypes

0.014385s

int_fmtio

Passed

N/A

0.013468s

include/t_limits

0.041072s

char

Passed

N/A

0.013242s

posix

Passed

N/A

0.012640s

short

Passed

N/A

0.012461s

include/t_netdb

0.014421s

netdb_constants

Expected failure

PR standards/44777: 2 checks failed as expected; see output for more details

0.013839s

include/t_paths

0.013928s

paths

Skipped

PR port-sparc/45580

0.013169s

include/t_stdint

0.024478s

int16

Passed

N/A

0.011681s

int8

Passed

N/A

0.011246s

kernel/kqueue/read/t_fifo

0.015862s

fifo

Passed

N/A

0.014452s

kernel/kqueue/read/t_file

6.066727s

file

Passed

N/A

6.065940s

kernel/kqueue/read/t_file2

0.012517s

file2

Passed

N/A

0.011599s

kernel/kqueue/read/t_pipe

0.012249s

pipe

Passed

N/A

0.011660s

kernel/kqueue/read/t_ttypty

2.040337s

master

Passed

N/A

1.019747s

slave

Passed

N/A

1.019452s

kernel/kqueue/write/t_fifo

0.015214s

fifo

Passed

N/A

0.014478s

kernel/kqueue/write/t_pipe

0.098777s

pipe1

Passed

N/A

0.068722s

pipe2

Passed

N/A

0.015091s

pipe3

Passed

N/A

0.012745s

kernel/kqueue/write/t_ttypty

2.040230s

master

Passed

N/A

1.019002s

slave

Passed

N/A

1.019863s

kernel/kqueue/t_ioctl

0.027590s

kfilter_byfilter

Passed

N/A

0.013285s

kfilter_byname

Passed

N/A

0.013221s

kernel/kqueue/t_proc1

2.031804s

proc1

Passed

N/A

2.031219s

kernel/kqueue/t_proc2

2.023071s

proc2

Passed

N/A

2.022491s

kernel/kqueue/t_proc3

0.014386s

proc3

Passed

N/A

0.013806s

kernel/kqueue/t_sig

12.069252s

sig

Passed

N/A

12.068719s

kernel/kqueue/t_vnode

0.453370s

dir_no_note_link_create_file_in

Passed

N/A

0.027101s

dir_no_note_link_delete_file_in

Passed

N/A

0.025784s

dir_no_note_link_mv_dir_within

Passed

N/A

0.024284s

dir_no_note_link_mv_file_within

Passed

N/A

0.024290s

dir_note_link_create_dir_in

Passed

N/A

0.024241s

dir_note_link_delete_dir_in

Passed

N/A

0.024426s

dir_note_link_mv_dir_in

Passed

N/A

0.024442s

dir_note_link_mv_dir_out

Passed

N/A

0.024450s

dir_note_write_create_dir_in

Passed

N/A

0.024610s

dir_note_write_create_file_in

Passed

N/A

0.024339s

dir_note_write_delete_dir_in

Passed

N/A

0.024450s

dir_note_write_delete_file_in

Passed

N/A

0.024518s

dir_note_write_mv_dir_in

Passed

N/A

0.024578s

dir_note_write_mv_dir_out

Passed

N/A

0.024443s

dir_note_write_mv_dir_within

Passed

N/A

0.024420s

dir_note_write_mv_file_in

Passed

N/A

0.024661s

dir_note_write_mv_file_out

Passed

N/A

0.024625s

dir_note_write_mv_file_within

Passed

N/A

0.024572s

kernel/tty/t_pr

0.192146s

client_first

Passed

N/A

0.061865s

master_first

Passed

N/A

0.062162s

ptyioctl

Passed

N/A

0.065784s

kernel/t_lock

1.005546s

lock

Passed

N/A

1.004720s

kernel/t_lockf

61.061050s

deadlock

Passed

N/A

1.017368s

randlock

Passed

N/A

60.041972s

kernel/t_ptrace

0.074767s

attach_chroot

Passed

N/A

0.014991s

attach_pid0

Passed

N/A

0.013469s

attach_pid1

Passed

N/A

0.015856s

attach_pid1_securelevel

Skipped

Test must be run with securelevel >= 1

0.013412s

attach_self

Passed

N/A

0.013165s

kernel/t_ptrace_wait

1.015679s

attach3

Passed

N/A

0.018754s

attach4

Passed

N/A

0.017620s

eventmask1

Passed

N/A

0.017875s

eventmask2

Passed

N/A

0.018431s

fork2

Passed

N/A

0.020986s

fpregs1

Passed

N/A

0.020670s

fpregs2

Failed

/usr/src/tests/kernel/t_ptrace_wait.c:3894: ptrace(PT_SETFPREGS, child, &r, 0) != -1 not met

0.019818s

io_read_d1

Passed

N/A

0.019678s

io_read_d2

Passed

N/A

0.021010s

io_read_d3

Passed

N/A

0.019175s

io_read_d4

Passed

N/A

0.019766s

io_read_d_write_d_handshake1

Passed

N/A

0.021174s

io_read_d_write_d_handshake2

Passed

N/A

0.020501s

io_read_i1

Passed

N/A

0.019611s

io_read_i2

Passed

N/A

0.017834s

io_read_i3

Passed

N/A

0.020046s

io_read_i4

Passed

N/A

0.020386s

io_write_d1

Passed

N/A

0.018982s

io_write_d2

Passed

N/A

0.020744s

io_write_d3

Passed

N/A

0.018734s

io_write_d4

Passed

N/A

0.020901s

kill1

Passed

N/A

0.019136s

kill2

Passed

N/A

0.021030s

lwpinfo1

Passed

N/A

0.020812s

read_d1

Passed

N/A

0.020944s

read_d2

Passed

N/A

0.020793s

read_d3

Passed

N/A

0.021777s

read_d4

Passed

N/A

0.020119s

read_d_write_d_handshake1

Passed

N/A

0.021497s

read_d_write_d_handshake2

Passed

N/A

0.020363s

read_i1

Passed

N/A

0.020712s

read_i2

Passed

N/A

0.020955s

read_i3

Passed

N/A

0.019472s

read_i4

Passed

N/A

0.021541s

regs1

Passed

N/A

0.020340s

regs2

Passed

N/A

0.020387s

regs3

Passed

N/A

0.021828s

regs4

Passed

N/A

0.021388s

regs5

Passed

N/A

0.021342s

traceme1

Passed

N/A

0.021633s

traceme2

Passed

N/A

0.022871s

traceme3

Passed

N/A

0.021656s

traceme4

Passed

N/A

0.020458s

vfork2

Passed

N/A

0.020240s

write_d1

Passed

N/A

0.020838s

write_d2

Passed

N/A

0.022112s

write_d3

Passed

N/A

0.020961s

write_d4

Passed

N/A

0.021334s

kernel/t_ptrace_wait3

0.982063s

attach3

Passed

N/A

0.020811s

attach4

Passed

N/A

0.019989s

eventmask1

Passed

N/A

0.021317s

eventmask2

Passed

N/A

0.021312s

fork2

Passed

N/A

0.023034s

fpregs1

Passed

N/A

0.021604s

fpregs2

Failed

/usr/src/tests/kernel/t_ptrace_wait.c:3894: ptrace(PT_SETFPREGS, child, &r, 0) != -1 not met

0.021412s

io_read_d1

Passed

N/A

0.020968s

io_read_d2

Passed

N/A

0.018863s

io_read_d3

Passed

N/A

0.019493s

io_read_d4

Passed

N/A

0.019457s

io_read_d_write_d_handshake1

Passed

N/A

0.019166s

io_read_d_write_d_handshake2

Passed

N/A

0.019361s

io_read_i1

Passed

N/A

0.019724s

io_read_i2

Passed

N/A

0.018383s

io_read_i3

Passed

N/A

0.018986s

io_read_i4

Passed

N/A

0.019202s

io_write_d1

Passed

N/A

0.019121s

io_write_d2

Passed

N/A

0.019185s

io_write_d3

Passed

N/A

0.019381s

io_write_d4

Passed

N/A

0.019417s

kill1

Passed

N/A

0.019341s

kill2

Passed

N/A

0.019383s

lwpinfo1

Passed

N/A

0.019345s

read_d1

Passed

N/A

0.019265s

read_d2

Passed

N/A

0.019187s

read_d3

Passed

N/A

0.019159s

read_d4

Passed

N/A

0.019927s

read_d_write_d_handshake1

Passed

N/A

0.018610s

read_d_write_d_handshake2

Passed

N/A

0.019750s

read_i1

Passed

N/A

0.021453s

read_i2

Passed

N/A

0.019052s

read_i3

Passed

N/A

0.020279s

read_i4

Passed

N/A

0.018950s

regs1

Passed

N/A

0.020001s

regs2

Passed

N/A

0.018114s

regs3

Passed

N/A

0.020128s

regs4

Passed

N/A

0.018042s

regs5

Passed

N/A

0.018680s

traceme1

Passed

N/A

0.019093s

traceme2

Passed

N/A

0.019450s

traceme3

Passed

N/A

0.019389s

traceme4

Passed

N/A

0.020570s

vfork2

Passed

N/A

0.020250s

write_d1

Passed

N/A

0.018810s

write_d2

Passed

N/A

0.020042s

write_d3

Passed

N/A

0.021750s

write_d4

Passed

N/A

0.020561s

kernel/t_ptrace_wait4

1.257693s

attach1

Passed

N/A

0.037646s

attach2

Passed

N/A

0.038982s

attach3

Passed

N/A

0.019547s

attach4

Passed

N/A

0.017586s

attach5

Passed

N/A

0.022651s

attach6

Passed

N/A

0.034594s

attach7

Passed

N/A

0.024431s

eventmask1

Passed

N/A

0.021394s

eventmask2

Passed

N/A

0.018890s

fork1

Failed

/usr/src/tests/kernel/t_ptrace_wait.h:295: Reported exited process

0.022996s

fork2

Passed

N/A

0.021940s

fpregs1

Passed

N/A

0.020078s

fpregs2

Failed

/usr/src/tests/kernel/t_ptrace_wait.c:3894: ptrace(PT_SETFPREGS, child, &r, 0) != -1 not met

0.020146s

io_read_d1

Passed

N/A

0.019340s

io_read_d2

Passed

N/A

0.021381s

io_read_d3

Passed

N/A

0.019368s

io_read_d4

Passed

N/A

0.020533s

io_read_d_write_d_handshake1

Passed

N/A

0.019300s

io_read_d_write_d_handshake2

Passed

N/A

0.020117s

io_read_i1

Passed

N/A

0.019290s

io_read_i2

Passed

N/A

0.019501s

io_read_i3

Passed

N/A

0.020079s

io_read_i4

Passed

N/A

0.020166s

io_write_d1

Passed

N/A

0.019860s

io_write_d2

Passed

N/A

0.020685s

io_write_d3

Passed

N/A

0.021507s

io_write_d4

Passed

N/A

0.019140s

kill1

Passed

N/A

0.022059s

kill2

Passed

N/A

0.020762s

lwpinfo1

Passed

N/A

0.021501s

lwpinfo2

Passed

N/A

0.023516s

read_d1

Passed

N/A

0.019949s

read_d2

Passed

N/A

0.022942s

read_d3

Passed

N/A

0.021384s

read_d4

Passed

N/A

0.021725s

read_d_write_d_handshake1

Passed

N/A

0.021040s

read_d_write_d_handshake2

Passed

N/A

0.022046s

read_i1

Passed

N/A

0.021441s

read_i2

Passed

N/A

0.021312s

read_i3

Passed

N/A

0.021143s

read_i4

Passed

N/A

0.019480s

regs1

Passed

N/A

0.021182s

regs2

Passed

N/A

0.019333s

regs3

Passed

N/A

0.020905s

regs4

Passed

N/A

0.019385s

regs5

Passed

N/A

0.020195s

traceme1

Passed

N/A

0.020635s

traceme2

Passed

N/A

0.021271s

traceme3

Passed

N/A

0.019934s

traceme4

Passed

N/A

0.021289s

vfork1

Expected failure

PR kern/51630: /usr/src/tests/kernel/t_ptrace_wait.h:305: WSTOPSIG(status) != expected: Unexpected stop signal received [Child exited] != [Trace/BPT trap]

0.020750s

vfork2

Passed

N/A

0.022556s

write_d1

Passed

N/A

0.021453s

write_d2

Passed

N/A

0.022054s

write_d3

Passed

N/A

0.019467s

write_d4

Passed

N/A

0.021285s

kernel/t_ptrace_wait6

1.251809s

attach1

Passed

N/A

0.037342s

attach2

Passed

N/A

0.037294s

attach3

Passed

N/A

0.020034s

attach4

Passed

N/A

0.019020s

attach5

Passed

N/A

0.020526s

attach6

Passed

N/A

0.021662s

attach7

Passed

N/A

0.022225s

eventmask1

Passed

N/A

0.019179s

eventmask2

Passed

N/A

0.019519s

fork1

Failed

/usr/src/tests/kernel/t_ptrace_wait.h:295: Reported exited process

0.022620s

fork2

Passed

N/A

0.021402s

fpregs1

Passed

N/A

0.019684s

fpregs2

Failed

/usr/src/tests/kernel/t_ptrace_wait.c:3894: ptrace(PT_SETFPREGS, child, &r, 0) != -1 not met

0.021025s

io_read_d1

Passed

N/A

0.018963s

io_read_d2

Passed

N/A

0.020019s

io_read_d3

Passed

N/A

0.019107s

io_read_d4

Passed

N/A

0.019731s

io_read_d_write_d_handshake1

Passed

N/A

0.021376s

io_read_d_write_d_handshake2

Passed

N/A

0.020816s

io_read_i1

Passed

N/A

0.020619s

io_read_i2

Passed

N/A

0.021107s

io_read_i3

Passed

N/A

0.020474s

io_read_i4

Passed

N/A

0.022812s

io_write_d1

Passed

N/A

0.021093s

io_write_d2

Passed

N/A

0.022004s

io_write_d3

Passed

N/A

0.021868s

io_write_d4

Passed

N/A

0.023168s

kill1

Passed

N/A

0.020921s

kill2

Passed

N/A

0.020902s

lwpinfo1

Passed

N/A

0.020988s

lwpinfo2

Passed

N/A

0.023086s

read_d1

Passed

N/A

0.022159s

read_d2

Passed

N/A

0.021464s

read_d3

Passed

N/A

0.019740s

read_d4

Passed

N/A

0.022345s

read_d_write_d_handshake1

Passed

N/A

0.021376s

read_d_write_d_handshake2

Passed

N/A

0.021425s

read_i1

Passed

N/A

0.021084s

read_i2

Passed

N/A

0.019382s

read_i3

Passed

N/A

0.021465s

read_i4

Passed

N/A

0.021055s

regs1

Passed

N/A

0.021265s

regs2

Passed

N/A

0.021192s

regs3

Passed

N/A

0.020874s

regs4

Passed

N/A

0.019584s

regs5

Passed

N/A

0.020591s

traceme1

Passed

N/A

0.022229s

traceme2

Passed

N/A

0.022883s

traceme3

Passed

N/A

0.020219s

traceme4

Passed

N/A

0.019629s

vfork1

Expected failure

PR kern/51630: /usr/src/tests/kernel/t_ptrace_wait.h:305: WSTOPSIG(status) != expected: Unexpected stop signal received [Child exited] != [Trace/BPT trap]

0.022653s

vfork2

Passed

N/A

0.020309s

write_d1

Passed

N/A

0.019741s

write_d2

Passed

N/A

0.020404s

write_d3

Passed

N/A

0.020291s

write_d4

Passed

N/A

0.020270s

kernel/t_ptrace_waitid

302.271006s

attach1

Passed

N/A

0.034933s

attach2

Passed

N/A

0.038968s

attach3

Passed

N/A

0.018438s

attach4

Passed

N/A

0.018037s

attach5

Passed

N/A

0.039524s

attach6

Passed

N/A

0.039463s

attach7

Passed

N/A

0.039001s

eventmask1

Passed

N/A

0.019354s

eventmask2

Passed

N/A

0.019317s

fork1

Failed

/usr/src/tests/kernel/t_ptrace_wait.c:1152: ptrace(PT_GET_PROCESS_STATE, child2, &state, slen) != -1 not met

0.022550s

fork2

Passed

N/A

0.022581s

fpregs1

Passed

N/A

0.019174s

fpregs2

Failed

/usr/src/tests/kernel/t_ptrace_wait.c:3894: ptrace(PT_SETFPREGS, child, &r, 0) != -1 not met

0.021755s

io_read_d1

Passed

N/A

0.019763s

io_read_d2

Passed

N/A

0.020413s

io_read_d3

Passed

N/A

0.020464s

io_read_d4

Passed

N/A

0.019443s

io_read_d_write_d_handshake1

Passed

N/A

0.020467s

io_read_d_write_d_handshake2

Passed

N/A

0.021453s

io_read_i1

Passed

N/A

0.020101s

io_read_i2

Passed

N/A

0.019898s

io_read_i3

Passed

N/A

0.020574s

io_read_i4

Passed

N/A

0.019825s

io_write_d1

Passed

N/A

0.019778s

io_write_d2

Passed

N/A

0.020993s

io_write_d3

Passed

N/A

0.021052s

io_write_d4

Passed

N/A

0.019908s

kill1

Passed

N/A

0.020017s

kill2

Passed

N/A

0.021065s

lwpinfo1

Passed

N/A

0.019028s

lwpinfo2

Passed

N/A

0.021683s

read_d1

Passed

N/A

0.019696s

read_d2

Passed

N/A

0.021380s

read_d3

Passed

N/A

0.020809s

read_d4

Passed

N/A

0.020301s

read_d_write_d_handshake1

Passed

N/A

0.020887s

read_d_write_d_handshake2

Passed

N/A

0.020745s

read_i1

Passed

N/A

0.020238s

read_i2

Passed

N/A

0.020961s

read_i3

Passed

N/A

0.020372s

read_i4

Passed

N/A

0.021195s

regs1

Passed

N/A

0.021282s

regs2

Passed

N/A

0.020735s

regs3

Passed

N/A

0.019403s

regs4

Passed

N/A

0.020623s

regs5

Passed

N/A

0.019055s

traceme1

Passed

N/A

0.020497s

traceme2

Passed

N/A

0.019157s

traceme3

Passed

N/A

0.020777s

traceme4

Passed

N/A

0.020514s

vfork1

Failed

Test case timed out after 300 seconds

301.018034s

vfork2

Passed

N/A

0.020264s

write_d1

Passed

N/A

0.019712s

write_d2

Passed

N/A

0.023080s

write_d3

Passed

N/A

0.019898s

write_d4

Passed

N/A

0.018709s

kernel/t_ptrace_waitpid

1.256345s

attach1

Passed

N/A

0.038137s

attach2

Passed

N/A

0.023265s

attach3

Passed

N/A

0.020213s

attach4

Passed

N/A

0.021030s

attach5

Passed

N/A

0.021186s

attach6

Passed

N/A

0.023212s

attach7

Passed

N/A

0.022323s

eventmask1

Passed

N/A

0.022174s

eventmask2

Passed

N/A

0.021011s

fork1

Failed

/usr/src/tests/kernel/t_ptrace_wait.h:295: Reported exited process

0.024593s

fork2

Passed

N/A

0.025701s

fpregs1

Passed

N/A

0.021470s

fpregs2

Failed

/usr/src/tests/kernel/t_ptrace_wait.c:3894: ptrace(PT_SETFPREGS, child, &r, 0) != -1 not met

0.021287s

io_read_d1

Passed

N/A

0.020932s

io_read_d2

Passed

N/A

0.021010s

io_read_d3

Passed

N/A

0.021713s

io_read_d4

Passed

N/A

0.021900s

io_read_d_write_d_handshake1

Passed

N/A

0.019618s

io_read_d_write_d_handshake2

Passed

N/A

0.020432s

io_read_i1

Passed

N/A

0.019064s

io_read_i2

Passed

N/A

0.020370s

io_read_i3

Passed

N/A

0.019675s

io_read_i4

Passed

N/A

0.021210s

io_write_d1

Passed

N/A

0.019908s

io_write_d2

Passed

N/A

0.020284s

io_write_d3

Passed

N/A

0.020503s

io_write_d4

Passed

N/A

0.020954s

kill1

Passed

N/A

0.020221s

kill2

Passed

N/A

0.020000s

lwpinfo1

Passed

N/A

0.020180s

lwpinfo2

Passed

N/A

0.032760s

read_d1

Passed

N/A

0.020785s

read_d2

Passed

N/A

0.020195s

read_d3

Passed

N/A

0.021783s

read_d4

Passed

N/A

0.020939s

read_d_write_d_handshake1

Passed

N/A

0.021504s

read_d_write_d_handshake2

Passed

N/A

0.021714s

read_i1

Passed

N/A

0.022442s

read_i2

Passed

N/A

0.021999s

read_i3

Passed

N/A

0.020778s

read_i4

Passed

N/A

0.021583s

regs1

Passed

N/A

0.018476s

regs2

Passed

N/A

0.020214s

regs3

Passed

N/A

0.018667s

regs4

Passed

N/A

0.021706s

regs5

Passed

N/A

0.021822s

traceme1

Passed

N/A

0.020440s

traceme2

Passed

N/A

0.020299s

traceme3

Passed

N/A

0.021030s

traceme4

Passed

N/A

0.023368s

vfork1

Expected failure

PR kern/51630: /usr/src/tests/kernel/t_ptrace_wait.h:305: WSTOPSIG(status) != expected: Unexpected stop signal received [Child exited] != [Trace/BPT trap]

0.021445s

vfork2

Passed

N/A

0.022248s

write_d1

Passed

N/A

0.020865s

write_d2

Passed

N/A

0.021582s

write_d3

Passed

N/A

0.021150s

write_d4

Passed

N/A

0.020769s

kernel/t_pty

6.071424s

pty_no_queue

Passed

N/A

3.030645s

pty_queue

Passed

N/A

3.039188s

kernel/t_mqueue

0.014312s

mqueue

Passed

N/A

0.013120s

kernel/t_sysv

1.101621s

msg

Passed

N/A

0.028341s

sem

Passed

N/A

1.043636s

shm

Passed

N/A

0.027367s

kernel/t_subr_prf

0.048376s

snprintf_count

Passed

N/A

0.011632s

snprintf_count_overflow

Passed

N/A

0.011384s

snprintf_print

Passed

N/A

0.011324s

snprintf_print_overflow

Passed

N/A

0.011950s

kernel/t_kauth_pr_47598

0.399165s

kauth_curtain

Passed

N/A

0.398657s

kernel/t_sysctl

0.016178s

bufsize

Passed

N/A

0.015614s

kernel/t_extattrctl

0.057821s

extattrctl_namei

Passed

N/A

0.057236s

kernel/t_filedesc

11.391900s

getfilerace

Passed

N/A

11.391295s

kernel/t_rnd

0.190647s

RNDADDDATA

Passed

N/A

0.063166s

RNDADDDATA2

Passed

N/A

0.062508s

read_random

Passed

N/A

0.063252s

kernel/t_extent

0.139222s

bound1

Passed

N/A

0.012390s

bound2

Passed

N/A

0.012120s

bound3

Passed

N/A

0.012315s

bound4

Passed

N/A

0.012021s

bound5

Passed

N/A

0.012135s

coalesce

Passed

N/A

0.011885s

free

Passed

N/A

0.012093s

subregion1

Passed

N/A

0.011865s

subregion2

Passed

N/A

0.011849s

subregion3

Passed

N/A

0.011936s

subregion4

Passed

N/A

0.012809s

kernel/t_umount

0.837920s

umount

Passed

N/A

0.832727s

kernel/t_umountstress

2.850253s

fileop

Passed

N/A

0.958726s

mountlist

Passed

N/A

1.881546s

kernel/t_ps_strings

0.890830s

update

Passed

N/A

0.759279s

validate

Passed

N/A

0.130213s

lib/csu/t_crt0

0.589440s

initfini1

Passed

N/A

0.140468s

initfini2

Passed

N/A

0.147053s

initfini3

Passed

N/A

0.142771s

initfini4

Passed

N/A

0.155375s

lib/libbluetooth/t_bluetooth

0.026229s

check_bt_aton

Passed

N/A

0.012646s

check_bt_ntoa

Passed

N/A

0.012072s

lib/libbluetooth/t_sdp_data

0.037754s

check_sdp_data_size

Passed

N/A

0.023996s

check_sdp_data_type

Passed

N/A

0.012215s

lib/libbluetooth/t_sdp_get

0.134398s

check_sdp_get_alt

Passed

N/A

0.012629s

check_sdp_get_attr

Passed

N/A

0.012352s

check_sdp_get_bool

Passed

N/A

0.012285s

check_sdp_get_data

Passed

N/A

0.013299s

check_sdp_get_int

Passed

N/A

0.012245s

check_sdp_get_seq

Passed

N/A

0.012306s

check_sdp_get_str

Passed

N/A

0.013307s

check_sdp_get_uint

Passed

N/A

0.012487s

check_sdp_get_url

Passed

N/A

0.012399s

check_sdp_get_uuid

Passed

N/A

0.013402s

lib/libbluetooth/t_sdp_match

0.013311s

check_sdp_match_uuid16

Passed

N/A

0.012496s

lib/libbluetooth/t_sdp_put

0.309336s

check_sdp_put_alt

Passed

N/A

0.013283s

check_sdp_put_attr

Passed

N/A

0.012851s

check_sdp_put_bool

Passed

N/A

0.012691s

check_sdp_put_data

Passed

N/A

0.013901s

check_sdp_put_int

Passed

N/A

0.012757s

check_sdp_put_int16

Passed

N/A

0.012705s

check_sdp_put_int32

Passed

N/A

0.014023s

check_sdp_put_int64

Passed

N/A

0.013236s

check_sdp_put_int8

Passed

N/A

0.015944s

check_sdp_put_seq

Passed

N/A

0.014439s

check_sdp_put_str

Passed

N/A

0.014781s

check_sdp_put_uint

Passed

N/A

0.014378s

check_sdp_put_uint16

Passed

N/A

0.014687s

check_sdp_put_uint32

Passed

N/A

0.014778s

check_sdp_put_uint64

Passed

N/A

0.014064s

check_sdp_put_uint8

Passed

N/A

0.014170s

check_sdp_put_url

Passed

N/A

0.014053s

check_sdp_put_uuid

Passed

N/A

0.014130s

check_sdp_put_uuid128

Passed

N/A

0.014025s

check_sdp_put_uuid16

Passed

N/A

0.013972s

check_sdp_put_uuid32

Passed

N/A

0.014489s

lib/libbluetooth/t_sdp_set

0.069204s

check_sdp_set_alt

Passed

N/A

0.013505s

check_sdp_set_bool

Passed

N/A

0.012433s

check_sdp_set_int

Passed

N/A

0.012471s

check_sdp_set_seq

Passed

N/A

0.014301s

check_sdp_set_uint

Passed

N/A

0.012919s

lib/libc/c063/t_faccessat

0.099587s

faccessat_fd

Passed

N/A

0.013305s

faccessat_fdcwd

Passed

N/A

0.013107s

faccessat_fdcwderr

Passed

N/A

0.013286s

faccessat_fderr1

Passed

N/A

0.013017s

faccessat_fderr2

Passed

N/A

0.013131s

faccessat_fderr3

Passed

N/A

0.013255s

faccessat_fdlink

Passed

N/A

0.012599s

lib/libc/c063/t_fchmodat

0.101976s

fchmodat_fd

Passed

N/A

0.013552s

fchmodat_fdcwd

Passed

N/A

0.013149s

fchmodat_fdcwderr

Passed

N/A

0.013113s

fchmodat_fderr1

Passed

N/A

0.013526s

fchmodat_fderr2

Passed

N/A

0.013436s

fchmodat_fderr3

Passed

N/A

0.013093s

fchmodat_fdlink

Passed

N/A

0.013897s

lib/libc/c063/t_fchownat

0.103160s

fchownat_fd

Passed

N/A

0.014082s

fchownat_fdcwd

Passed

N/A

0.013328s

fchownat_fdcwderr

Passed

N/A

0.013319s

fchownat_fderr1

Passed

N/A

0.013259s

fchownat_fderr2

Passed

N/A

0.013389s

fchownat_fderr3

Passed

N/A

0.013212s

fchownat_fdlink

Passed

N/A

0.013239s

lib/libc/c063/t_fexecve

0.018653s

fexecve

Expected failure

fexecve not implemented: /usr/src/tests/lib/libc/c063/t_fexecve.c:85: access("test", F_OK) == 0 not met

0.018121s

lib/libc/c063/t_fstatat

0.090471s

fstatat_fd

Passed

N/A

0.012065s

fstatat_fdcwd

Passed

N/A

0.011828s

fstatat_fdcwderr

Passed

N/A

0.012689s

fstatat_fderr1

Passed

N/A

0.011711s

fstatat_fderr2

Passed

N/A

0.011705s

fstatat_fderr3

Passed

N/A

0.011705s

fstatat_fdlink

Passed

N/A

0.011784s

lib/libc/c063/t_linkat

0.081581s

linkat_fd

Passed

N/A

0.011955s

linkat_fdcwd

Passed

N/A

0.012784s

linkat_fdcwderr

Passed

N/A

0.011692s

linkat_fderr

Passed

N/A

0.011833s

linkat_fdlink1

Passed

N/A

0.012600s

linkat_fdlink2

Passed

N/A

0.012188s

lib/libc/c063/t_mkdirat

0.051439s

mkdirat_fd

Passed

N/A

0.011816s

mkdirat_fdcwd

Passed

N/A

0.011596s

mkdirat_fdcwderr

Passed

N/A

0.012424s

mkdirat_fderr

Passed

N/A

0.011561s

lib/libc/c063/t_mkfifoat

0.050543s

mkfifoat_fd

Passed

N/A

0.011527s

mkfifoat_fdcwd

Passed

N/A

0.012180s

mkfifoat_fdcwderr

Passed

N/A

0.011599s

mkfifoat_fderr

Passed

N/A

0.011537s

lib/libc/c063/t_mknodat

0.050818s

mknodat_fd

Passed

N/A

0.012261s

mknodat_fdcwd

Passed

N/A

0.011664s

mknodat_fdcwderr

Passed

N/A

0.011617s

mknodat_fderr

Passed

N/A

0.011591s

lib/libc/c063/t_o_search

0.042476s

o_search_notdir

Passed

N/A

0.011773s

o_search_perm1

Passed

N/A

0.013131s

o_search_perm2

Passed

N/A

0.013891s

lib/libc/c063/t_openat

0.078339s

openat_fd

Passed

N/A

0.011993s

openat_fdcwd

Passed

N/A

0.011737s

openat_fdcwderr

Passed

N/A

0.012544s

openat_fderr1

Passed

N/A

0.011863s

openat_fderr2

Passed

N/A

0.011857s

openat_fderr3

Passed

N/A

0.012240s

lib/libc/c063/t_readlinkat

0.064537s

readlinkat_fd

Passed

N/A

0.012552s

readlinkat_fdcwd

Passed

N/A

0.011775s

readlinkat_fdcwderr

Passed

N/A

0.011616s

readlinkat_fderr1

Passed

N/A

0.011592s

readlinkat_fderr2

Passed

N/A

0.011679s

lib/libc/c063/t_renameat

0.052638s

renameat_fd

Passed

N/A

0.012033s

renameat_fdcwd

Passed

N/A

0.011816s

renameat_fdcwderr

Passed

N/A

0.011695s

renameat_fderr

Passed

N/A

0.011614s

lib/libc/c063/t_symlinkat

0.053354s

symlinkat_fd

Passed

N/A

0.011895s

symlinkat_fdcwd

Passed

N/A

0.011620s

symlinkat_fdcwderr

Passed

N/A

0.012785s

symlinkat_fderr

Passed

N/A

0.011536s

lib/libc/c063/t_unlinkat

0.089377s

unlinkat_dir

Passed

N/A

0.011873s

unlinkat_fd

Passed

N/A

0.011824s

unlinkat_fdcwd

Passed

N/A

0.012734s

unlinkat_fdcwderr

Passed

N/A

0.011701s

unlinkat_fderr1

Passed

N/A

0.011741s

unlinkat_fderr2

Passed

N/A

0.011734s

unlinkat_fderr3

Passed

N/A

0.011827s

lib/libc/c063/t_utimensat

0.088851s

utimensat_fd

Passed

N/A

0.011514s

utimensat_fdcwd

Passed

N/A

0.012309s

utimensat_fdcwderr

Passed

N/A

0.011566s

utimensat_fderr1

Passed

N/A

0.011637s

utimensat_fderr2

Passed

N/A

0.011611s

utimensat_fderr3

Passed

N/A

0.011620s

utimensat_fdlink

Passed

N/A

0.011688s

lib/libc/db/t_db_hash_seq

0.057032s

test_hash_del_all

Passed

N/A

0.014374s

test_hash_del_alt

Passed

N/A

0.013475s

test_hash_del_every_7

Passed

N/A

0.013892s

test_hash_del_none

Passed

N/A

0.013258s

lib/libc/db/t_db

338.714632s

alternate_recno

Passed

N/A

0.254045s

big_btree

Passed

N/A

0.931217s

big_hash

Passed

N/A

0.393227s

big_recno

Passed

N/A

0.845267s

bsize_ffactor

Passed

N/A

38.422083s

bsize_torture

Passed

N/A

258.185001s

btree_byteswap_unaligned_access_bksd

Passed

N/A

0.213818s

btree_byteswap_unaligned_access_skbd

Passed

N/A

0.208726s

btree_known_byte_order

Passed

N/A

0.300433s

btree_recursive_traversal

Passed

N/A

2.615398s

btree_tricky_page_split

Passed

N/A

0.445785s

btree_weird_page_split

Passed

N/A

28.906368s

byte_orders_btree

Passed

N/A

0.324305s

byte_orders_hash

Passed

N/A

0.318186s

cursor_flags_btree

Passed

N/A

0.277565s

cursor_flags_recno

Passed

N/A

0.275231s

delete_btree

Passed

N/A

0.239863s

delete_recno

Passed

N/A

0.233851s

duplicate_btree

Passed

N/A

0.219185s

four_char_hash

Passed

N/A

0.152225s

medium_btree

Passed

N/A

0.186304s

medium_hash

Passed

N/A

0.185851s

medium_recno

Passed

N/A

0.178652s

random_recno

Passed

N/A

0.300957s

repeated_btree

Passed

N/A

0.239726s

repeated_hash

Passed

N/A

0.247928s

reverse_order_recno

Passed

N/A

0.212400s

reverse_recno

Passed

N/A

0.259045s

small_btree

Passed

N/A

0.195363s

small_hash

Passed

N/A

0.182354s

small_page_btree

Passed

N/A

2.507574s

small_recno

Passed

N/A

0.176520s

lib/libc/gen/exect/t_exect

0.013924s

t_exect_null

Skipped

exect(3) misdesigned and hangs - PR port-amd64/51700

0.013048s

lib/libc/gen/execve/t_execve

0.014062s

t_execve_null

Passed

N/A

0.013196s

lib/libc/gen/posix_spawn/t_spawn

0.106330s

t_spawn_child

Passed

N/A

0.029411s

t_spawn_ls

Passed

N/A

0.012897s

t_spawn_missing

Passed

N/A

0.013468s

t_spawn_nonexec

Passed

N/A

0.016693s

t_spawn_zero

Passed

N/A

0.016228s

t_spawnp_ls

Passed

N/A

0.013187s

lib/libc/gen/posix_spawn/t_fileactions

0.119958s

t_spawn_empty_fileactions

Passed

N/A

0.018703s

t_spawn_fileactions

Passed

N/A

0.019709s

t_spawn_open_nonexistent

Passed

N/A

0.012335s

t_spawn_open_nonexistent_diag

Passed

N/A

0.014198s

t_spawn_openmode

Passed

N/A

0.030377s

t_spawn_reopen

Passed

N/A

0.019210s

lib/libc/gen/posix_spawn/t_spawnattr

0.024264s

t_spawnattr

Passed

N/A

0.023432s

lib/libc/gen/t_alarm

1.053674s

alarm_basic

Passed

N/A

1.023377s

alarm_fork

Passed

N/A

0.014918s

alarm_previous

Passed

N/A

0.012981s

lib/libc/gen/t_assert

0.037741s

assert_false

Passed

N/A

0.015079s

assert_true

Passed

N/A

0.019992s

lib/libc/gen/t_basedirname

0.025390s

basename_posix

Passed

N/A

0.012106s

dirname_posix

Passed

N/A

0.011632s

lib/libc/gen/t_closefrom

0.077259s

closefrom_basic

Passed

N/A

0.022899s

closefrom_buffer

Passed

N/A

0.022502s

closefrom_err

Passed

N/A

0.013767s

closefrom_one

Passed

N/A

0.014899s

lib/libc/gen/t_cpuset

0.037777s

cpuset_err

Passed

N/A

0.012139s

cpuset_set

Passed

N/A

0.011532s

cpuset_size

Passed

N/A

0.011630s

lib/libc/gen/t_dir

0.049342s

seekdir_basic

Passed

N/A

0.013739s

telldir_leak

Passed

N/A

0.033453s

lib/libc/gen/t_floatunditf

0.013954s

floatunditf

Passed

N/A

0.013067s

lib/libc/gen/t_fmtcheck

0.013601s

fmtcheck_basic

Passed

N/A

0.012802s

lib/libc/gen/t_fnmatch

0.094878s

fnmatch_backslashes

Passed

N/A

0.013387s

fnmatch_casefold

Passed

N/A

0.012982s

fnmatch_initialbracket

Passed

N/A

0.012912s

fnmatch_leadingdir

Passed

N/A

0.012868s

fnmatch_noescape

Passed

N/A

0.012622s

fnmatch_pathname

Passed

N/A

0.012144s

fnmatch_period

Passed

N/A

0.013227s

lib/libc/gen/t_fpclassify

0.029676s

fpclassify_double

Passed

N/A

0.014876s

fpclassify_float

Passed

N/A

0.013202s

lib/libc/gen/t_fpsetmask

0.095230s

fpsetmask_basic

Passed

N/A

0.012085s

fpsetmask_masked_double

Passed

N/A

0.013495s

fpsetmask_masked_float

Passed

N/A

0.012991s

fpsetmask_masked_long_double

Passed

N/A

0.013160s

fpsetmask_unmasked_double

Passed

N/A

0.013169s

fpsetmask_unmasked_float

Passed

N/A

0.013037s

fpsetmask_unmasked_long_double

Passed

N/A

0.012235s

lib/libc/gen/t_fpsetround

0.014173s

fpsetround_basic

Passed

N/A

0.013387s

lib/libc/gen/t_ftok

0.039853s

ftok_err

Passed

N/A

0.013348s

ftok_link

Passed

N/A

0.024849s

lib/libc/gen/t_getcwd

1.976931s

getcwd_err

Passed

N/A

0.013186s

getcwd_fts

Passed

N/A

1.962061s

lib/libc/gen/t_getgrent

0.146553s

getgrent_loop

Passed

N/A

0.016377s

getgrent_setgid

Passed

N/A

0.128514s

lib/libc/gen/t_glob

0.028207s

glob_star

Passed

N/A

0.012306s

glob_star_not

Passed

N/A

0.014300s

lib/libc/gen/t_humanize_number

0.027999s

humanize_number_basic

Passed

N/A

0.013504s

humanize_number_big

Passed

N/A

0.012906s

lib/libc/gen/t_isnan

0.028058s

isinf_basic

Passed

N/A

0.013284s

isnan_basic

Passed

N/A

0.012991s

lib/libc/gen/t_nice

0.110298s

nice_err

Passed

N/A

0.016822s

nice_priority

Passed

N/A

0.060026s

nice_root

Passed

N/A

0.014867s

nice_thread

Passed

N/A

0.015235s

lib/libc/gen/t_pause

3.046183s

pause_basic

Passed

N/A

1.015192s

pause_kill

Passed

N/A

2.029365s

lib/libc/gen/t_raise

1.260868s

raise_err

Passed

N/A

0.013228s

raise_ret

Passed

N/A

1.014647s

raise_sig

Passed

N/A

0.109255s

raise_stress

Passed

N/A

0.120677s

lib/libc/gen/t_randomid

0.388275s

randomid_basic

Passed

N/A

0.387547s

lib/libc/gen/t_realpath

0.041405s

realpath_basic

Passed

N/A

0.013246s

realpath_huge

Passed

N/A

0.012736s

realpath_symlink

Passed

N/A

0.013133s

lib/libc/gen/t_setdomainname

0.079528s

setdomainname_basic

Passed

N/A

0.024823s

setdomainname_limit

Passed

N/A

0.024465s

setdomainname_perm

Passed

N/A

0.027530s

lib/libc/gen/t_sethostname

0.079901s

sethostname_basic

Passed

N/A

0.024631s

sethostname_limit

Passed

N/A

0.024696s

sethostname_perm

Passed

N/A

0.027829s

lib/libc/gen/t_siginfo

3.157177s

sigalarm

Passed

N/A

1.018611s

sigbus_adraln

Passed

N/A

0.014380s

sigchild_dump

Passed

N/A

1.030061s

sigchild_kill

Passed

N/A

0.015980s

sigchild_normal

Passed

N/A

1.027683s

sigfpe_flt

Passed

N/A

0.014903s

sigfpe_int

Passed

N/A

0.014907s

sigsegv

Passed

N/A

0.014744s

lib/libc/gen/t_sleep

166.031641s

kevent

Passed

N/A

26.599965s

nanosleep

Passed

N/A

36.789515s

poll

Passed

N/A

36.789648s

select

Passed

N/A

36.789618s

sleep

Passed

N/A

29.059539s

lib/libc/gen/t_syslog

0.016907s

syslog_pthread

Passed

N/A

0.016308s

lib/libc/gen/t_time

10.133425s

time_copy

Passed

N/A

0.013169s

time_mono

Passed

N/A

10.105225s

time_timeofday

Passed

N/A

0.012901s

lib/libc/gen/t_ttyname

0.056349s

ttyname_err

Passed

N/A

0.015055s

ttyname_r_err

Passed

N/A

0.015234s

ttyname_r_stdin

Passed

N/A

0.011801s

ttyname_stdin

Passed

N/A

0.011862s

lib/libc/gen/t_vis

0.104556s

strunvis_hex

Passed

N/A

0.011734s

strvis_basic

Passed

N/A

0.014480s

strvis_empty

Passed

N/A

0.013131s

strvis_locale

Passed

N/A

0.048425s

strvis_null

Passed

N/A

0.013251s

lib/libc/hash/t_sha2

0.046805s

t_sha256

Passed

N/A

0.014778s

t_sha384

Passed

N/A

0.014607s

t_sha512

Passed

N/A

0.014652s

lib/libc/hash/t_hmac

3.002462s

t_hmac

Passed

N/A

3.001488s

lib/libc/hash/t_hash

1.423406s

md5

Passed

N/A

0.166396s

sha1

Passed

N/A

1.255476s

lib/libc/inet/t_inet_addr

0.025523s

inet_addr_basic

Passed

N/A

0.012181s

inet_addr_err

Passed

N/A

0.012211s

lib/libc/inet/t_inet_network

0.026143s

inet_network_basic

Passed

N/A

0.011826s

inet_network_err

Passed

N/A

0.013158s

lib/libc/locale/t_mbrtowc

0.115722s

mbrtowc_internal

Passed

N/A

0.096947s

mbrtowc_object

Passed

N/A

0.017810s

lib/libc/locale/t_mbstowcs

0.026878s

mbstowcs_basic

Passed

N/A

0.026373s

lib/libc/locale/t_mbsnrtowcs

0.014053s

mbsnrtowcs

Passed

N/A

0.013444s

lib/libc/locale/t_mbtowc

0.127503s

mbtowc

Passed

N/A

0.127002s

lib/libc/locale/t_wcscspn

0.011775s

wcscspn

Passed

N/A

0.011166s

lib/libc/locale/t_wcspbrk

0.012119s

wcspbrk

Passed

N/A

0.011509s

lib/libc/locale/t_wcsspn

0.012126s

wcsspn

Passed

N/A

0.011509s

lib/libc/locale/t_wcstod

0.182660s

wcstod

Passed

N/A

0.182103s

lib/libc/locale/t_wctomb

0.046623s

wcrtomb

Passed

N/A

0.013939s

wcrtomb_state

Passed

N/A

0.014067s

wctomb

Passed

N/A

0.016475s

lib/libc/locale/t_io

0.093931s

bad_big5_getwc

Passed

N/A

0.015405s

bad_big5_swprintf

Passed

N/A

0.014959s

bad_big5_wprintf

Passed

N/A

0.014769s

good_big5_getwc

Passed

N/A

0.014628s

good_big5_swprintf

Passed

N/A

0.014573s

good_big5_wprintf

Passed

N/A

0.014653s

lib/libc/net/getaddrinfo/t_getaddrinfo

1.179260s

basic

Passed

N/A

0.237553s

empty_hostname

Passed

N/A

0.218021s

empty_servname

Passed

N/A

0.166746s

scopeaddr

Passed

N/A

0.125003s

sock_raw

Passed

N/A

0.162500s

specific

Passed

N/A

0.151075s

unsupported_family

Passed

N/A

0.111141s

lib/libc/net/t_getprotoent

0.103877s

endprotoent_rewind

Passed

N/A

0.012628s

getprotobyname_basic

Passed

N/A

0.014048s

getprotobyname_err

Passed

N/A

0.019293s

getprotobynumber_basic

Passed

N/A

0.013974s

getprotobynumber_err

Passed

N/A

0.014677s

getprotoent_next

Passed

N/A

0.012408s

setprotoent_rewind

Passed

N/A

0.012237s

lib/libc/net/t_ether_aton

0.012397s

tc_ether_aton

Passed

N/A

0.011682s

lib/libc/net/t_nsdispatch

0.140398s

recurse

Passed

N/A

0.139246s

lib/libc/net/t_protoent

0.166884s

protoent

Passed

N/A

0.165674s

lib/libc/net/t_servent

1.423507s

servent

Passed

N/A

1.420071s

lib/libc/net/t_hostent

4.294005s

dnsbyaddrlookup4

Passed

N/A

0.494904s

dnsbyaddrlookup6

Passed

N/A

0.450615s

dnsbynamelookup4

Passed

N/A

0.464957s

dnsbynamelookup6

Passed

N/A

0.456705s

gethostbyaddr4

Passed

N/A

0.452709s

gethostbyaddr6

Passed

N/A

0.453332s

gethostbyname4

Passed

N/A

0.491241s

gethostbyname6

Passed

N/A

0.469490s

hostsbyaddrlookup4

Passed

N/A

0.137625s

hostsbyaddrlookup6

Passed

N/A

0.136359s

hostsbynamelookup4

Passed

N/A

0.135725s

hostsbynamelookup6

Passed

N/A

0.134700s

lib/libc/regex/t_regex_att

0.134968s

basic

Passed

N/A

0.038687s

categorization

Passed

N/A

0.015599s

forcedassoc

Passed

N/A

0.016195s

leftassoc

Expected failure

Reason for breakage unknown: /usr/src/tests/lib/libc/regex/t_regex_att.c:377: res != matches ((0,4)(0,2)(2,3)(3,4) != (0,4)(0,1)(1,4)(4,4)): at line 3

0.012729s

nullsubexpr

Passed

N/A

0.015457s

repetition

Passed

N/A

0.018908s

rightassoc

Passed

N/A

0.013338s

lib/libc/regex/t_exhaust

0.444195s

regcomp_too_big

Passed

N/A

0.443612s

lib/libc/regex/t_regex

4.241628s

anchor

Passed

N/A

0.231039s

backref

Passed

N/A

0.222916s

basic

Passed

N/A

0.215322s

bracket

Passed

N/A

0.246971s

c_comments

Passed

N/A

0.219220s

complex

Passed

N/A

0.217570s

error

Passed

N/A

0.227933s

meta

Passed

N/A

0.221408s

nospec

Passed

N/A

0.214266s

paren

Passed

N/A

0.217633s

regress

Passed

N/A

0.212671s

repet_bounded

Passed

N/A

0.270228s

repet_multi

Passed

N/A

0.223960s

repet_ordinary

Passed

N/A

0.216279s

startend

Passed

N/A

0.212562s

subexp

Passed

N/A

0.214414s

subtle

Passed

N/A

0.212013s

word_bound

Passed

N/A

0.219175s

zero

Passed

N/A

0.211248s

lib/libc/rpc/t_xdr

0.014139s

xdr

Passed

N/A

0.013466s

lib/libc/rpc/t_rpc

4.230830s

get_svc_addr_tcp

Passed

N/A

0.031580s

get_svc_addr_udp

Passed

N/A

0.027992s

raw

Passed

N/A

0.014925s

tcp

Passed

N/A

1.035025s

tcp_poll

Passed

N/A

1.038642s

udp

Passed

N/A

1.040892s

udp_poll

Passed

N/A

1.035319s

lib/libc/setjmp/t_setjmp

0.048592s

_setjmp

Passed

N/A

0.011792s

setjmp

Passed

N/A

0.011428s

sigsetjmp_nosave

Passed

N/A

0.011561s

sigsetjmp_save

Passed

N/A

0.011497s

lib/libc/setjmp/t_threadjmp

0.053330s

_setjmp

Passed

N/A

0.012758s

setjmp

Passed

N/A

0.012805s

sigsetjmp_nosave

Passed

N/A

0.012758s

sigsetjmp_save

Passed

N/A

0.012689s

lib/libc/stdlib/t_abs

0.048239s

abs_basic

Passed

N/A

0.011732s

imaxabs_basic

Passed

N/A

0.011474s

labs_basic

Passed

N/A

0.011334s

llabs_basic

Passed

N/A

0.011430s

lib/libc/stdlib/t_atoi

0.048921s

atof_strtod

Passed

N/A

0.012274s

atoi_strtol

Passed

N/A

0.011483s

atol_strtol

Passed

N/A

0.011428s

atoll_strtoll

Passed

N/A

0.011461s

lib/libc/stdlib/t_div

0.036151s

div_basic

Passed

N/A

0.011636s

ldiv_basic

Passed

N/A

0.011438s

lldiv_basic

Passed

N/A

0.011307s

lib/libc/stdlib/t_getenv

17.929354s

clearenv_basic

Passed

N/A

0.062631s

getenv_basic

Passed

N/A

0.011570s

putenv_basic

Passed

N/A

0.013052s

setenv_basic

Passed

N/A

17.827125s

setenv_mixed

Passed

N/A

0.012072s

lib/libc/stdlib/t_getenv_thread

39.153473s

getenv_r_thread

Passed

N/A

9.152614s

putenv_thread

Passed

N/A

9.999452s

setenv_thread

Passed

N/A

9.999542s

unsetenv_thread

Passed

N/A

9.999099s

lib/libc/stdlib/t_exit

0.082747s

exit_atexit

Passed

N/A

0.015227s

exit_basic

Passed

N/A

0.015148s

exit_status

Passed

N/A

0.032497s

exit_tmpfile

Passed

N/A

0.016534s

lib/libc/stdlib/t_hsearch

0.107230s

hsearch_basic

Passed

N/A

0.013790s

hsearch_duplicate

Passed

N/A

0.013194s

hsearch_nonexistent

Passed

N/A

0.012135s

hsearch_r_basic

Passed

N/A

0.011852s

hsearch_r_duplicate

Passed

N/A

0.011942s

hsearch_r_nonexistent

Passed

N/A

0.013212s

hsearch_r_two

Passed

N/A

0.012041s

hsearch_two

Passed

N/A

0.013031s

lib/libc/stdlib/t_mi_vector_hash

0.013865s

mi_vector_hash_basic

Passed

N/A

0.013012s

lib/libc/stdlib/t_posix_memalign

0.028663s

aligned_alloc_basic

Passed

N/A

0.013617s

posix_memalign_basic

Passed

N/A

0.013624s

lib/libc/stdlib/t_random

0.016344s

random_same

Passed

N/A

0.012634s

lib/libc/stdlib/t_strtod

0.157829s

strtod_basic

Passed

N/A

0.016019s

strtod_gherman_bug

Passed

N/A

0.013048s

strtod_hex

Passed

N/A

0.012829s

strtod_inf

Passed

N/A

0.012881s

strtod_nan

Passed

N/A

0.013090s

strtod_round

Passed

N/A

0.014799s

strtod_underflow

Passed

N/A

0.013721s

strtof_inf

Passed

N/A

0.013037s

strtof_nan

Passed

N/A

0.012924s

strtold_inf

Passed

N/A

0.012837s

strtold_nan

Passed

N/A

0.014657s

lib/libc/stdlib/t_strtol

0.053802s

strtol_base

Passed

N/A

0.011946s

strtol_case

Passed

N/A

0.013177s

strtol_range

Passed

N/A

0.012905s

strtol_signed

Passed

N/A

0.012912s

lib/libc/stdlib/t_strtoi

0.054738s

strtoi_base

Passed

N/A

0.013052s

strtoi_case

Passed

N/A

0.012863s

strtoi_range

Passed

N/A

0.012919s

strtoi_signed

Passed

N/A

0.012828s

lib/libc/stdlib/t_system

0.080480s

system_basic

Passed

N/A

0.079648s

lib/libc/stdlib/t_atexit

0.129556s

atexit

Passed

N/A

0.128181s

lib/libc/stdlib/t_getopt

0.879720s

getopt

Passed

N/A

0.464460s

getopt_long

Passed

N/A

0.413844s

lib/libc/stdio/t_clearerr

0.033352s

clearerr_basic

Passed

N/A

0.020263s

clearerr_err

Passed

N/A

0.011643s

lib/libc/stdio/t_fflush

0.068873s

fflush_err

Passed

N/A

0.022238s

fflush_seek

Passed

N/A

0.022309s

fpurge_err

Passed

N/A

0.022137s

lib/libc/stdio/t_fmemopen

0.418416s

test00

Passed

N/A

0.014282s

test01

Passed

N/A

0.013724s

test02

Passed

N/A

0.013674s

test03

Passed

N/A

0.013469s

test04

Passed

N/A

0.015096s

test05

Passed

N/A

0.012212s

test06

Passed

N/A

0.012063s

test07

Passed

N/A

0.011956s

test08

Passed

N/A

0.011988s

test09

Passed

N/A

0.027471s

test10

Passed

N/A

0.023926s

test11

Passed

N/A

0.020677s

test12

Passed

N/A

0.016928s

test13

Passed

N/A

0.017458s

test14

Passed

N/A

0.017047s

test15

Passed

N/A

0.020235s

test16

Passed

N/A

0.013555s

test17

Passed

N/A

0.015568s

test18

Passed

N/A

0.012819s

test19

Passed

N/A

0.027659s

test20

Passed

N/A

0.013860s

test21

Passed

N/A

0.016946s

test22

Passed

N/A

0.039362s

lib/libc/stdio/t_fopen

0.218380s

fdopen_close

Passed

N/A

0.023003s

fdopen_err

Passed

N/A

0.024482s

fdopen_seek

Passed

N/A

0.022732s

fopen_append

Passed

N/A

0.023011s

fopen_err

Passed

N/A

0.022677s

fopen_mode

Passed

N/A

0.023095s

fopen_perm

Passed

N/A

0.013692s

fopen_regular

Passed

N/A

0.011870s

fopen_seek

Passed

N/A

0.022757s

freopen_std

Passed

N/A

0.023758s

lib/libc/stdio/t_open_memstream

0.014989s

test_open_memstream

Passed

N/A

0.014001s

lib/libc/stdio/t_fputc

0.152082s

fputc_basic

Passed

N/A

0.026350s

fputc_err

Passed

N/A

0.024690s

putc_basic

Passed

N/A

0.025106s

putc_err

Passed

N/A

0.024712s

putc_unlocked_basic

Passed

N/A

0.023291s

putc_unlocked_err

Passed

N/A

0.022889s

lib/libc/stdio/t_mktemp

0.012843s

mktemp_not_exist

Passed

N/A

0.012130s

lib/libc/stdio/t_popen

0.173702s

popen_zeropad

Passed

N/A

0.172973s

lib/libc/stdio/t_printf

0.559801s

snprintf_c99

Passed

N/A

0.011967s

snprintf_dotzero

Passed

N/A

0.011946s

snprintf_float

Passed

N/A

0.483838s

snprintf_posarg

Passed

N/A

0.012014s

snprintf_posarg_error

Passed

N/A

0.012051s

snprintf_posarg_width

Passed

N/A

0.011606s

sprintf_zeropad

Passed

N/A

0.011698s

lib/libc/stdio/t_scanf

0.024874s

sscanf_neghex

Passed

N/A

0.011823s

sscanf_whitespace

Passed

N/A

0.011606s

lib/libc/string/t_bm

0.012575s

bm

Passed

N/A

0.011767s

lib/libc/string/t_memchr

0.036732s

memchr_basic

Passed

N/A

0.011743s

memchr_simple

Passed

N/A

0.011537s

memrchr_simple

Passed

N/A

0.011524s

lib/libc/string/t_memcpy

3.210933s

memccpy_simple

Passed

N/A

0.011355s

memcpy_basic

Passed

N/A

3.186142s

memcpy_return

Passed

N/A

0.011521s

lib/libc/string/t_memmem

0.014339s

memmem_basic

Passed

N/A

0.013473s

lib/libc/string/t_memset

0.095285s

bzero_zero_size

Passed

N/A

0.013675s

memset_array

Passed

N/A

0.013090s

memset_basic

Passed

N/A

0.012595s

memset_nonzero

Passed

N/A

0.016048s

memset_return

Passed

N/A

0.011572s

memset_struct

Passed

N/A

0.011567s

memset_zero_size

Passed

N/A

0.011613s

lib/libc/string/t_popcount

0.024611s

popcount_basic

Skipped

config variable "run_popcount" not set to YES/TRUE

0.011842s

popcountll_basic

Skipped

config variable "run_popcount" not set to YES/TRUE

0.011490s

lib/libc/string/t_strcat

0.056672s

strcat_basic

Passed

N/A

0.043761s

strncat_simple

Passed

N/A

0.011605s

lib/libc/string/t_strchr

0.013516s

strchr_basic

Passed

N/A

0.012801s

lib/libc/string/t_strcmp

0.024974s

strcmp_basic

Passed

N/A

0.012037s

strcmp_simple

Passed

N/A

0.011448s

lib/libc/string/t_strcpy

0.015116s

strcpy_basic

Passed

N/A

0.014244s

lib/libc/string/t_strcspn

0.014444s

strcspn

Passed

N/A

0.013483s

lib/libc/string/t_strerror

0.104194s

strerror_basic

Passed

N/A

0.038944s

strerror_err

Passed

N/A

0.012360s

strerror_r_basic

Passed

N/A

0.037854s

strerror_r_err

Passed

N/A

0.012533s

lib/libc/string/t_stresep

0.012358s

stresep_basic

Passed

N/A

0.011648s

lib/libc/string/t_strlen

0.365007s

strlen_basic

Passed

N/A

0.011731s

strlen_huge

Passed

N/A

0.338909s

strnlen_basic

Passed

N/A

0.012199s

lib/libc/string/t_strpbrk

0.012331s

strpbrk

Passed

N/A

0.011540s

lib/libc/string/t_strrchr

0.012808s

strrchr_basic

Passed

N/A

0.012092s

lib/libc/string/t_strspn

0.012573s

strspn

Passed

N/A

0.011780s

lib/libc/string/t_swab

0.012401s

swab_basic

Passed

N/A

0.011616s

lib/libc/sys/t_access

0.099344s

access_access

Passed

N/A

0.029352s

access_fault

Passed

N/A

0.012883s

access_inval

Passed

N/A

0.012871s

access_notdir

Passed

N/A

0.013097s

access_notexist

Passed

N/A

0.012946s

access_toolong

Passed

N/A

0.013027s

lib/libc/sys/t_bind

0.012761s

bind_foreign_family

Passed

N/A

0.012039s

lib/libc/sys/t_chroot

0.095693s

chroot_basic

Passed

N/A

0.014044s

chroot_err

Passed

N/A

0.013494s

chroot_perm

Passed

N/A

0.017188s

fchroot_basic

Passed

N/A

0.014957s

fchroot_err

Passed

N/A

0.013038s

fchroot_perm

Passed

N/A

0.017025s

lib/libc/sys/t_clock_gettime

17.482376s

clock_gettime_real

Passed

N/A

17.482254s

lib/libc/sys/t_clock_nanosleep

0.012528s

clock_nanosleep_remain

Passed

N/A

0.011753s

lib/libc/sys/t_clone

0.056420s

clone_basic

Passed

N/A

0.014509s

clone_null_func

Passed

N/A

0.011942s

clone_null_stack

Passed

N/A

0.011645s

clone_out_of_proc

Passed

N/A

0.015280s

lib/libc/sys/t_connect

0.028908s

connect_foreign_family

Passed

N/A

0.013523s

connect_low_port

Passed

N/A

0.013631s

lib/libc/sys/t_dup

0.187246s

dup2_basic

Passed

N/A

0.012519s

dup2_err

Passed

N/A

0.012002s

dup2_max

Passed

N/A

0.013079s

dup2_mode

Passed

N/A

0.026706s

dup3_err

Passed

N/A

0.013029s

dup3_max

Passed

N/A

0.012923s

dup3_mode

Passed

N/A

0.026391s

dup_err

Passed

N/A

0.013082s

dup_max

Passed

N/A

0.025588s

dup_mode

Passed

N/A

0.024036s

lib/libc/sys/t_fsync

0.026902s

fsync_err

Passed

N/A

0.012123s

fsync_sync

Passed

N/A

0.013129s

lib/libc/sys/t_getcontext

0.037731s

getcontext_err

Passed

N/A

0.012088s

setcontext_err

Passed

N/A

0.011650s

setcontext_link

Passed

N/A

0.011742s

lib/libc/sys/t_getgroups

0.061747s

getgroups_err

Passed

N/A

0.012086s

getgroups_getgid

Passed

N/A

0.011560s

getgroups_setgid

Passed

N/A

0.023066s

getgroups_zero

Passed

N/A

0.011677s

lib/libc/sys/t_getitimer

0.074906s

getitimer_empty

Passed

N/A

0.012242s

getitimer_err

Passed

N/A

0.011720s

setitimer_basic

Passed

N/A

0.023653s

setitimer_err

Passed

N/A

0.011651s

setitimer_old

Passed

N/A

0.011582s

lib/libc/sys/t_getlogin

0.070575s

getlogin_r_err

Passed

N/A

0.012062s

getlogin_same

Passed

N/A

0.011697s

setlogin_basic

Passed

N/A

0.013547s

setlogin_err

Passed

N/A

0.013716s

setlogin_perm

Passed

N/A

0.015421s

lib/libc/sys/t_getpid

0.049170s

getpid_process

Passed

N/A

0.033833s

getpid_thread

Passed

N/A

0.013809s

lib/libc/sys/t_getrusage

9.235104s

getrusage_err

Passed

N/A

0.012065s

getrusage_sig

Passed

N/A

0.011704s

getrusage_utime_back

Expected failure

PR kern/30115: anticipated error did not occur

9.193666s

getrusage_utime_zero

Expected failure

PR kern/30115: zero user time from getrusage(2)

0.014661s

lib/libc/sys/t_getsid

0.042852s

getsid_current

Passed

N/A

0.013103s

getsid_err

Passed

N/A

0.012792s

getsid_process

Passed

N/A

0.014580s

lib/libc/sys/t_getsockname

0.013618s

getsockname_unix

Passed

N/A

0.012735s

lib/libc/sys/t_gettimeofday

0.027835s

gettimeofday_err

Passed

N/A

0.013118s

gettimeofday_mono

Passed

N/A

0.013071s

lib/libc/sys/t_issetugid

0.064795s

issetugid_egid

Passed

N/A

0.016492s

issetugid_euid

Passed

N/A

0.015417s

issetugid_rgid

Passed

N/A

0.014844s

issetugid_ruid

Passed

N/A

0.014706s

lib/libc/sys/t_kevent

0.102165s

kevent_zerotimer

Passed

N/A

0.016351s

kqueue_desc_passing

Skipped

PR kern/46523

0.014438s

kqueue_unsupported_fd

Passed

N/A

0.069063s

lib/libc/sys/t_kill

1.094169s

kill_basic

Passed

N/A

0.014872s

kill_err

Passed

N/A

0.015211s

kill_perm

Passed

N/A

1.028145s

kill_pgrp_neg

Passed

N/A

0.016670s

kill_pgrp_zero

Passed

N/A

0.015344s

lib/libc/sys/t_link

0.093476s

link_count

Passed

N/A

0.025128s

link_err

Passed

N/A

0.025110s

link_perm

Passed

N/A

0.014871s

link_stat

Passed

N/A

0.024869s

lib/libc/sys/t_listen

0.040447s

listen_err

Passed

N/A

0.025691s

listen_low_port

Passed

N/A

0.013192s

lib/libc/sys/t_lwp_ctl

0.027404s

lwpctl_counter

Passed

N/A

0.026660s

lib/libc/sys/t_lwp_create

0.081702s

lwp_create_generic_fail_no_uc_cpu

Passed

N/A

0.013412s

lwp_create_sparc_fail_npc_null

Passed

N/A

0.013028s

lwp_create_sparc_fail_npc_odd

Passed

N/A

0.012572s

lwp_create_sparc_fail_pc_null

Passed

N/A

0.012977s

lwp_create_sparc_fail_pc_odd

Passed

N/A

0.012991s

lwp_create_works

Passed

N/A

0.013063s

lib/libc/sys/t_minherit

0.078511s

minherit_bad

Passed

N/A

0.013261s

minherit_copy

Passed

N/A

0.015734s

minherit_none

Passed

N/A

0.015126s

minherit_share

Passed

N/A

0.015619s

minherit_zero

Passed

N/A

0.015636s

lib/libc/sys/t_mincore

0.123568s

mincore_err

Passed

N/A

0.013055s

mincore_resid

Passed

N/A

0.086800s

mincore_shmseg

Passed

N/A

0.021540s

lib/libc/sys/t_mkdir

1.094912s

mkdir_err

Passed

N/A

0.013873s

mkdir_mode

Passed

N/A

1.035409s

mkdir_perm

Passed

N/A

0.028013s

mkdir_trail

Passed

N/A

0.013668s

lib/libc/sys/t_mkfifo

2.131707s

mkfifo_block

Passed

N/A

1.032591s

mkfifo_err

Passed

N/A

0.022370s

mkfifo_nonblock

Passed

N/A

1.025767s

mkfifo_perm

Passed

N/A

0.025173s

mkfifo_stat

Passed

N/A

0.022156s

lib/libc/sys/t_mknod

0.095318s

mknod_err

Passed

N/A

0.022468s

mknod_exist

Passed

N/A

0.022260s

mknod_perm

Passed

N/A

0.025184s

mknod_stat

Passed

N/A

0.022208s

lib/libc/sys/t_mlock

0.067770s

mlock_clip

Passed

N/A

0.011802s

mlock_err

Passed

N/A

0.012010s

mlock_limits

Passed

N/A

0.016908s

mlock_mmap

Passed

N/A

0.011778s

mlock_nested

Passed

N/A

0.011897s

lib/libc/sys/t_mmap

0.193102s

mmap_block

Skipped

The test case causes a panic (PR kern/38889, kern/46592)

0.011834s

mmap_err

Passed

N/A

0.011954s

mmap_loan

Passed

N/A

0.025354s

mmap_prot_1

Passed

N/A

0.026215s

mmap_prot_2

Passed

N/A

0.015403s

mmap_prot_3

Passed

N/A

0.027666s

mmap_truncate

Passed

N/A

0.025641s

mmap_truncate_signal

Passed

N/A

0.027667s

mmap_va0

Passed

N/A

0.013554s

lib/libc/sys/t_mprotect

0.083754s

mprotect_access

Passed

N/A

0.025538s

mprotect_err

Passed

N/A

0.013392s

mprotect_exec

Skipped

Execute protection callback check not implemented

0.012987s

mprotect_pax

Failed

non-executable mapping made executable

0.013430s

mprotect_write

Passed

N/A

0.014992s

lib/libc/sys/t_msgctl

2.146523s

msgctl_err

Passed

N/A

0.025591s

msgctl_perm

Passed

N/A

0.028681s

msgctl_pid

Passed

N/A

2.036158s

msgctl_set

Passed

N/A

0.026305s

msgctl_time

Passed

N/A

0.025057s

lib/libc/sys/t_msgget

0.122081s

msgget_excl

Passed

N/A

0.025605s

msgget_exit

Passed

N/A

0.026210s

msgget_init

Passed

N/A

0.025392s

msgget_limit

Passed

N/A

0.015081s

msgget_mode

Passed

N/A

0.025418s

lib/libc/sys/t_msgrcv

4.156858s

msgrcv_basic

Passed

N/A

0.022460s

msgrcv_block

Passed

N/A

2.040286s

msgrcv_err

Passed

N/A

0.022254s

msgrcv_mtype

Passed

N/A

0.022298s

msgrcv_nonblock

Passed

N/A

2.023207s

msgrcv_truncate

Passed

N/A

0.022114s

lib/libc/sys/t_msgsnd

4.121840s

msgsnd_block

Passed

N/A

2.025411s

msgsnd_count

Passed

N/A

0.022471s

msgsnd_err

Passed

N/A

0.022045s

msgsnd_nonblock

Passed

N/A

2.022977s

msgsnd_perm

Passed

N/A

0.025510s

lib/libc/sys/t_msync

0.071705s

msync_async

Passed

N/A

0.016136s

msync_err

Passed

N/A

0.020611s

msync_invalidate

Passed

N/A

0.016095s

msync_sync

Passed

N/A

0.016120s

lib/libc/sys/t_nanosleep

1.222868s

nanosleep_basic

Passed

N/A

0.191219s

nanosleep_err

Passed

N/A

0.013086s

nanosleep_sig

Passed

N/A

1.015762s

lib/libc/sys/t_pipe

2.039222s

pipe_restart

Passed

N/A

2.038622s

lib/libc/sys/t_pipe2

0.082025s

pipe2_basic

Passed

N/A

0.013435s

pipe2_cloexec

Passed

N/A

0.013157s

pipe2_consume

Passed

N/A

0.012892s

pipe2_einval

Passed

N/A

0.012971s

pipe2_nonblock

Passed

N/A

0.013002s

pipe2_nosigpipe

Passed

N/A

0.012831s

lib/libc/sys/t_poll

11.106429s

poll_3way

Passed

N/A

10.023320s

poll_basic

Passed

N/A

0.026473s

poll_err

Passed

N/A

0.012794s

pollts_basic

Passed

N/A

1.015936s

pollts_err

Passed

N/A

0.012207s

pollts_sigmask

Passed

N/A

0.011946s

lib/libc/sys/t_posix_fallocate

0.012292s

ebadf

Passed

N/A

0.011495s

lib/libc/sys/t_recvmmsg

0.202317s

recvmmsg_basic

Passed

N/A

0.201588s

lib/libc/sys/t_revoke

0.065498s

revoke_basic

Passed

N/A

0.024423s

revoke_err

Passed

N/A

0.013425s

revoke_perm

Passed

N/A

0.025255s

lib/libc/sys/t_select

1.037067s

pselect_sigmask

Passed

N/A

1.018863s

pselect_timeout

Passed

N/A

0.016486s

lib/libc/sys/t_setrlimit

0.181657s

setrlimit_basic

Passed

N/A

0.013896s

setrlimit_current

Passed

N/A

0.013392s

setrlimit_err

Passed

N/A

0.013155s

setrlimit_fsize

Passed

N/A

0.027597s

setrlimit_memlock

Passed

N/A

0.015368s

setrlimit_nofile_1

Passed

N/A

0.016633s

setrlimit_nofile_2

Passed

N/A

0.015541s

setrlimit_nproc

Passed

N/A

0.015387s

setrlimit_nthr

Passed

N/A

0.013547s

setrlimit_perm

Passed

N/A

0.013574s

setrlimit_stack

Passed

N/A

0.013448s

lib/libc/sys/t_setuid

0.109811s

setuid_perm

Passed

N/A

0.013377s

setuid_real

Passed

N/A

0.011357s

setuid_root

Passed

N/A

0.082621s

lib/libc/sys/t_sigaction

0.043272s

sigaction_basic

Passed

N/A

0.012168s

sigaction_noflags

Passed

N/A

0.013722s

sigaction_resethand

Passed

N/A

0.015524s

lib/libc/sys/t_sigqueue

1.043833s

sigqueue_basic

Passed

N/A

0.011481s

sigqueue_err

Passed

N/A

0.013498s

sigqueue_rt

Passed

N/A

1.016013s

lib/libc/sys/t_sigtimedwait

10.048637s

sigtimedwait_NULL_timeout

Passed

N/A

5.018014s

sigtimedwait_all0timeout

Passed

N/A

0.013774s

sigtimedwait_small_timeout

Passed

N/A

5.014022s

lib/libc/sys/t_socketpair

0.042359s

socketpair_basic

Passed

N/A

0.013298s

socketpair_cloexec

Passed

N/A

0.013147s

socketpair_nonblock

Passed

N/A

0.013165s

lib/libc/sys/t_swapcontext

0.030051s

swapcontext1

Passed

N/A

0.014233s

swapcontext2

Passed

N/A

0.014204s

lib/libc/sys/t_stat

4.058491s

stat_chflags

Passed

N/A

0.025455s

stat_dir

Passed

N/A

0.876386s

stat_err

Passed

N/A

0.012937s

stat_mtime

Passed

N/A

3.052167s

stat_perm

Passed

N/A

0.025440s

stat_size

Passed

N/A

0.024858s

stat_socket

Passed

N/A

0.012093s

stat_symlink

Passed

N/A

0.022869s

lib/libc/sys/t_timer_create

6.086584s

timer_create_err

Passed

N/A

0.012095s

timer_create_mono

Passed

N/A

1.013746s

timer_create_mono_expire

Passed

N/A

2.018714s

timer_create_real

Passed

N/A

1.020224s

timer_create_real_expire

Passed

N/A

2.018795s

lib/libc/sys/t_truncate

0.078170s

ftruncate_basic

Passed

N/A

0.024381s

ftruncate_err

Passed

N/A

0.013703s

truncate_basic

Passed

N/A

0.023462s

truncate_err

Passed

N/A

0.013491s

lib/libc/sys/t_ucontext

0.014037s

ucontext_basic

Passed

N/A

0.013238s

lib/libc/sys/t_umask

0.095969s

umask_fork

Passed

N/A

0.043469s

umask_open

Passed

N/A

0.025517s

umask_previous

Passed

N/A

0.024571s

lib/libc/sys/t_unlink

0.138919s

unlink_basic

Passed

N/A

0.061124s

unlink_err

Passed

N/A

0.022497s

unlink_fifo

Passed

N/A

0.022715s

unlink_perm

Passed

N/A

0.028614s

lib/libc/sys/t_wait

0.091182s

wait6_coredumped

Passed

N/A

0.017988s

wait6_exited

Passed

N/A

0.014235s

wait6_invalid

Passed

N/A

0.011658s

wait6_stop_and_go

Passed

N/A

0.013255s

wait6_stopgo_loop

Passed

N/A

0.016905s

wait6_terminated

Passed

N/A

0.013079s

lib/libc/sys/t_wait_noproc

0.138389s

wait

Passed

N/A

0.011968s

wait3

Passed

N/A

0.011813s

wait3_options

Passed

N/A

0.012050s

wait4

Passed

N/A

0.011835s

wait4_options

Passed

N/A

0.011952s

wait6

Passed

N/A

0.012012s

wait6_options

Passed

N/A

0.012203s

waitid

Passed

N/A

0.011889s

waitid_options

Passed

N/A

0.012288s

waitpid

Passed

N/A

0.012042s

waitpid_options

Passed

N/A

0.012045s

lib/libc/sys/t_wait_noproc_wnohang

0.142946s

wait3

Passed

N/A

0.012157s

wait3_options

Passed

N/A

0.012002s

wait4

Passed

N/A

0.011934s

wait4_options

Passed

N/A

0.020360s

wait6

Passed

N/A

0.012409s

wait6_options

Passed

N/A

0.013948s

waitid

Passed

N/A

0.012781s

waitid_options

Passed

N/A

0.014621s

waitpid

Passed

N/A

0.013199s

waitpid_options

Passed

N/A

0.013569s

lib/libc/sys/t_write

0.108919s

write_err

Passed

N/A

0.026208s

write_pipe

Passed

N/A

0.012611s

write_pos

Passed

N/A

0.026295s

write_ret

Passed

N/A

0.025898s

writev_iovmax

Passed

N/A

0.013450s

lib/libc/sys/t_posix_fadvise

0.086670s

posix_fadvise

Passed

N/A

0.020957s

posix_fadvise_reg

Passed

N/A

0.063670s

lib/libc/termios/t_tcsetpgrp

0.014536s

tcsetpgrp_err

Passed

N/A

0.013594s

lib/libc/time/t_mktime

0.039533s

localtime_r_gmt

Passed

N/A

0.012703s

mktime_negyear

Passed

N/A

0.012272s

timegm_epoch

Passed

N/A

0.012316s

lib/libc/time/t_strptime

0.134776s

Zone

Passed

N/A

0.035205s

common

Passed

N/A

0.012201s

day

Passed

N/A

0.011710s

hour

Passed

N/A

0.013689s

month

Passed

N/A

0.013421s

seconds

Passed

N/A

0.011968s

year

Passed

N/A

0.011737s

zone

Passed

N/A

0.018761s

lib/libc/tls/t_tls_static

0.008487s

t_tls_static

Passed

N/A

0.007800s

lib/libc/tls/t_tls_dynamic

0.023852s

t_tls_dynamic

Passed

N/A

0.023114s

lib/libc/tls/t_tls_dlopen

0.027869s

t_tls_dlopen

Passed

N/A

0.027063s

lib/libc/ttyio/t_ptm

0.027067s

ptm

Passed

N/A

0.012788s

ptmx

Passed

N/A

0.012782s

lib/libc/ttyio/t_ttyio

2.026709s

ioctl

Passed

N/A

2.025766s

lib/libc/ssp/t_ssp

3.146685s

fgets

Passed

N/A

0.173067s

getcwd

Passed

N/A

0.157268s

gets

Passed

N/A

0.177705s

memcpy

Passed

N/A

0.155932s

memmove

Passed

N/A

0.155717s

memset

Passed

N/A

0.153747s

raw

Passed

N/A

0.154646s

read

Passed

N/A

0.174746s

readlink

Passed

N/A

0.170344s

snprintf

Passed

N/A

0.167704s

sprintf

Passed

N/A

0.167185s

stpcpy

Passed

N/A

0.167086s

stpncpy

Passed

N/A

0.157557s

strcat

Passed

N/A

0.163310s

strcpy

Passed

N/A

0.175250s

strncat

Passed

N/A

0.155771s

strncpy

Passed

N/A

0.161121s

vsnprintf

Passed

N/A

0.169913s

vsprintf

Passed

N/A

0.157246s

lib/libc/t_convfp

0.053784s

cast_ulong

Passed

N/A

0.012894s

cast_ulong2

Passed

N/A

0.012582s

conv_uint

Passed

N/A

0.012718s

conv_ulong

Passed

N/A

0.012775s

lib/libc/t_gdtoa

0.022463s

long_format

Passed

N/A

0.021568s

lib/libc/t_cdb

0.119559s

cdb

Passed

N/A

0.118531s

lib/libcrypt/t_crypt

0.024195s

crypt_salts

Passed

N/A

0.023375s

lib/libcurses/t_curses

14.158101s

addch

Passed

N/A

0.369408s

addchnstr

Passed

N/A

0.197261s

addchstr

Passed

N/A

0.188664s

addnstr

Passed

N/A

0.189292s

addstr

Passed

N/A

0.188722s

assume_default_colors

Passed

N/A

0.570235s

attributes

Passed

N/A

0.408988s

background

Passed

N/A

0.419466s

box

Passed

N/A

0.272962s

can_change_color

Passed

N/A

0.175460s

cbreak

Passed

N/A

0.458904s

clear

Passed

N/A

2.389771s

copywin

Passed

N/A

1.479771s

curs_set

Passed

N/A

0.208317s

getch

Passed

N/A

0.189237s

getstr

Passed

N/A

0.351787s

mvwin

Passed

N/A

0.326413s

startup

Passed

N/A

0.149495s

termattrs

Passed

N/A

0.168985s

timeout

Passed

N/A

4.430028s

wborder

Passed

N/A

0.249295s

window

Passed

N/A

0.199167s

wprintw

Passed

N/A

0.209568s

wscrl

Passed

N/A

0.349694s

lib/libevent/t_event

244.018616s

kqueue

Passed

N/A

82.039380s

poll

Passed

N/A

80.964779s

select

Passed

N/A

81.012380s

lib/libexecinfo/t_backtrace

0.028681s

backtrace_fmt_basic

Passed

N/A

0.028097s

lib/libm/t_acos

0.043769s

acos_inrange

Passed

N/A

0.013280s

acos_is_nan

Passed

N/A

0.013200s

acos_is_plus_zero

Passed

N/A

0.014797s

lib/libm/t_asin

0.197270s

asin_inf_neg

Passed

N/A

0.015298s

asin_inf_pos

Passed

N/A

0.014658s

asin_inrange

Passed

N/A

0.014615s

asin_nan

Passed

N/A

0.013461s

asin_range

Passed

N/A

0.013064s

asin_zero_neg

Passed

N/A

0.013104s

asin_zero_pos

Passed

N/A

0.012999s

asinf_inf_neg

Passed

N/A

0.012945s

asinf_inf_pos

Passed

N/A

0.012982s

asinf_inrange

Passed

N/A

0.012938s

asinf_nan

Passed

N/A

0.012998s

asinf_range

Passed

N/A

0.013010s

asinf_zero_neg

Passed

N/A

0.012829s

asinf_zero_pos

Passed

N/A

0.012888s

lib/libm/t_atan

0.058525s

atan_inrange

Passed

N/A

0.015303s

atan_nan

Passed

N/A

0.014259s

atan_zero_neg

Passed

N/A

0.013077s

atan_zero_pos

Passed

N/A

0.012898s

lib/libm/t_casinh

0.013398s

casinh

Passed

N/A

0.012647s

lib/libm/t_cbrt

0.250424s

cbrt_inf_neg

Passed

N/A

0.013306s

cbrt_inf_pos

Passed

N/A

0.013220s

cbrt_nan

Passed

N/A

0.013126s

cbrt_pow

Passed

N/A

0.013117s

cbrt_zero_neg

Passed

N/A

0.013161s

cbrt_zero_pos

Passed

N/A

0.013112s

cbrtf_inf_neg

Passed

N/A

0.013108s

cbrtf_inf_pos

Passed

N/A

0.013289s

cbrtf_nan

Passed

N/A

0.013086s

cbrtf_powf

Passed

N/A

0.013087s

cbrtf_zero_neg

Passed

N/A

0.013280s

cbrtf_zero_pos

Passed

N/A

0.013166s

cbrtl_inf_neg

Passed

N/A

0.013162s

cbrtl_inf_pos

Passed

N/A

0.013241s

cbrtl_nan

Passed

N/A

0.013051s

cbrtl_powl

Passed

N/A

0.013233s

cbrtl_zero_neg

Passed

N/A

0.013052s

cbrtl_zero_pos

Passed

N/A

0.015422s

lib/libm/t_ceil

0.853899s

ceil_basic

Passed

N/A

0.015813s

ceil_inf_neg

Passed

N/A

0.016275s

ceil_inf_pos

Passed

N/A

0.016337s

ceil_nan

Passed

N/A

0.016254s

ceil_zero_neg

Passed

N/A

0.015125s

ceil_zero_pos

Passed

N/A

0.014822s

ceilf_basic

Passed

N/A

0.014528s

ceilf_inf_neg

Passed

N/A

0.014543s

ceilf_inf_pos

Passed

N/A

0.014561s

ceilf_nan

Passed

N/A

0.014434s

ceilf_zero_neg

Passed

N/A

0.014612s

ceilf_zero_pos

Passed

N/A

0.014584s

ceill_basic

Passed

N/A

0.014395s

ceill_inf_neg

Passed

N/A

0.014615s

ceill_inf_pos

Passed

N/A

0.014506s

ceill_nan

Passed

N/A

0.014579s

ceill_zero_neg

Passed

N/A

0.014485s

ceill_zero_pos

Passed

N/A

0.014574s

floor_basic

Passed

N/A

0.014356s

floor_inf_neg

Passed

N/A

0.014480s

floor_inf_pos

Passed

N/A

0.014539s

floor_nan

Passed

N/A

0.014424s

floor_zero_neg

Passed

N/A

0.014572s

floor_zero_pos

Passed

N/A

0.014473s

floorf_basic

Passed

N/A

0.014448s

floorf_inf_neg

Passed

N/A

0.014559s

floorf_inf_pos

Passed

N/A

0.014598s

floorf_nan

Passed

N/A

0.014601s

floorf_zero_neg

Passed

N/A

0.014558s

floorf_zero_pos

Passed

N/A

0.014595s

floorl_basic

Passed

N/A

0.014490s

floorl_inf_neg

Passed

N/A

0.014553s

floorl_inf_pos

Passed

N/A

0.014642s

floorl_nan

Passed

N/A

0.016915s

floorl_zero_neg

Passed

N/A

0.016530s

floorl_zero_pos

Passed

N/A

0.016484s

trunc_basic

Passed

N/A

0.016547s

trunc_inf_neg

Passed

N/A

0.014737s

trunc_inf_pos

Passed

N/A

0.014587s

trunc_nan

Passed

N/A

0.016661s

trunc_zero_neg

Passed

N/A

0.016649s

trunc_zero_pos

Passed

N/A

0.016420s

truncf_basic

Passed

N/A

0.016383s

truncf_inf_neg

Passed

N/A

0.014860s

truncf_inf_pos

Passed

N/A

0.014559s

truncf_nan

Passed

N/A

0.016536s

truncf_zero_neg

Passed

N/A

0.016488s

truncf_zero_pos

Passed

N/A

0.016552s

truncl_basic

Passed

N/A

0.016458s

truncl_inf_neg

Passed

N/A

0.014827s

truncl_inf_pos

Passed

N/A

0.014689s

truncl_nan

Passed

N/A

0.014560s

truncl_zero_neg

Passed

N/A

0.014561s

truncl_zero_pos

Passed

N/A

0.014506s

lib/libm/t_cos

0.164604s

cos_angles

Passed

N/A

0.013098s

cos_inf_neg

Passed

N/A

0.012831s

cos_inf_pos

Passed

N/A

0.012914s

cos_nan

Passed

N/A

0.012879s

cos_zero_neg

Passed

N/A

0.012763s

cos_zero_pos

Passed

N/A

0.012913s

cosf_angles

Passed

N/A

0.012874s

cosf_inf_neg

Passed

N/A

0.012900s

cosf_inf_pos

Passed

N/A

0.012962s

cosf_nan

Passed

N/A

0.012772s

cosf_zero_neg

Passed

N/A

0.012828s

cosf_zero_pos

Passed

N/A

0.014895s

lib/libm/t_cosh

0.166631s

cosh_inf_neg

Passed

N/A

0.015233s

cosh_inf_pos

Passed

N/A

0.014597s

cosh_inrange

Passed

N/A

0.013398s

cosh_nan

Passed

N/A

0.012945s

cosh_zero_neg

Passed

N/A

0.012775s

cosh_zero_pos

Passed

N/A

0.012849s

coshf_inf_neg

Passed

N/A

0.012902s

coshf_inf_pos

Passed

N/A

0.012945s

coshf_inrange

Passed

N/A

0.012881s

coshf_nan

Passed

N/A

0.012812s

coshf_zero_neg

Passed

N/A

0.012849s

coshf_zero_pos

Passed

N/A

0.012823s

lib/libm/t_erf

0.232717s

erf_inf_neg

Passed

N/A

0.013364s

erf_inf_pos

Passed

N/A

0.015132s

erf_nan

Passed

N/A

0.014790s

erf_zero_neg

Passed

N/A

0.014529s

erf_zero_pos

Passed

N/A

0.014626s

erfc_inf_neg

Passed

N/A

0.014599s

erfc_inf_pos

Passed

N/A

0.014687s

erfc_nan

Passed

N/A

0.014710s

erfcf_inf_neg

Passed

N/A

0.013435s

erfcf_inf_pos

Passed

N/A

0.013055s

erfcf_nan

Passed

N/A

0.013079s

erff_inf_neg

Passed

N/A

0.012969s

erff_inf_pos

Passed

N/A

0.013109s

erff_nan

Passed

N/A

0.012935s

erff_zero_neg

Passed

N/A

0.012925s

erff_zero_pos

Passed

N/A

0.012988s

lib/libm/t_exp

0.380667s

exp2_is_nan

Passed

N/A

0.013813s

exp2_is_plus_zero

Passed

N/A

0.013396s

exp2_powers

Passed

N/A

0.013456s

exp2_values

Passed

N/A

0.013359s

exp_inf_neg

Passed

N/A

0.013241s

exp_inf_pos

Passed

N/A

0.013357s

exp_nan

Passed

N/A

0.013333s

exp_product

Passed

N/A

0.013371s

exp_zero_neg

Passed

N/A

0.013305s

exp_zero_pos

Passed

N/A

0.013315s

expf_inf_neg

Passed

N/A

0.013469s

expf_inf_pos

Passed

N/A

0.013414s

expf_nan

Passed

N/A

0.013355s

expf_product

Passed

N/A

0.013372s

expf_zero_neg

Passed

N/A

0.013147s

expf_zero_pos

Passed

N/A

0.013220s

expm1_inf_neg

Passed

N/A

0.013300s

expm1_inf_pos

Passed

N/A

0.013363s

expm1_nan

Passed

N/A

0.015613s

expm1_zero_neg

Passed

N/A

0.015228s

expm1_zero_pos

Passed

N/A

0.015091s

expm1f_inf_neg

Passed

N/A

0.015167s

expm1f_inf_pos

Passed

N/A

0.015269s

expm1f_nan

Passed

N/A

0.015165s

expm1f_zero_neg

Passed

N/A

0.015139s

expm1f_zero_pos

Passed

N/A

0.015081s

lib/libm/t_fenv

0.058178s

feenableexcept

Passed

N/A

0.015102s

fegetexcept

Passed

N/A

0.014353s

fegetround

Passed

N/A

0.013019s

fesetround

Passed

N/A

0.012703s

lib/libm/t_fe_round

0.013469s

fe_round

Passed

N/A

0.012720s

lib/libm/t_fmod

0.015838s

fmod

Passed

N/A

0.014894s

lib/libm/t_hypot

0.046162s

hypot_integer

Passed

N/A

0.014940s

hypotf_integer

Passed

N/A

0.014379s

pr50698

Passed

N/A

0.014290s

lib/libm/t_ilogb

0.015890s

ilogb

Passed

N/A

0.014977s

lib/libm/t_infinity

0.042655s

infinity_double

Passed

N/A

0.014548s

infinity_float

Passed

N/A

0.013067s

infinity_long_double

Passed

N/A

0.012964s

lib/libm/t_ldexp

0.290943s

ldexp_basic

Passed

N/A

0.015960s

ldexp_denormal

Passed

N/A

0.015353s

ldexp_denormal_large

Passed

N/A

0.015578s

ldexp_exp2

Passed

N/A

0.014924s

ldexp_inf_neg

Passed

N/A

0.014681s

ldexp_inf_pos

Passed

N/A

0.014697s

ldexp_infinity

Passed

N/A

0.014802s

ldexp_nan

Passed

N/A

0.013648s

ldexp_overflow

Passed

N/A

0.013451s

ldexp_underflow

Passed

N/A

0.013413s

ldexp_zero

Passed

N/A

0.013217s

ldexp_zero_neg

Passed

N/A

0.013051s

ldexp_zero_pos

Passed

N/A

0.023957s

ldexpf_exp2f

Passed

N/A

0.013329s

ldexpf_inf_neg

Passed

N/A

0.013345s

ldexpf_inf_pos

Passed

N/A

0.013452s

ldexpf_nan

Passed

N/A

0.013446s

ldexpf_zero_neg

Passed

N/A

0.013463s

ldexpf_zero_pos

Passed

N/A

0.013186s

lib/libm/t_log

0.860314s

log10_base

Passed

N/A

0.015284s

log10_inf_neg

Passed

N/A

0.014854s

log10_inf_pos

Passed

N/A

0.017712s

log10_nan

Passed

N/A

0.016697s

log10_one_pos

Passed

N/A

0.016505s

log10_zero_neg

Passed

N/A

0.016507s

log10_zero_pos

Passed

N/A

0.014927s

log10f_base

Passed

N/A

0.014493s

log10f_inf_neg

Passed

N/A

0.014617s

log10f_inf_pos

Passed

N/A

0.014687s

log10f_nan

Passed

N/A

0.014583s

log10f_one_pos

Passed

N/A

0.014589s

log10f_zero_neg

Passed

N/A

0.014558s

log10f_zero_pos

Passed

N/A

0.014603s

log1p_inf_neg

Passed

N/A

0.014544s

log1p_inf_pos

Passed

N/A

0.014510s

log1p_nan

Passed

N/A

0.014576s

log1p_one_neg

Passed

N/A

0.014614s

log1p_zero_neg

Passed

N/A

0.014531s

log1p_zero_pos

Passed

N/A

0.014530s

log1pf_inf_neg

Passed

N/A

0.014601s

log1pf_inf_pos

Passed

N/A

0.014564s

log1pf_nan

Passed

N/A

0.014585s

log1pf_one_neg

Passed

N/A

0.014620s

log1pf_zero_neg

Passed

N/A

0.014625s

log1pf_zero_pos

Passed

N/A

0.014527s

log2_base

Passed

N/A

0.015361s

log2_inf_neg

Passed

N/A

0.015902s

log2_inf_pos

Passed

N/A

0.016544s

log2_nan

Passed

N/A

0.016662s

log2_one_pos

Passed

N/A

0.016490s

log2_zero_neg

Passed

N/A

0.015112s

log2_zero_pos

Passed

N/A

0.014936s

log2f_base

Passed

N/A

0.014440s

log2f_inf_neg

Passed

N/A

0.014632s

log2f_inf_pos

Passed

N/A

0.014612s

log2f_nan

Passed

N/A

0.016116s

log2f_one_pos

Passed

N/A

0.014492s

log2f_zero_neg

Passed

N/A

0.014627s

log2f_zero_pos

Passed

N/A

0.014567s

log_base

Passed

N/A

0.014553s

log_inf_neg

Passed

N/A

0.014758s

log_inf_pos

Passed

N/A

0.014675s

log_nan

Passed

N/A

0.014582s

log_one_pos

Passed

N/A

0.016666s

log_zero_neg

Passed

N/A

0.016528s

log_zero_pos

Passed

N/A

0.016365s

logf_base

Passed

N/A

0.016645s

logf_inf_neg

Passed

N/A

0.014850s

logf_inf_pos

Passed

N/A

0.014669s

logf_nan

Passed

N/A

0.016459s

logf_one_pos

Passed

N/A

0.016242s

logf_zero_neg

Passed

N/A

0.016163s

logf_zero_pos

Passed

N/A

0.016325s

lib/libm/t_modf

0.015658s

modf

Passed

N/A

0.014729s

lib/libm/t_pow

0.290480s

pow_inf_neg_x

Passed

N/A

0.013814s

pow_inf_neg_y

Passed

N/A

0.013351s

pow_inf_pos_x

Passed

N/A

0.013246s

pow_inf_pos_y

Passed

N/A

0.013277s

pow_nan_x

Passed

N/A

0.013028s

pow_nan_y

Passed

N/A

0.013181s

pow_one_neg_x

Passed

N/A

0.013156s

pow_one_pos_x

Passed

N/A

0.013124s

pow_zero_x

Passed

N/A

0.013314s

pow_zero_y

Passed

N/A

0.012965s

powf_inf_neg_x

Passed

N/A

0.013200s

powf_inf_neg_y

Passed

N/A

0.013186s

powf_inf_pos_x

Passed

N/A

0.013156s

powf_inf_pos_y

Passed

N/A

0.015466s

powf_nan_x

Passed

N/A

0.014781s

powf_nan_y

Passed

N/A

0.014854s

powf_one_neg_x

Passed

N/A

0.014834s

powf_one_pos_x

Passed

N/A

0.014753s

powf_zero_x

Passed

N/A

0.015045s

powf_zero_y

Passed

N/A

0.014724s

lib/libm/t_precision

0.013627s

t_precision

Passed

N/A

0.012870s

lib/libm/t_round

0.013486s

round_dir

Passed

N/A

0.012736s

lib/libm/t_scalbn

0.296081s

scalbn_inf_neg

Passed

N/A

0.013312s

scalbn_inf_pos

Passed

N/A

0.013142s

scalbn_ldexp

Passed

N/A

0.013145s

scalbn_nan

Passed

N/A

0.013130s

scalbn_val

Passed

N/A

0.013034s

scalbn_zero_neg

Passed

N/A

0.013133s

scalbn_zero_pos

Passed

N/A

0.015143s

scalbnf_inf_neg

Passed

N/A

0.014706s

scalbnf_inf_pos

Passed

N/A

0.015106s

scalbnf_ldexpf

Passed

N/A

0.014543s

scalbnf_nan

Passed

N/A

0.013526s

scalbnf_val

Passed

N/A

0.014355s

scalbnf_zero_neg

Passed

N/A

0.013037s

scalbnf_zero_pos

Passed

N/A

0.013098s

scalbnl_inf_neg

Passed

N/A

0.015443s

scalbnl_inf_pos

Passed

N/A

0.015154s

scalbnl_nan

Passed

N/A

0.015098s

scalbnl_val

Passed

N/A

0.014994s

scalbnl_zero_neg

Passed

N/A

0.014885s

scalbnl_zero_pos

Passed

N/A

0.013425s

lib/libm/t_sin

0.161026s

sin_angles

Passed

N/A

0.013336s

sin_inf_neg

Passed

N/A

0.012855s

sin_inf_pos

Passed

N/A

0.012772s

sin_nan

Passed

N/A

0.012684s

sin_zero_neg

Passed

N/A

0.012724s

sin_zero_pos

Passed

N/A

0.012730s

sinf_angles

Passed

N/A

0.012739s

sinf_inf_neg

Passed

N/A

0.012766s

sinf_inf_pos

Passed

N/A

0.012751s

sinf_nan

Passed

N/A

0.012776s

sinf_zero_neg

Passed

N/A

0.012761s

sinf_zero_pos

Passed

N/A

0.012735s

lib/libm/t_sinh

0.181519s

sinh_inf_neg

Passed

N/A

0.015387s

sinh_inf_pos

Passed

N/A

0.014839s

sinh_inrange

Passed

N/A

0.014774s

sinh_nan

Passed

N/A

0.014820s

sinh_zero_neg

Passed

N/A

0.014596s

sinh_zero_pos

Passed

N/A

0.014504s

sinhf_inf_neg

Passed

N/A

0.014683s

sinhf_inf_pos

Passed

N/A

0.013173s

sinhf_inrange

Passed

N/A

0.012928s

sinhf_nan

Passed

N/A

0.012970s

sinhf_zero_neg

Passed

N/A

0.014754s

sinhf_zero_pos

Passed

N/A

0.014487s

lib/libm/t_sqrt

0.261918s

sqrt_inf_neg

Passed

N/A

0.013781s

sqrt_inf_pos

Passed

N/A

0.013115s

sqrt_nan

Passed

N/A

0.013156s

sqrt_pow

Passed

N/A

0.013167s

sqrt_zero_neg

Passed

N/A

0.013076s

sqrt_zero_pos

Passed

N/A

0.015170s

sqrtf_inf_neg

Passed

N/A

0.014945s

sqrtf_inf_pos

Passed

N/A

0.014762s

sqrtf_nan

Passed

N/A

0.014767s

sqrtf_powf

Passed

N/A

0.014770s

sqrtf_zero_neg

Passed

N/A

0.014750s

sqrtf_zero_pos

Passed

N/A

0.014636s

sqrtl_inf_neg

Passed

N/A

0.013612s

sqrtl_inf_pos

Passed

N/A

0.013121s

sqrtl_nan

Passed

N/A

0.013191s

sqrtl_powl

Passed

N/A

0.013207s

sqrtl_zero_neg

Passed

N/A

0.012964s

sqrtl_zero_pos

Passed

N/A

0.012965s

lib/libm/t_tan

0.178596s

tan_angles

Passed

N/A

0.013331s

tan_inf_neg

Passed

N/A

0.015163s

tan_inf_pos

Passed

N/A

0.014884s

tan_nan

Passed

N/A

0.014757s

tan_zero_neg

Passed

N/A

0.014740s

tan_zero_pos

Passed

N/A

0.014746s

tanf_angles

Passed

N/A

0.014827s

tanf_inf_neg

Passed

N/A

0.014755s

tanf_inf_pos

Passed

N/A

0.013066s

tanf_nan

Passed

N/A

0.012963s

tanf_zero_neg

Passed

N/A

0.012978s

tanf_zero_pos

Passed

N/A

0.013177s

lib/libm/t_tanh

0.136625s

tanh_inf_neg

Passed

N/A

0.013080s

tanh_inf_pos

Passed

N/A

0.012776s

tanh_nan

Passed

N/A

0.012796s

tanh_zero_neg

Passed

N/A

0.013021s

tanh_zero_pos

Passed

N/A

0.014270s

tanhf_inf_neg

Passed

N/A

0.012809s

tanhf_inf_pos

Passed

N/A

0.012846s

tanhf_nan

Passed

N/A

0.012783s

tanhf_zero_neg

Passed

N/A

0.012725s

tanhf_zero_pos

Passed

N/A

0.013509s

lib/libobjc/t_threads

0.016015s

thread_callback

Passed

N/A

0.015420s

lib/libposix/bsd/t_rename

0.012397s

rename

Passed

N/A

0.011643s

lib/libposix/posix1/t_rename

0.012998s

rename

Passed

N/A

0.012110s

lib/libposix/posix2/t_rename

0.012147s

rename

Passed

N/A

0.011267s

lib/libppath/t_ppath

0.373901s

component_at

Passed

N/A

0.017245s

copydel_bool_success

Passed

N/A

0.014838s

copydel_object_twice_success

Passed

N/A

0.014890s

copyset_bool_success

Passed

N/A

0.014852s

copyset_object_twice_success

Passed

N/A

0.014859s

create_bool_eexist

Passed

N/A

0.014455s

create_bool_success

Passed

N/A

0.014298s

delete_bool_eftype

Passed

N/A

0.014238s

delete_bool_enoent

Passed

N/A

0.014483s

delete_bool_success

Passed

N/A

0.014306s

get_bool_eftype

Passed

N/A

0.014387s

get_bool_enoent

Passed

N/A

0.014281s

get_bool_success

Passed

N/A

0.014236s

get_idx_key

Passed

N/A

0.013944s

get_string_eftype

Passed

N/A

0.014289s

get_string_enoent

Passed

N/A

0.014618s

get_string_success

Passed

N/A

0.014337s

length

Passed

N/A

0.014012s

pop_until_empty

Passed

N/A

0.014050s

ppath_copy

Passed

N/A

0.014033s

push_until_full

Passed

N/A

0.014061s

replace

Passed

N/A

0.013962s

set_bool_eftype

Passed

N/A

0.014286s

set_bool_enoent

Passed

N/A

0.014194s

set_bool_success

Passed

N/A

0.014283s

lib/libprop/t_basic

0.026631s

prop_basic

Passed

N/A

0.012971s

prop_dictionary_equals

Passed

N/A

0.012590s

lib/libpthread/t_barrier

10.064648s

barrier

Passed

N/A

10.064021s

lib/libpthread/t_cond

9.172073s

bogus_timedwaits

Passed

N/A

0.016420s

broadcast

Passed

N/A

0.360579s

cond_timedwait_race

Passed

N/A

2.198688s

condattr

Passed

N/A

0.015320s

destroy_after_cancel

Passed

N/A

0.015220s

signal_before_unlock

Passed

N/A

2.023825s

signal_before_unlock_static_init

Passed

N/A

2.019569s

signal_delay_wait

Passed

N/A

2.019791s

signal_wait_race

Passed

N/A

0.497561s

lib/libpthread/t_condwait

4.038138s

cond_wait_mono

Passed

N/A

2.017560s

cond_wait_real

Passed

N/A

2.019528s

lib/libpthread/t_detach

0.015380s

pthread_detach

Passed

N/A

0.014867s

lib/libpthread/t_equal

0.015475s

pthread_equal

Passed

N/A

0.014954s

lib/libpthread/t_fork

5.019098s

fork

Passed

N/A

5.018511s

lib/libpthread/t_fpu

0.019788s

fpu

Passed

N/A

0.019288s

lib/libpthread/t_join

0.020347s

pthread_join

Passed

N/A

0.019854s

lib/libpthread/t_kill

0.130016s

simple

Passed

N/A

0.129457s

lib/libpthread/t_mutex

52.960241s

mutex1

Passed

N/A

4.029179s

mutex2

Passed

N/A

6.584093s

mutex3

Passed

N/A

7.047716s

mutex4

Passed

N/A

4.026946s

mutex5

Passed

N/A

10.019613s

mutex6

Passed

N/A

21.219868s

mutexattr1

Passed

N/A

0.015021s

mutexattr2

Passed

N/A

0.013762s

lib/libpthread/t_name

0.015747s

name

Passed

N/A

0.015172s

lib/libpthread/t_once

0.048013s

once1

Passed

N/A

0.014639s

once2

Passed

N/A

0.017848s

once3

Passed

N/A

0.013937s

lib/libpthread/t_preempt

1.020448s

preempt1

Passed

N/A

1.019900s

lib/libpthread/t_rwlock

1.028929s

rwlock1

Passed

N/A

1.014929s

rwlock_static

Passed

N/A

0.012992s

lib/libpthread/t_sem

20.447796s

before_start_no_threads

Passed

N/A

10.008369s

before_start_one_thread

Passed

N/A

10.010535s

named

Passed

N/A

0.013502s

unnamed

Passed

N/A

0.413273s

lib/libpthread/t_sigmask

4.088091s

before_threads

Passed

N/A

0.015876s

incorrect_mask_bug

Passed

N/A

3.035117s

respected_while_running

Passed

N/A

1.019516s

upcalls_not_started

Passed

N/A

0.014978s

lib/libpthread/t_sigsuspend

1.021437s

sigsuspend

Passed

N/A

1.020592s

lib/libpthread/t_siglongjmp

0.016074s

siglongjmp1

Passed

N/A

0.015222s

lib/libpthread/t_sleep

1.017150s

sleep1

Passed

N/A

1.016437s

lib/libpthread/t_swapcontext

0.016170s

swapcontext1

Passed

N/A

0.015593s

lib/libpthread/t_timedmutex

85.458442s

mutex1

Passed

N/A

4.031081s

mutex2

Passed

N/A

23.366864s

mutex3

Passed

N/A

22.705373s

mutex4

Passed

N/A

4.026456s

mutex5

Passed

N/A

10.019882s

mutex6

Failed

/usr/src/tests/lib/libpthread/t_mutex.c:524: start != 1

21.219746s

mutexattr1

Passed

N/A

0.013712s

mutexattr2

Passed

N/A

0.013768s

timedmutex1

Passed

N/A

0.013497s

timedmutex2

Passed

N/A

0.013694s

timedmutex3

Passed

N/A

0.014186s

timedmutex4

Passed

N/A

0.013834s

lib/libpthread/t_atexit

0.133078s

atexit

Passed

N/A

0.132084s

lib/libpthread/t_cancel

0.139090s

register_while_disabled

Passed

N/A

0.138523s

lib/libpthread/t_exit

0.133058s

main_thread

Passed

N/A

0.132267s

lib/libpthread/t_resolv

4.157852s

resolv

Passed

N/A

4.157023s

lib/libpthread_dbg/t_dummy

0.046872s

dummy1

Passed

N/A

0.014440s

dummy2

Passed

N/A

0.013977s

dummy3

Passed

N/A

0.016037s

lib/libpthread_dbg/t_threads

0.163939s

threads1

Passed

N/A

0.017024s

threads2

Passed

N/A

0.016505s

threads3

Passed

N/A

0.018258s

threads4

Passed

N/A

0.018257s

threads5

Passed

N/A

0.018597s

threads6

Passed

N/A

0.016938s

threads7

Passed

N/A

0.016641s

threads8

Passed

N/A

0.018312s

threads9

Passed

N/A

0.016991s

lib/librefuse/t_refuse_opt

0.135742s

t_fuse_opt_add_arg

Passed

N/A

0.014786s

t_fuse_opt_add_opt

Passed

N/A

0.014479s

t_fuse_opt_add_opt_escaped

Passed

N/A

0.014292s

t_fuse_opt_insert_arg

Passed

N/A

0.014363s

t_fuse_opt_match

Passed

N/A

0.014228s

t_fuse_opt_parse

Passed

N/A

0.014783s

t_fuse_opt_parse_null_args

Passed

N/A

0.014286s

t_fuse_opt_parse_null_opts

Passed

N/A

0.014397s

t_fuse_opt_parse_null_proc

Passed

N/A

0.014602s

lib/librt/t_sched

0.106314s

sched_getparam

Passed

N/A

0.012544s

sched_priority

Passed

N/A

0.012853s

sched_rr_get_interval_1

Passed

N/A

0.012695s

sched_rr_get_interval_2

Passed

N/A

0.012692s

sched_setscheduler_1

Passed

N/A

0.012614s

sched_setscheduler_2

Passed

N/A

0.012632s

sched_setscheduler_3

Passed

N/A

0.012678s

sched_setscheduler_4

Passed

N/A

0.012671s

lib/librt/t_sem

20.229912s

basic

Passed

N/A

0.012282s

child

Passed

N/A

20.216276s

lib/libtre/t_regex_att

0.204279s

basic

Passed

N/A

0.062685s

categorization

Passed

N/A

0.024185s

forcedassoc

Passed

N/A

0.016851s

leftassoc

Passed

N/A

0.017688s

nullsubexpr

Passed

N/A

0.018952s

repetition

Passed

N/A

0.039544s

rightassoc

Expected failure

Reason for breakage unknown: /usr/src/tests/lib/libtre/../libc/regex/t_regex_att.c:377: res != matches ((0,4)(0,1)(1,4)(4,4) != (0,4)(0,2)(2,3)(3,4)): at line 3

0.020073s

lib/libtre/t_exhaust

4.011104s

regcomp_too_big

Passed

N/A

4.010209s

lib/libusbhid/t_usbhid

0.093916s

check_hid_get_data

Expected failure

only the 32-bit opcode works, 8 and 16-bit is broken: 4 checks failed as expected; see output for more details

0.015033s

check_hid_logical_range

Expected failure

only the 32-bit opcode works, 8 and 16-bit is broken: 4 checks failed as expected; see output for more details

0.015305s

check_hid_physical_range

Expected failure

only the 32-bit opcode works, 8 and 16-bit is broken: 4 checks failed as expected; see output for more details

0.015455s

check_hid_set_data

Passed

N/A

0.012556s

check_hid_usage

Passed

N/A

0.018954s

check_parse_just_pop

Passed

N/A

0.012265s

lib/libutil/t_efun

0.053151s

ecalloc

Passed

N/A

0.012995s

efopen

Passed

N/A

0.012430s

emalloc

Passed

N/A

0.012357s

erealloc

Passed

N/A

0.012279s

lib/libutil/t_parsedate

2.690781s

atsecs

Passed

N/A

0.016310s

dates

Passed

N/A

0.014719s

dsttimes

Passed

N/A

0.048193s

gibberish

Passed

N/A

0.015459s

relative

Passed

N/A

2.558131s

times

Passed

N/A

0.016591s

zones

Passed

N/A

0.016603s

lib/libutil/t_pidfile

0.122784s

change_basenames

Passed

N/A

0.021696s

change_mix

Passed

N/A

0.020253s

change_paths

Passed

N/A

0.019297s

custom_basename

Passed

N/A

0.019088s

custom_path

Passed

N/A

0.018940s

default_path

Passed

N/A

0.019130s

lib/libutil/t_snprintb

0.028701s

snprintb

Passed

N/A

0.013909s

snprintb_m

Passed

N/A

0.013606s

lib/libutil/t_sockaddr_snprintf

0.072213s

sockaddr_snprintf_at

Passed

N/A

0.014162s

sockaddr_snprintf_dl

Passed

N/A

0.013955s

sockaddr_snprintf_in

Passed

N/A

0.013880s

sockaddr_snprintf_in6

Passed

N/A

0.013905s

sockaddr_snprintf_un

Passed

N/A

0.013559s

lib/semaphore/pthread/t_sem_pth

0.666096s

blocktimedwait

Passed

N/A

0.126711s

blockwait

Passed

N/A

0.239577s

busydestroy

Passed

N/A

0.059136s

destroy

Passed

N/A

0.047927s

initvalue

Passed

N/A

0.046731s

named

Passed

N/A

0.047192s

postwait

Passed

N/A

0.047314s

unlink

Passed

N/A

0.046077s

lib/librumpclient/t_fd

0.377654s

bigenough

Passed

N/A

0.114847s

sigio

Passed

N/A

0.261164s

lib/librumpclient/t_exec

4.156907s

cloexec

Passed

N/A

0.616892s

exec

Passed

N/A

0.596377s

noexec

Passed

N/A

0.566781s

threxec

Passed

N/A

1.691055s

vfork

Passed

N/A

0.676035s

lib/librumphijack/t_asyncio

1.114407s

invafd

Passed

N/A

0.378540s

select_allunset

Passed

N/A

0.389791s

select_timeout

Passed

N/A

0.342405s

lib/librumphijack/t_config

0.359063s

fdoff

Passed

N/A

0.357420s

lib/librumphijack/t_cwd

2.630134s

basic_chdir

Passed

N/A

0.323829s

basic_fchdir

Passed

N/A

0.333368s

slash_chdir

Passed

N/A

0.325162s

slash_fchdir

Passed

N/A

0.329540s

symlink_chdir

Passed

N/A

0.331910s

symlink_fchdir

Passed

N/A

0.324072s

symlink_slash_chdir

Passed

N/A

0.318975s

symlink_slash_fchdir

Passed

N/A

0.334515s

lib/librumphijack/t_sh

0.926786s

redirect

Passed

N/A

0.501030s

runscript

Passed

N/A

0.423419s

lib/librumphijack/t_tcpip

4.470628s

http

Passed

N/A

0.849969s

nfs

Passed

N/A

1.974948s

nfs_autoload

Skipped

test currently valid only on i386

0.241297s

ssh

Expected failure

PR lib/50174: atf-check failed; see the output of the test for details

1.391573s

lib/librumphijack/t_vfs

5.334060s

blanket

Passed

N/A

0.386332s

cpcopy

Passed

N/A

0.797671s

doubleblanket

Passed

N/A

0.510939s

ln_nox

Passed

N/A

0.741252s

ln_x

Passed

N/A

0.374988s

mv_nox

Passed

N/A

0.683556s

mv_x

Passed

N/A

0.594937s

paxcopy

Passed

N/A

0.834322s

runonprefix

Passed

N/A

0.380663s

lib/libdes/t_des

0.196730s

align

Passed

N/A

0.016249s

cbc

Passed

N/A

0.012385s

cbc_cksum

Passed

N/A

0.012190s

cbcm

Passed

N/A

0.012263s

cfb

Passed

N/A

0.012637s

desx_cbc

Passed

N/A

0.012409s

ecb

Passed

N/A

0.012459s

ede_cbc

Passed

N/A

0.012351s

ede_ecb

Passed

N/A

0.012347s

ede_ofb64

Passed

N/A

0.012276s

fast_crypt

Passed

N/A

0.012302s

ofb

Passed

N/A

0.012215s

ofb64

Passed

N/A

0.012266s

pcbc

Passed

N/A

0.012222s

quad_cksum

Passed

N/A

0.012129s

lib/libskey/t_algorithms

0.090168s

md4

Passed

N/A

0.013025s

md5

Passed

N/A

0.012793s

sha1

Passed

N/A

0.062686s

libexec/ld.elf_so/t_dlerror-cleared

0.014380s

rtld_dlerror_cleared

Passed

N/A

0.013849s

libexec/ld.elf_so/t_dlerror-false

0.013198s

rtld_dlerror_false

Passed

N/A

0.012659s

libexec/ld.elf_so/t_dlinfo

0.050659s

rtld_dlinfo_linkmap_dlopen

Passed

N/A

0.013027s

rtld_dlinfo_linkmap_dlopen_iter

Passed

N/A

0.012282s

rtld_dlinfo_linkmap_inval

Passed

N/A

0.011750s

rtld_dlinfo_linkmap_self

Passed

N/A

0.011565s

libexec/ld.elf_so/t_dlvsym

0.064938s

rtld_dlvsym_symbol_nonexistent

Passed

N/A

0.013437s

rtld_dlvsym_v1

Passed

N/A

0.012356s

rtld_dlvsym_v3

Passed

N/A

0.012164s

rtld_dlvsym_version_nonexistent

Passed

N/A

0.012162s

rtld_dlvsym_version_null

Passed

N/A

0.012268s

libexec/ld.elf_so/t_ifunc

0.047995s

rtld_ifunc

Passed

N/A

0.047417s

libexec/ld.elf_so/t_df_1_noopen

0.275625s

df_1_noopen1

Passed

N/A

0.135430s

df_1_noopen2

Passed

N/A

0.138365s

libexec/ld.elf_so/t_dl_symver

0.608177s

dl_symver

Passed

N/A

0.607396s

net/fdpass/t_fdpass

0.773924s

fdpass_compat

Passed

N/A

0.320691s

fdpass_compat_normal

Passed

N/A

0.163438s

fdpass_normal

Passed

N/A

0.131194s

fdpass_normal_compat

Passed

N/A

0.154873s

net/in_cksum/t_in_cksum

22.278753s

mbufs_aligned

Passed

N/A

7.022381s

mbufs_unaligned

Passed

N/A

7.023259s

sizes_aligned

Passed

N/A

4.322114s

sizes_unaligned

Passed

N/A

3.907861s

net/net/t_unix

0.043937s

sockaddr_un_closed

Passed

N/A

0.014147s

sockaddr_un_len_exceed

Passed

N/A

0.013596s

sockaddr_un_len_max

Passed

N/A

0.013822s

net/net/t_tcp

0.041659s

fcntl_reset_nonblock

Passed

N/A

0.013533s

paccept_nonblock

Passed

N/A

0.013016s

paccept_reset_nonblock

Passed

N/A

0.012992s

net/net/t_udp

0.031230s

udp4_send

Passed

N/A

0.014945s

udp6_send

Passed

N/A

0.014733s

net/net/t_pktinfo

0.014326s

pktinfo

Passed

N/A

0.013475s

net/net/t_raw

0.178310s

PRU_SENSE

Passed

N/A

0.177379s

net/net/t_forwarding

67.401790s

ipforwarding_fastforward_v4

Passed

N/A

7.073377s

ipforwarding_fastforward_v6

Passed

N/A

7.056694s

ipforwarding_misc

Passed

N/A

22.421568s

ipforwarding_v4

Passed

N/A

12.839144s

ipforwarding_v6

Passed

N/A

17.992324s

net/net/t_ipaddress

12.216250s

ipaddr_auto_linklocal

Passed

N/A

1.205649s

ipaddr_same_address

Passed

N/A

6.784060s

ipaddr_same_address6

Passed

N/A

4.219267s

net/net/t_ipv6address

40.389366s

linklocal

Passed

N/A

38.356296s

linklocal_ops

Passed

N/A

2.022834s

net/net/t_ipv6_lifetime

29.693730s

basic

Passed

N/A

29.690477s

net/net/t_mtudisc

301.217002s

mtudisc_basic

Failed

Test case timed out after 300 seconds

301.213462s

net/net/t_mtudisc6

12.465534s

mtudisc6_basic

Passed

N/A

12.461347s

net/net/t_ping6_opts

43.495783s

ping6_opts_gateway

Passed

N/A

10.441439s

ping6_opts_hops

Passed

N/A

15.969727s

ping6_opts_interface

Passed

N/A

8.101490s

ping6_opts_sourceaddr

Passed

N/A

8.966683s

net/sys/t_rfc6056

0.049069s

inet4

Passed

N/A

0.023995s

inet6

Passed

N/A

0.023480s

net/arp/t_arp

78.786109s

arp_cache_expiration_10s

Passed

N/A

13.610795s

arp_cache_expiration_5s

Passed

N/A

8.563490s

arp_cache_overwriting

Passed

N/A

1.731232s

arp_command

Passed

N/A

9.517081s

arp_garp

Passed

N/A

6.922325s

arp_link_activation

Passed

N/A

3.796138s

arp_proxy_arp_pub

Passed

N/A

16.865356s

arp_proxy_arp_pubproxy

Passed

N/A

16.261447s

arp_static

Passed

N/A

1.490679s

net/arp/t_dad

17.803181s

dad_basic

Passed

N/A

14.220399s

dad_duplicated

Passed

N/A

3.577448s

net/bpf/t_bpf

0.374320s

bpfwriteleak

Passed

N/A

0.183264s

bpfwritetrunc

Passed

N/A

0.188753s

net/bpf/t_div-by-zero

0.181942s

div_by_zero

Passed

N/A

0.181274s

net/bpf/t_mbuf

3.666710s

bpf_mbuf_ldb_abs

Passed

N/A

0.182497s

bpf_mbuf_ldb_abs_overflow

Passed

N/A

0.183620s

bpf_mbuf_ldb_ind

Passed

N/A

0.189793s

bpf_mbuf_ldb_ind_overflow1

Passed

N/A

0.180552s

bpf_mbuf_ldb_ind_overflow2

Passed

N/A

0.181887s

bpf_mbuf_ldb_ind_overflow3

Passed

N/A

0.182998s

bpf_mbuf_ldh_abs

Passed

N/A

0.183134s

bpf_mbuf_ldh_abs_overflow

Passed

N/A

0.181455s

bpf_mbuf_ldh_ind

Passed

N/A

0.181954s

bpf_mbuf_ldh_ind_overflow1

Passed

N/A

0.182169s

bpf_mbuf_ldh_ind_overflow2

Passed

N/A

0.185260s

bpf_mbuf_ldh_ind_overflow3

Passed

N/A

0.182428s

bpf_mbuf_ldw_abs

Passed

N/A

0.180936s

bpf_mbuf_ldw_abs_overflow

Passed

N/A

0.182173s

bpf_mbuf_ldw_ind

Passed

N/A

0.180699s

bpf_mbuf_ldw_ind_overflow1

Passed

N/A

0.180605s

bpf_mbuf_ldw_ind_overflow2

Passed

N/A

0.182556s

bpf_mbuf_ldw_ind_overflow3

Passed

N/A

0.183057s

bpf_mbuf_msh

Passed

N/A

0.182854s

bpf_mbuf_msh_overflow

Passed

N/A

0.184026s

net/bpfilter/t_bpfilter

1.764397s

bpfilterbadjmp

Passed

N/A

0.188430s

bpfilterbadmem

Passed

N/A

0.189983s

bpfilterbadret

Passed

N/A

0.191276s

bpfiltercontig

Passed

N/A

0.328826s

bpfiltermchain

Passed

N/A

0.288608s

bpfilternegjmp

Passed

N/A

0.189552s

bpfilternoinitA

Passed

N/A

0.190881s

bpfilternoinitX

Passed

N/A

0.182647s

net/carp/t_basic

8.379712s

handover

Passed

N/A

8.377856s

net/icmp/t_forward

1.203066s

returndatabytes

Passed

N/A

1.201190s

net/icmp/t_ping

9.420966s

floodping

Passed

N/A

2.082243s

floodping2

Passed

N/A

2.908154s

ping_of_death

Passed

N/A

0.397010s

pingsize

Passed

N/A

3.283559s

simpleping

Passed

N/A

0.740907s

net/icmp/t_ping2

0.935550s

basic

Passed

N/A

0.933671s

net/icmp/t_icmp_redirect

21.761385s

icmp_redirect

Passed

N/A

7.124348s

icmp_redirect_timeout

Passed

N/A

14.630096s

net/icmp/t_icmp6_redirect

14.346883s

icmp6_redirect_basic

Passed

N/A

14.343114s

net/if/t_compat

0.187698s

OOSIOCGIFBRDADDR

Expected failure

PR kern/51610: rump does not include COMPAT_43: /usr/src/tests/net/if/t_compat.c:72: rump_sys_ioctl(fd, ((((unsigned long)0x80000000|(unsigned long)0x40000000)) | (((sizeof(struct oifreq)) & 0x1fff) << 16) | ((('i')) << 8) | ((18))), &ifreq): Inappropriate ioctl for device

0.185693s

net/if/t_ifconf

1.806109s

basic

Passed

N/A

1.804171s

net/if/t_ifconfig

27.998768s

ifconfig_create_destroy

Passed

N/A

0.960538s

ifconfig_options

Passed

N/A

4.852593s

ifconfig_parameters

Passed

N/A

22.177601s

net/if_bridge/t_bridge

88.530915s

bridge_ipv4

Passed

N/A

14.159454s

bridge_ipv6

Passed

N/A

24.303159s

bridge_member_ipv4

Passed

N/A

20.216285s

bridge_member_ipv6

Passed

N/A

25.758463s

bridge_rtable

Passed

N/A

4.075426s

net/if_gif/t_gif

141.612914s

gif_basic_ipv4overipv4

Passed

N/A

9.573411s

gif_basic_ipv4overipv6

Passed

N/A

9.610916s

gif_basic_ipv6overipv4

Passed

N/A

14.586686s

gif_basic_ipv6overipv6

Passed

N/A

14.559051s

gif_ioctl_ipv4overipv4

Passed

N/A

10.755506s

gif_ioctl_ipv4overipv6

Passed

N/A

10.669800s

gif_ioctl_ipv6overipv4

Passed

N/A

15.791562s

gif_ioctl_ipv6overipv6

Passed

N/A

15.744122s

gif_recursive_ipv4overipv4

Passed

N/A

10.131397s

gif_recursive_ipv4overipv6

Passed

N/A

10.022079s

gif_recursive_ipv6overipv4

Passed

N/A

10.033277s

gif_recursive_ipv6overipv6

Passed

N/A

10.086735s

net/if_loop/t_pr

0.352466s

loopmtu

Passed

N/A

0.175904s

loopmtu_csum

Passed

N/A

0.175286s

net/if_pppoe/t_pppoe

86.318380s

pppoe6_chap

Passed

N/A

19.451086s

pppoe6_pap

Passed

N/A

20.219170s

pppoe_chap

Passed

N/A

23.347454s

pppoe_pap

Passed

N/A

23.295283s

net/if_tap/t_tap

12.898786s

tap_bridged

Passed

N/A

5.470967s

tap_create_destroy

Passed

N/A

0.902800s

tap_stand_alone

Passed

N/A

6.518117s

net/if_tun/t_tun

13.671041s

tun_create_destroy

Passed

N/A

0.606987s

tun_setup

Passed

N/A

13.062496s

net/mcast/t_mcast

23.225882s

mcast_conninet4

Passed

N/A

2.747752s

mcast_conninet6

Passed

N/A

2.919854s

mcast_connmappedbuginet4

Passed

N/A

2.964229s

mcast_connmappedinet4

Passed

N/A

2.755474s

mcast_unconninet4

Passed

N/A

3.021250s

mcast_unconninet6

Passed

N/A

3.072613s

mcast_unconnmappedbuginet4

Passed

N/A

2.797167s

mcast_unconnmappedinet4

Passed

N/A

2.926980s

net/mpls/t_mpls_fw

4.928688s

mplsfw4

Passed

N/A

2.463667s

mplsfw4_expl

Passed

N/A

2.456621s

net/mpls/t_mpls_fw6

5.286651s

mplsfw6

Passed

N/A

2.697732s

mplsfw6_expl

Passed

N/A

2.580687s

net/mpls/t_mpls_fw64

5.482659s

mplsfw64_expl

Passed

N/A

2.751385s

mplsfw64_impl

Passed

N/A

2.717393s

net/mpls/t_rfc4182

2.489094s

rfc4182

Passed

N/A

2.483731s

net/mpls/t_ldp_regen

23.414240s

ldp_regen

Passed

N/A

23.409596s

net/ndp/t_dad

28.982240s

dad_basic

Passed

N/A

5.542100s

dad_count

Passed

N/A

16.291354s

dad_duplicated

Passed

N/A

7.140095s

net/ndp/t_ndp

67.512869s

ndp_cache_expiration

Passed

N/A

41.667180s

ndp_cache_overwriting

Passed

N/A

5.261948s

ndp_commands

Passed

N/A

7.646624s

ndp_link_activation

Passed

N/A

7.446733s

ndp_neighborgcthresh

Passed

N/A

5.477758s

net/ndp/t_ra

143.993994s

ra_basic

Passed

N/A

23.465862s

ra_delete_address

Passed

N/A

14.849381s

ra_flush_defrouter_entries

Passed

N/A

7.857065s

ra_flush_prefix_entries

Passed

N/A

8.102587s

ra_multiple_routers

Passed

N/A

25.802831s

ra_multiple_routers_maxifprefixes

Passed

N/A

37.738212s

ra_multiple_routers_single_prefix

Passed

N/A

26.159597s

net/npf/t_npf

2.185178s

npf_bpf

Passed

N/A

0.405194s

npf_nat

Passed

N/A

0.340008s

npf_nbuf

Passed

N/A

0.349521s

npf_rule

Passed

N/A

0.338003s

npf_state

Passed

N/A

0.345280s

npf_table

Failed

atf-check failed; see the output of the test for details

0.394452s

net/route/t_change

3.858490s

route_change_gateway

Passed

N/A

0.714282s

route_change_ifa

Passed

N/A

0.838472s

route_change_ifp

Passed

N/A

0.885995s

route_change_ifp_ifa

Passed

N/A

0.813979s

route_change_reject2blackhole

Passed

N/A

0.596292s

net/route/t_flags

22.073268s

route_flags_announce

Passed

N/A

1.356550s

route_flags_blackhole

Passed

N/A

2.505541s

route_flags_connected

Passed

N/A

1.321087s

route_flags_default_gateway

Passed

N/A

1.295146s

route_flags_icmp_redirect

Passed

N/A

8.027368s

route_flags_lo

Passed

N/A

1.294953s

route_flags_reject

Passed

N/A

4.837460s

route_flags_static

Passed

N/A

1.413319s

net/route/t_flags6

13.321757s

route_flags_announce6

Passed

N/A

1.358166s

route_flags_blackhole6

Passed

N/A

2.503265s

route_flags_connected6

Passed

N/A

1.389632s

route_flags_default_gateway6

Passed

N/A

1.343411s

route_flags_lo6

Passed

N/A

1.380549s

route_flags_reject6

Passed

N/A

3.878788s

route_flags_static6

Passed

N/A

1.449439s

net/route/t_route

7.210736s

route_command_get

Passed

N/A

2.372343s

route_command_get6

Passed

N/A

2.392945s

route_non_subnet_gateway

Passed

N/A

2.430760s

net/if_vlan/t_vlan

12.085034s

vlan_basic

Passed

N/A

11.458028s

vlan_create_destroy

Passed

N/A

0.623703s

sbin/fsck_ffs/t_enable_quotas

11.612718s

corrupt_be_1

Passed

N/A

0.905107s

corrupt_be_2

Passed

N/A

0.585583s

corrupt_le_1

Passed

N/A

0.616405s

corrupt_le_2

Passed

N/A

0.597846s

dir1_be_1

Passed

N/A

0.493360s

dir1_be_2

Passed

N/A

0.472073s

dir1_le_1

Passed

N/A

0.465469s

dir1_le_2

Passed

N/A

0.435508s

disable_be_1

Passed

N/A

0.649395s

disable_be_2

Passed

N/A

0.646023s

disable_le_1

Passed

N/A

0.623463s

disable_le_2

Passed

N/A

0.632264s

notreg_be_1

Passed

N/A

0.575912s

notreg_be_2

Passed

N/A

0.579459s

notreg_le_1

Passed

N/A

0.584921s

notreg_le_2

Passed

N/A

0.574009s

unallocated_be_1

Passed

N/A

0.574409s

unallocated_be_2

Passed

N/A

0.507646s

unallocated_le_1

Passed

N/A

0.557700s

unallocated_le_2

Passed

N/A

0.506638s

sbin/fsck_ffs/t_check_quotas

31.343073s

corrupt_list_be_1

Passed

N/A

0.625387s

corrupt_list_be_2

Passed

N/A

0.616908s

corrupt_list_le_1

Passed

N/A

0.604029s

corrupt_list_le_2

Passed

N/A

0.609173s

expand1_list_be_1

Passed

N/A

0.751954s

expand1_list_be_2

Passed

N/A

0.653867s

expand1_list_le_1

Passed

N/A

0.712337s

expand1_list_le_2

Passed

N/A

0.694138s

expand2_list_be_1

Passed

N/A

6.357418s

expand2_list_be_2

Passed

N/A

6.275244s

expand2_list_le_1

Passed

N/A

6.350209s

expand2_list_le_2

Passed

N/A

6.298681s

sbin/gpt/t_gpt

4.377443s

backup_2part

Passed

N/A

0.463134s

bootable_2part

Skipped

Required file '/usr/mdec/gptmbr.bin' not found

0.000510s

change_attr_2part

Passed

N/A

0.435213s

change_type_2part

Passed

N/A

0.462741s

create_2part

Passed

N/A

0.315262s

create_empty

Passed

N/A

0.204159s

label_2part

Passed

N/A

0.335368s

migrate_disklabel

Failed

atf-check failed; see the output of the test for details

0.255723s

recover_backup

Failed

atf-check failed; see the output of the test for details

0.314775s

recover_primary

Passed

N/A

0.376208s

remove_2part

Passed

N/A

0.322786s

resize_2part

Passed

N/A

0.421186s

restore_2part

Passed

N/A

0.458124s

sbin/ifconfig/t_nonexistent

0.133184s

nonexistent

Passed

N/A

0.132605s

sbin/newfs/t_enable_quotas

2.961471s

enabled_be_1_both

Passed

N/A

0.268422s

enabled_be_1_group

Passed

N/A

0.244661s

enabled_be_1_user

Passed

N/A

0.250964s

enabled_be_2_both

Passed

N/A

0.237357s

enabled_be_2_group

Passed

N/A

0.239128s

enabled_be_2_user

Passed

N/A

0.231128s

enabled_le_1_both

Passed

N/A

0.244650s

enabled_le_1_group

Passed

N/A

0.245266s

enabled_le_1_user

Passed

N/A

0.261999s

enabled_le_2_both

Passed

N/A

0.232594s

enabled_le_2_group

Passed

N/A

0.244550s

enabled_le_2_user

Passed

N/A

0.242684s

sbin/newfs_msdos/t_create

0.236637s

validfat32

Passed

N/A

0.234302s

sbin/resize_ffs/t_check

0.442569s

check_grow

Passed

N/A

0.438444s

sbin/resize_ffs/t_grow

32.577059s

grow_16M_v0_8192

Passed

N/A

10.745176s

grow_16M_v1_16384

Passed

N/A

10.893060s

grow_16M_v2_32768

Passed

N/A

10.507200s

grow_ffsv1_partial_cg

Passed

N/A

0.348819s

sbin/resize_ffs/t_shrink

38.879890s

shrink_24M_16M_v0_32768

Passed

N/A

14.305458s

shrink_24M_16M_v1_65536

Passed

N/A

12.958479s

shrink_24M_16M_v2_4096

Expected failure

PR bin/44205: atf-check failed; see the output of the test for details

11.152219s

shrink_ffsv1_partial_cg

Passed

N/A

0.384620s

sbin/resize_ffs/t_grow_swapped

31.729427s

grow_16M_v0_65536

Passed

N/A

9.900053s

grow_16M_v1_4096

Passed

N/A

10.705108s

grow_16M_v2_8192

Passed

N/A

10.669327s

grow_ffsv1_partial_cg

Passed

N/A

0.372640s

sbin/resize_ffs/t_shrink_swapped

40.836428s

shrink_24M_16M_v0_4096

Passed

N/A

14.325848s

shrink_24M_16M_v1_8192

Passed

N/A

14.638970s

shrink_24M_16M_v2_16384

Expected failure

PR bin/44205: atf-check failed; see the output of the test for details

11.404094s

shrink_ffsv1_partial_cg

Passed

N/A

0.386624s

sbin/route/t_missing

0.125071s

missing

Passed

N/A

0.124307s

sbin/sysctl/t_perm

24.573749s

sysctl_ddb

Passed

N/A

0.632640s

sysctl_hw

Passed

N/A

3.318149s

sysctl_kern

Passed

N/A

6.209183s

sysctl_machdep

Passed

N/A

0.476723s

sysctl_net

Passed

N/A

10.526018s

sysctl_security

Passed

N/A

1.451488s

sysctl_vfs

Passed

N/A

0.910678s

sysctl_vm

Passed

N/A

1.040762s

sbin/sysctl/t_sysctl

0.243124s

basic

Passed

N/A

0.242554s

sys/net/t_print

0.024351s

dl_print

Passed

N/A

0.011706s

sdl_print

Passed

N/A

0.011561s

sys/netatalk/t_print

0.025350s

at_print

Passed

N/A

0.011637s

sat_print

Passed

N/A

0.012641s

sys/netinet/t_print

0.025890s

in_print

Passed

N/A

0.012924s

sin_print

Passed

N/A

0.011891s

sys/netinet6/t_print

0.027230s

in6_print

Passed

N/A

0.013418s

sin6_print

Passed

N/A

0.012347s

sys/rc/t_rc_d_cli

3.978690s

default_restart_no_args

Passed

N/A

0.478527s

default_restart_with_args

Passed

N/A

0.407697s

default_start_no_args

Passed

N/A

0.319403s

default_start_with_args

Passed

N/A

0.267255s

default_stop_no_args

Passed

N/A

0.313513s

default_stop_with_args

Passed

N/A

0.392053s

no_command

Passed

N/A

0.163862s

overriden_custom_no_args

Passed

N/A

0.195942s

overriden_custom_with_args

Passed

N/A

0.207193s

overriden_restart_no_args

Passed

N/A

0.197971s

overriden_restart_with_args

Passed

N/A

0.205106s

overriden_start_no_args

Passed

N/A

0.201074s

overriden_start_with_args

Passed

N/A

0.207838s

overriden_stop_no_args

Passed

N/A

0.201779s

overriden_stop_with_args

Passed

N/A

0.206200s

usr.bin/awk/t_awk

3.969565s

assign_NF

Passed

N/A

0.176622s

big_regexp

Passed

N/A

0.175797s

empty_rs

Passed

N/A

0.143545s

end

Passed

N/A

0.245452s

modify_subsep

Passed

N/A

0.143149s

multibyte

Passed

N/A

0.304919s

newline_rs

Passed

N/A

0.147400s

period

Passed

N/A

0.173670s

regex_caret_1_rs

Passed

N/A

0.149153s

regex_caret_2_rs

Passed

N/A

0.151053s

regex_dollar_1_rs

Passed

N/A

0.146831s

regex_dollar_2_rs

Passed

N/A

0.147887s

regex_or_1_rs

Passed

N/A

0.148136s

regex_or_2_rs

Passed

N/A

0.142363s

regex_or_3_rs

Passed

N/A

0.168853s

regex_reallocation_rs

Passed

N/A

0.192070s

regex_two_star_rs

Passed

N/A

0.144314s

single_char_regex_group_rs

Passed

N/A

0.144137s

single_char_regex_star_rs

Passed

N/A

0.151516s

single_char_rs

Passed

N/A

0.140035s

string1

Passed

N/A

0.169809s

two_char_regex_group_rs

Passed

N/A

0.149952s

two_char_regex_star_rs

Passed

N/A

0.143856s

two_char_rs

Passed

N/A

0.148731s

usr.bin/basename/t_basename

0.535333s

basic

Passed

N/A

0.324451s

suffix

Passed

N/A

0.209538s

usr.bin/bzip2/t_bzip2

1.023304s

basic

Passed

N/A

1.022547s

usr.bin/cc/t_hello

6.966330s

hello

Passed

N/A

3.643290s

hello32

Passed

N/A

1.937108s

hello_pic

Passed

N/A

0.789324s

hello_pie

Passed

N/A

0.590346s

usr.bin/cmp/t_cmp

0.465351s

missing

Passed

N/A

0.250776s

skip

Passed

N/A

0.212677s

usr.bin/config/t_config

2.388201s

deffs_redef

Passed

N/A

0.264137s

devi

Passed

N/A

0.256504s

loop

Passed

N/A

0.168295s

loop2

Passed

N/A

0.157249s

min

Passed

N/A

0.193812s

no_pseudo

Passed

N/A

0.150679s

no_select

Passed

N/A

0.183761s

no_undefined_opt

Passed

N/A

0.156501s

postponed_orphan

Passed

N/A

0.150851s

pseudo_parent

Passed

N/A

0.173159s

select

Passed

N/A

0.184275s

shadow_instance

Passed

N/A

0.159981s

undefined_opt

Passed

N/A

0.151919s

usr.bin/cut/t_cut

1.206459s

basic

Passed

N/A

0.217289s

dflag

Passed

N/A

0.219000s

dsflag

Passed

N/A

0.218836s

latin1

Passed

N/A

0.161685s

sflag

Passed

N/A

0.216933s

utf8

Passed

N/A

0.168157s

usr.bin/diff/t_diff

0.425945s

mallocv

Passed

N/A

0.144323s

nomallocv

Passed

N/A

0.137037s

same

Passed

N/A

0.142484s

usr.bin/dirname/t_dirname

0.372130s

basic

Passed

N/A

0.371366s

usr.bin/find/t_find

0.792473s

emptyperm

Passed

N/A

0.515347s

exit

Passed

N/A

0.135556s

exit_status

Passed

N/A

0.138823s

usr.bin/gdb/t_regress

12.187136s

pie

Passed

N/A

3.956192s

threads

Passed

N/A

8.228162s

usr.bin/grep/t_grep

2.610883s

basic

Passed

N/A

0.192777s

begin_end

Passed

N/A

0.180598s

binary

Passed

N/A

0.149944s

context

Passed

N/A

0.245602s

context2

Passed

N/A

0.208315s

egrep

Passed

N/A

0.138738s

file_exp

Passed

N/A

0.159742s

ignore_case

Passed

N/A

0.133683s

invert

Passed

N/A

0.143899s

negative

Passed

N/A

0.134867s

nonexistent

Passed

N/A

0.131530s

recurse

Passed

N/A

0.146689s

recurse_symlink

Passed

N/A

0.158133s

whole_line

Passed

N/A

0.141769s

word_regexps

Passed

N/A

0.141660s

zgrep

Passed

N/A

0.186229s

usr.bin/gzip/t_gzip

4.288876s

concatenated

Passed

N/A

0.154382s

crcerror

Passed

N/A

0.142898s

good

Passed

N/A

0.140048s

pipe

Passed

N/A

3.702479s

truncated

Passed

N/A

0.144179s

usr.bin/id/t_groups

0.504369s

correct

Passed

N/A

0.321844s

syntax

Passed

N/A

0.180144s

usr.bin/id/t_id

4.707830s

Gflag

Passed

N/A

0.600490s

default

Passed

N/A

0.451689s

gflag

Passed

N/A

1.101389s

pflag

Passed

N/A

0.457472s

primaries

Passed

N/A

0.909423s

uflag

Passed

N/A

1.178157s

usr.bin/id/t_whoami

0.398437s

correct

Passed

N/A

0.196176s

syntax

Passed

N/A

0.199570s

usr.bin/infocmp/t_terminfo

0.666518s

basic

Passed

N/A

0.469448s

missing

Passed

N/A

0.195449s

usr.bin/jot/t_jot

0.330279s

basic

Passed

N/A

0.138131s

format

Passed

N/A

0.190438s

usr.bin/ld/t_script

4.894939s

multisec

Passed

N/A

0.706019s

order_default

Passed

N/A

1.011354s

order_merge

Passed

N/A

1.174040s

order_reorder

Passed

N/A

0.994050s

order_sort

Passed

N/A

0.994603s

usr.bin/ld/t_section

0.841505s

orphan

Passed

N/A

0.442664s

startstop

Passed

N/A

0.396348s

usr.bin/m4/t_m4

0.254543s

eof

Passed

N/A

0.253230s

usr.bin/make/t_make

42.357007s

comment

Passed

N/A

0.962244s

cond1

Passed

N/A

0.829203s

cond2

Passed

N/A

0.799492s

doterror

Passed

N/A

0.803280s

dotwait

Passed

N/A

12.130999s

error

Passed

N/A

0.774431s

escape

Expected failure

see PR toolchain/49085: atf-check failed; see the output of the test for details

0.961011s

export

Passed

N/A

0.841901s

export_all

Passed

N/A

0.808379s

export_env

Passed

N/A

0.806658s

forloop

Passed

N/A

0.897361s

forsubst

Passed

N/A

0.777289s

hash

Passed

N/A

0.818241s

impsrc

Expected failure

see PR toolchain/49085: atf-check failed; see the output of the test for details

0.900250s

misc

Passed

N/A

0.772715s

moderrs

Passed

N/A

0.955528s

modmatch

Passed

N/A

0.955586s

modmisc

Passed

N/A

0.837162s

modorder

Passed

N/A

0.845999s

modts

Passed

N/A

0.946528s

modword

Passed

N/A

1.599826s

order

Passed

N/A

0.801574s

phony_end

Expected failure

see PR toolchain/49085: atf-check failed; see the output of the test for details

0.813147s

posix

Passed

N/A

0.886382s

posix1

Expected failure

see PR toolchain/49085: atf-check failed; see the output of the test for details

1.382067s

qequals

Passed

N/A

0.933625s

suffixes

Expected failure

see PR toolchain/49085: this uses up all memory and then fails

0.527249s

sunshcmd

Passed

N/A

0.849752s

sysv

Passed

N/A

0.819529s

ternary

Passed

N/A

0.888367s

unexport

Passed

N/A

0.827127s

unexport_env

Passed

N/A

0.827501s

varcmd

Passed

N/A

0.950173s

varmisc

Passed

N/A

0.911005s

varshell

Passed

N/A

0.869911s

usr.bin/mkdep/t_mkdep

1.091157s

prefix

Passed

N/A

0.281525s

prefix_and_suffixes

Passed

N/A

0.264119s

suffixes

Passed

N/A

0.542742s

usr.bin/nbperf/t_nbperf

36.986020s

bdz

Passed

N/A

13.421150s

chm

Passed

N/A

13.061941s

chm3

Passed

N/A

10.483098s

usr.bin/netpgpverify/t_netpgpverify

6.108115s

netpgpverify_testset_1_rsa_signatures

Passed

N/A

2.175476s

netpgpverify_testset_2_dsa_signatures

Passed

N/A

3.921030s

usr.bin/pr/t_basic

0.174983s

basic

Passed

N/A

0.174293s

usr.bin/rump_server/t_disk

2.955052s

data

Passed

N/A

0.445979s

notrunc

Passed

N/A

0.356067s

offset

Passed

N/A

0.352848s

size

Passed

N/A

0.363937s

type_blk

Passed

N/A

0.356096s

type_blk_default

Passed

N/A

0.357404s

type_chr

Passed

N/A

0.354061s

type_reg

Passed

N/A

0.358895s

usr.bin/shmif_dumpbus/t_basic

4.956217s

contents

Passed

N/A

0.358904s

header

Passed

N/A

0.230505s

pcap

Passed

N/A

4.353030s

usr.bin/sdiff/t_sdiff

3.318092s

dot

Passed

N/A

0.207643s

flags

Passed

N/A

0.262493s

iflags

Passed

N/A

0.536881s

merge

Passed

N/A

1.191754s

oneline

Passed

N/A

0.196709s

same

Passed

N/A

0.141394s

short

Passed

N/A

0.167269s

stdin

Passed

N/A

0.208968s

tabends

Passed

N/A

0.241446s

tabs

Passed

N/A

0.155504s

usr.bin/sed/t_sed

1.359084s

c2048

Passed

N/A

0.147472s

emptybackref

Expected failure

PR bin/28126: atf-check failed; see the output of the test for details

0.200268s

longlines

Passed

N/A

0.201024s

preserve_leading_ws_ia

Passed

N/A

0.141225s

rangeselection

Passed

N/A

0.664291s

usr.bin/sort/t_sort

8.586160s

any_char

Passed

N/A

0.226164s

basic

Passed

N/A

0.147809s

bflag

Passed

N/A

0.221893s

cflag

Passed

N/A

0.147372s

empty_file

Passed

N/A

0.205252s

end_of_options

Passed

N/A

0.178022s

kflag_alpha

Passed

N/A

0.611700s

kflag_limits

Passed

N/A

0.151504s

kflag_many_fields

Passed

N/A

0.154401s

kflag_no_end

Passed

N/A

0.157210s

kflag_nonmonotone

Passed

N/A

0.145614s

kflag_one_field

Passed

N/A

0.152005s

kflag_outofbounds

Passed

N/A

0.143829s

kflag_two_fields

Passed

N/A

0.151887s

long_file

Passed

N/A

0.546801s

long_records

Passed

N/A

0.203744s

mflag

Passed

N/A

0.162187s

mflag_uflag

Passed

N/A

0.148456s

mflag_uflag_first

Passed

N/A

0.191502s

missing_newline

Passed

N/A

0.143715s

nflag

Passed

N/A

0.154689s

nflag_rflag

Passed

N/A

0.156223s

null_bytes

Passed

N/A

0.141838s

oflag

Passed

N/A

0.188510s

oflag_displaced

Passed

N/A

0.139828s

plus_as_path

Passed

N/A

0.147246s

plus_bad_tempfile

Passed

N/A

0.138312s

plus_no_end

Passed

N/A

0.156943s

plus_nonmonotone

Passed

N/A

0.146616s

plus_one

Passed

N/A

0.150227s

plus_one_minus_two

Passed

N/A

0.156904s

plus_rflag_invalid

Passed

N/A

0.146063s

plus_tflag

Passed

N/A

0.695537s

plus_zero

Passed

N/A

0.141663s

rflag

Passed

N/A

0.153335s

sflag

Passed

N/A

0.156280s

sflag_many_files

Passed

N/A

0.163897s

tflag

Passed

N/A

0.229241s

tflag_alphabetic

Passed

N/A

0.139824s

tflag_char_pos

Passed

N/A

0.239106s

tflag_whitespace

Passed

N/A

0.313181s

uflag

Passed

N/A

0.145817s

uflag_rflag

Passed

N/A

0.147772s

usr.bin/tmux/t_tmux

2.134119s

stdin

Passed

N/A

2.133282s

usr.bin/tr/t_basic

3.712079s

csubst

Passed

N/A

0.231233s

dopt

Passed

N/A

1.491172s

dsopt

Passed

N/A

0.659020s

sopt

Passed

N/A

0.635386s

subst

Passed

N/A

0.691550s

usr.bin/unifdef/t_basic

0.329425s

basic

Passed

N/A

0.168874s

lastline

Passed

N/A

0.158844s

usr.bin/uniq/t_uniq

0.676767s

basic

Passed

N/A

0.139072s

show_duplicates

Passed

N/A

0.128277s

show_duplicates_from_third_character

Passed

N/A

0.136249s

show_uniques

Passed

N/A

0.136100s

test_counts

Passed

N/A

0.133756s

usr.bin/vmstat/t_vmstat

0.299544s

default

Passed

N/A

0.160618s

opt_s

Passed

N/A

0.137356s

usr.bin/xlint/lint1/t_integration

6.126439s

alignof

Passed

N/A

0.251041s

c99_complex_num

Passed

N/A

0.153920s

c99_complex_split

Passed

N/A

0.159338s

c99_decls_after_stmt

Passed

N/A

0.157854s

c99_decls_after_stmt3

Passed

N/A

0.160667s

c99_for_loops

Passed

N/A

0.155644s

c99_func

Passed

N/A

0.163669s

c99_recursive_init

Passed

N/A

0.154878s

c99_struct_init

Passed

N/A

0.160244s

c99_union_init1

Passed

N/A

0.159687s

c99_union_init2

Passed

N/A

0.157234s

c99_union_init3

Passed

N/A

0.154411s

c9x_array_init

Passed

N/A

0.161212s

c9x_recursive_init

Passed

N/A

0.153008s

cast_init

Passed

N/A

0.164978s

cast_init2

Passed

N/A

0.161199s

cast_lhs

Passed

N/A

0.152879s

compound_literals1

Passed

N/A

0.158255s

compound_literals2

Passed

N/A

0.155034s

constant_conv1

Passed

N/A

0.158906s

constant_conv2

Passed

N/A

0.159087s

cvt_in_ternary

Passed

N/A

0.156801s

ellipsis_in_switch

Passed

N/A

0.158707s

gcc_compound_statements1

Passed

N/A

0.157682s

gcc_compound_statements2

Passed

N/A

0.159178s

gcc_compound_statements3

Passed

N/A

0.157033s

gcc_func

Passed

N/A

0.153466s

gcc_variable_array_init

Passed

N/A

0.159849s

incorrect_array_size

Passed

N/A

0.157763s

long_double_int

Passed

N/A

0.154699s

nested_structs

Passed

N/A

0.157590s

nolimit_init

Passed

N/A

0.160398s

packed_structs

Passed

N/A

0.159794s

shift_to_narrower_type

Passed

N/A

0.157658s

type_conv1

Passed

N/A

0.161197s

type_conv2

Passed

N/A

0.159043s

type_conv3

Passed

N/A

0.157567s

zero_sized_arrays

Passed

N/A

0.157340s

usr.sbin/mtree/t_mtree

2.724756s

mtree_check

Passed

N/A

0.191328s

mtree_convert_C

Passed

N/A

0.125486s

mtree_convert_C_S

Passed

N/A

0.121746s

mtree_convert_D

Passed

N/A

0.116630s

mtree_convert_D_S

Passed

N/A

0.115454s

mtree_create

Passed

N/A

0.158068s

mtree_ignore

Passed

N/A

0.202212s

mtree_merge

Passed

N/A

0.140564s

mtree_nonemptydir

Passed

N/A

0.174970s

netbsd6_check

Passed

N/A

0.163792s

netbsd6_convert_C

Passed

N/A

0.121118s

netbsd6_convert_C_S

Passed

N/A

0.121247s

netbsd6_convert_D

Passed

N/A

0.117592s

netbsd6_convert_D_S

Passed

N/A

0.118176s

netbsd6_create

Passed

N/A

0.167047s

netbsd6_ignore

Passed

N/A

0.215686s

netbsd6_merge

Passed

N/A

0.149218s

netbsd6_nonemptydir

Passed

N/A

0.173524s

usr.sbin/tcpdump/t_tcpdump

10.239137s

promiscuous

Passed

N/A

10.238509s

usr.sbin/traceroute/t_traceroute

2.908071s

basic

Passed

N/A

1.451233s

basic_icmp

Passed

N/A

1.450667s

usr.sbin/useradd/t_useradd

0.352519s

longname

Expected failure

PR bin/39546: atf-check failed; see the output of the test for details

0.351947s

fs/ffs/t_fifos

0.182671s

fifos

Passed

N/A

0.182073s

fs/ffs/t_snapshot

5.485528s

snapshot

Passed

N/A

0.923576s

snapshotstress

Passed

N/A

4.560396s

fs/ffs/t_snapshot_log

5.698897s

snapshot

Passed

N/A

1.074951s

snapshotstress

Passed

N/A

4.622516s

fs/ffs/t_snapshot_v2

5.507935s

snapshot

Passed

N/A

0.943305s

snapshotstress

Passed

N/A

4.563194s

fs/ffs/t_mount

0.410745s

48Kimage

Expected failure

PR kern/43573: mount failed: Invalid argument

0.117690s

fsbsizeovermaxbsize

Passed

N/A

0.144286s

fsbsizeovermaxphys

Passed

N/A

0.142978s

fs/ffs/t_quota2_1

7.147104s

quota_1000_O1_be

Passed

N/A

1.322210s

quota_1000_O1_le

Passed

N/A

1.478122s

quota_1000_O2_be

Passed

N/A

1.291475s

quota_1000_O2_le

Passed

N/A

1.455894s

quota_40_O1_be

Passed

N/A

0.273050s

quota_40_O1_le

Passed

N/A

0.262087s

quota_40_O1_log

Passed

N/A

0.250184s

quota_40_O2_be

Passed

N/A

0.268862s

quota_40_O2_le

Passed

N/A

0.269492s

quota_40_O2_log

Passed

N/A

0.255362s

fs/ffs/t_quota2_remount

0.469537s

quota_10_O1_be

Passed

N/A

0.234186s

quota_10_O1_le

Passed

N/A

0.233302s

fs/ffs/t_getquota

9.914249s

get_be_1_both

Passed

N/A

0.832600s

get_be_1_group

Passed

N/A

0.836060s

get_be_1_user

Passed

N/A

0.801283s

get_be_2_both

Passed

N/A

0.811117s

get_be_2_group

Passed

N/A

0.820335s

get_be_2_user

Passed

N/A

0.819383s

get_le_1_both

Passed

N/A

0.841879s

get_le_1_group

Passed

N/A

0.820029s

get_le_1_user

Passed

N/A

0.814958s

get_le_2_both

Passed

N/A

0.876768s

get_le_2_group

Passed

N/A

0.840435s

get_le_2_user

Passed

N/A

0.780549s

fs/ffs/t_setquota

35.325538s

set_be_1_both

Passed

N/A

1.021414s

set_be_1_group

Passed

N/A

0.992673s

set_be_1_user

Passed

N/A

1.030533s

set_be_2_both

Passed

N/A

0.983801s

set_be_2_group

Passed

N/A

0.985878s

set_be_2_user

Passed

N/A

0.951040s

set_default_be_1_both

Passed

N/A

0.830164s

set_default_be_1_group

Passed

N/A

0.812656s

set_default_be_1_user

Passed

N/A

0.804514s

set_default_be_2_both

Passed

N/A

0.845545s

set_default_be_2_group

Passed

N/A

0.823593s

set_default_be_2_user

Passed

N/A

0.833689s

set_default_le_1_both

Passed

N/A

0.801955s

set_default_le_1_group

Passed

N/A

0.789042s

set_default_le_1_user

Passed

N/A

0.842498s

set_default_le_2_both

Passed

N/A

0.822318s

set_default_le_2_group

Passed

N/A

0.814564s

set_default_le_2_user

Passed

N/A

0.844937s

set_le_1_both

Passed

N/A

0.971374s

set_le_1_group

Passed

N/A

1.006795s

set_le_1_user

Passed

N/A

0.958296s

set_le_2_both

Passed

N/A

0.965672s

set_le_2_group

Passed

N/A

0.999498s

set_le_2_user

Passed

N/A

0.967630s

set_new_be_1_both

Passed

N/A

0.814643s

set_new_be_1_both_log

Passed

N/A

0.851029s

set_new_be_1_group

Passed

N/A

0.834548s

set_new_be_1_user

Passed

N/A

0.869082s

set_new_be_2_both

Passed

N/A

0.834321s

set_new_be_2_both_log

Passed

N/A

0.842100s

set_new_be_2_group

Passed

N/A

0.827466s

set_new_be_2_user

Passed

N/A

0.837162s

set_new_le_1_both

Passed

N/A

0.868189s

set_new_le_1_both_log

Passed

N/A

0.879455s

set_new_le_1_group

Passed

N/A

0.843040s

set_new_le_1_user

Passed

N/A

0.871405s

set_new_le_2_both

Passed

N/A

0.808962s

set_new_le_2_both_log

Passed

N/A

0.847302s

set_new_le_2_group

Passed

N/A

0.884236s

set_new_le_2_user

Passed

N/A

0.846753s

fs/ffs/t_quotalimit

26.069338s

herit_defq_le_1_group

Passed

N/A

1.067835s

herit_defq_le_1_group_log

Passed

N/A

1.055231s

herit_defq_le_1_user

Passed

N/A

1.010783s

herit_defq_le_1_user_log

Passed

N/A

1.020055s

herit_idefq_le_1_group_log

Passed

N/A

1.064339s

herit_idefq_le_1_user_log

Passed

N/A

1.038639s

inolimit_le_1_group

Passed

N/A

0.998731s

inolimit_le_1_group_log

Passed

N/A

0.981912s

inolimit_le_1_user

Passed

N/A

0.960674s

inolimit_le_1_user_log

Passed

N/A

0.989216s

limit_le_1_group

Passed

N/A

0.972688s

limit_le_1_group_log

Passed

N/A

0.991915s

limit_le_1_user

Passed

N/A

0.985945s

limit_le_1_user_log

Passed

N/A

1.004356s

sinolimit_le_1_group

Passed

N/A

2.953948s

sinolimit_le_1_user

Passed

N/A

3.003911s

slimit_le_1_group

Passed

N/A

2.981997s

slimit_le_1_user

Passed

N/A

2.957826s

fs/ffs/t_clearquota

14.693689s

clear_be_1_both

Passed

N/A

0.991375s

clear_be_1_both_log

Passed

N/A

1.008648s

clear_be_1_group

Passed

N/A

0.860074s

clear_be_1_user

Passed

N/A

0.837097s

clear_be_2_both

Passed

N/A

0.994245s

clear_be_2_both_log

Passed

N/A

0.996870s

clear_be_2_group

Passed

N/A

0.829141s

clear_be_2_user

Passed

N/A

0.853830s

clear_le_1_both

Passed

N/A

0.970770s

clear_le_1_both_log

Passed

N/A

1.002622s

clear_le_1_group

Passed

N/A

0.823117s

clear_le_1_user

Passed

N/A

0.847257s

clear_le_2_both

Passed

N/A

0.996916s

clear_le_2_both_log

Passed

N/A

0.958299s

clear_le_2_group

Passed

N/A

0.853637s

clear_le_2_user

Passed

N/A

0.843420s

fs/ffs/t_miscquota

21.973815s

default_deny_user

Passed

N/A

0.892516s

default_deny_user_big

Passed

N/A

8.295612s

log_unlink

Passed

N/A

0.843045s

log_unlink_remount

Passed

N/A

0.826084s

npsnapshot_unconf_user

Passed

N/A

1.470652s

npsnapshot_user

Passed

N/A

1.466343s

psnapshot_unconf_user

Passed

N/A

1.442529s

psnapshot_user

Passed

N/A

1.479891s

walk_list_user

Passed

N/A

5.241305s

fs/fifofs/t_fifo

0.607618s

parent_child

Passed

N/A

0.606806s

fs/hfs/t_pathconvert

0.136657s

colonslash

Passed

N/A

0.133356s

fs/kernfs/t_basic

0.128237s

getdents

Passed

N/A

0.063226s

hostname

Passed

N/A

0.063274s

fs/lfs/t_pr

0.254319s

mknod

Passed

N/A

0.242667s

fs/msdosfs/t_snapshot

5.381114s

snapshot

Passed

N/A

0.930211s

snapshotstress

Passed

N/A

4.449527s

fs/nfs/t_mountd

0.844548s

mountdhup

Expected failure

PR kern/5844: op failed with EACCES

0.839175s

fs/nfs/t_rquotad

14.529500s

get_nfs_be_1_both

Passed

N/A

2.631988s

get_nfs_be_1_group

Passed

N/A

2.395522s

get_nfs_be_1_user

Passed

N/A

2.222310s

get_nfs_le_1_both

Passed

N/A

2.594900s

get_nfs_le_1_group

Passed

N/A

2.392939s

get_nfs_le_1_user

Passed

N/A

2.266363s

fs/nullfs/t_basic

0.141497s

basic

Passed

N/A

0.072395s

twistymount

Passed

N/A

0.067384s

fs/psshfs/t_psshfs

8.053880s

inode_nos

Passed

N/A

1.957081s

ls

Passed

N/A

1.870401s

pwd

Passed

N/A

2.132942s

read_empty_file

Passed

N/A

2.076932s

fs/ptyfs/t_ptyfs

0.071430s

basic

Passed

N/A

0.070673s

fs/ptyfs/t_nullpts

0.073690s

nullrevoke

Passed

N/A

0.072868s

fs/puffs/t_basic

1.545693s

inactive_basic

Passed

N/A

0.164541s

inactive_reclaim

Passed

N/A

0.159642s

mount

Passed

N/A

0.148655s

reclaim_hardlink

Passed

N/A

0.159816s

root_chrdev

Passed

N/A

0.158520s

root_fifo

Passed

N/A

0.159270s

root_lnk

Passed

N/A

0.107937s

root_reg

Passed

N/A

0.150699s

signals

Passed

N/A

0.159239s

unlink_accessible

Passed

N/A

0.168994s

fs/puffs/t_fuzz

1.690975s

mountfuzz0

Passed

N/A

0.179308s

mountfuzz1

Passed

N/A

0.166162s

mountfuzz2

Passed

N/A

0.167723s

mountfuzz3

Passed

N/A

0.177231s

mountfuzz4

Passed

N/A

0.166680s

mountfuzz5

Passed

N/A

0.161378s

mountfuzz6

Passed

N/A

0.158145s

mountfuzz7

Passed

N/A

0.169976s

mountfuzz8

Passed

N/A

0.337232s

fs/puffs/t_io

0.186441s

nocache

Passed

N/A

0.185501s

fs/tmpfs/t_renamerace

4.071297s

renamerace2

Passed

N/A

4.070298s

fs/tmpfs/t_create

1.585132s

attrs

Passed

N/A

0.849342s

create

Passed

N/A

0.354707s

kqueue

Passed

N/A

0.378743s

fs/tmpfs/t_devices

0.483929s

basic

Passed

N/A

0.483198s

fs/tmpfs/t_dots

0.708222s

nesteddir

Passed

N/A

0.365569s

topdir

Passed

N/A

0.340922s

fs/tmpfs/t_exec

0.344477s

basic

Passed

N/A

0.343423s

fs/tmpfs/t_link

1.556306s

basic

Passed

N/A

0.483424s

kqueue

Passed

N/A

0.566428s

subdirs

Passed

N/A

0.503953s

fs/tmpfs/t_mkdir

10.786679s

attrs

Passed

N/A

0.730061s

kqueue

Passed

N/A

0.454908s

many

Passed

N/A

8.893511s

nested

Passed

N/A

0.355673s

single

Passed

N/A

0.348237s

fs/tmpfs/t_mknod

2.020361s

block

Passed

N/A

0.321398s

block_kqueue

Passed

N/A

0.387129s

char

Passed

N/A

0.292493s

char_kqueue

Passed

N/A

0.364027s

pipe

Passed

N/A

0.293472s

pipe_kqueue

Passed

N/A

0.356028s

fs/tmpfs/t_mount

1.659901s

attrs

Passed

N/A

0.280274s

large

Passed

N/A

0.343523s

mntpt

Passed

N/A

0.248056s

negative

Passed

N/A

0.258647s

options

Passed

N/A

0.268749s

plain

Passed

N/A

0.255226s

fs/tmpfs/t_pipes

0.299650s

basic

Passed

N/A

0.298694s

fs/tmpfs/t_read_write

0.776644s

basic

Passed

N/A

0.329005s

kqueue

Passed

N/A

0.445753s

fs/tmpfs/t_readdir

4.494794s

caching

Passed

N/A

0.420575s

dots

Passed

N/A

0.333710s

many

Passed

N/A

3.201680s

types

Passed

N/A

0.535256s

fs/tmpfs/t_remove

1.677356s

dot

Passed

N/A

0.374564s

kqueue

Passed

N/A

0.448003s

single

Passed

N/A

0.411373s

uchg

Passed

N/A

0.439605s

fs/tmpfs/t_rename

5.167425s

basic

Passed

N/A

0.400655s

crossdev

Passed

N/A

0.424045s

dir_to_emptydir

Passed

N/A

0.464531s

dir_to_file

Passed

N/A

0.456547s

dir_to_fulldir

Passed

N/A

0.588025s

dotdot

Passed

N/A

0.982221s

dots

Passed

N/A

0.371263s

file_to_dir

Passed

N/A

0.462439s

kqueue

Passed

N/A

1.008216s

fs/tmpfs/t_rmdir

3.414061s

curdir

Passed

N/A

0.373594s

dots

Passed

N/A

0.378431s

kqueue

Passed

N/A

0.464387s

links

Passed

N/A

0.454970s

mntpt

Passed

N/A

0.278973s

nested

Passed

N/A

0.379363s

non_empty

Passed

N/A

0.446074s

non_existent

Passed

N/A

0.294964s

single

Passed

N/A

0.335213s

fs/tmpfs/t_setattr

3.610255s

chgrp

Passed

N/A

0.351682s

chgrp_kqueue

Passed

N/A

0.384997s

chmod

Passed

N/A

0.339619s

chmod_kqueue

Passed

N/A

0.380369s

chown

Passed

N/A

0.335457s

chown_kqueue

Passed

N/A

0.375057s

chowngrp

Passed

N/A

0.335709s

chowngrp_kqueue

Passed

N/A

0.387263s

chtimes

Passed

N/A

0.334349s

chtimes_kqueue

Passed

N/A

0.376590s

fs/tmpfs/t_sizes

1.920897s

big

Passed

N/A

0.451095s

overflow

Passed

N/A

0.526866s

overwrite

Passed

N/A

0.646738s

small

Passed

N/A

0.292747s

fs/tmpfs/t_sockets

0.432888s

basic

Passed

N/A

0.432108s

fs/tmpfs/t_statvfs

0.300356s

values

Passed

N/A

0.299311s

fs/tmpfs/t_symlink

1.679688s

dir

Passed

N/A

0.474720s

exec

Passed

N/A

0.385064s

file

Passed

N/A

0.377229s

kqueue

Passed

N/A

0.439257s

fs/tmpfs/t_times

6.478440s

empty

Passed

N/A

2.390553s

link

Passed

N/A

1.343298s

non_empty

Passed

N/A

1.339143s

rename

Passed

N/A

1.402020s

fs/tmpfs/t_trail_slash

0.408966s

main

Passed

N/A

0.408239s

fs/tmpfs/t_truncate

0.341968s

basic

Passed

N/A

0.341011s

fs/tmpfs/t_vnd

3.471848s

basic

Passed

N/A

3.470668s

fs/tmpfs/t_vnode_leak

21.430314s

main

Passed

N/A

21.429339s

fs/umapfs/t_basic

0.069920s

basic

Passed

N/A

0.069103s

fs/union/t_pr

0.243462s

devnull1

Passed

N/A

0.079856s

devnull2

Passed

N/A

0.081536s

multilayer

Passed

N/A

0.079934s

fs/vfs/t_full

10.307769s

ext2fs_fillfs

Passed

N/A

0.709010s

ffs_fillfs

Passed

N/A

0.455974s

ffslog_fillfs

Passed

N/A

0.424093s

lfs_fillfs

Passed

N/A

0.734435s

msdosfs_fillfs

Passed

N/A

0.433869s

nfs_fillfs

Passed

N/A

1.423602s

p2k_ffs_fillfs

Skipped

fs does not support explicit block allocation (GOP_ALLOC)

0.415389s

puffs_fillfs

Skipped

fs does not support explicit block allocation (GOP_ALLOC)

0.302988s

rumpfs_fillfs

Skipped

fs does not support explicit block allocation (GOP_ALLOC)

0.270146s

sysvbfs_fillfs

Passed

N/A

0.831970s

tmpfs_fillfs

Passed

N/A

0.358262s

udf_fillfs

Passed

N/A

1.139298s

v7fs_fillfs

Passed

N/A

2.695563s

fs/vfs/t_io

51.685510s

ext2fs_extendfile

Passed

N/A

0.314838s

ext2fs_extendfile_append

Passed

N/A

0.323665s

ext2fs_holywrite

Passed

N/A

0.332008s

ext2fs_overwrite512

Passed

N/A

0.327962s

ext2fs_overwrite64k

Passed

N/A

0.339650s

ext2fs_overwrite_trunc

Passed

N/A

0.347650s

ext2fs_read_after_unlink

Passed

N/A

0.334691s

ext2fs_read_fault

Passed

N/A

0.330505s

ext2fs_shrinkfile

Passed

N/A

0.333568s

ext2fs_wrrd_after_unlink

Passed

N/A

0.338458s

ffs_extendfile

Passed

N/A

0.352430s

ffs_extendfile_append

Passed

N/A

0.340578s

ffs_holywrite

Passed

N/A

0.340553s

ffs_overwrite512

Passed

N/A

0.316171s

ffs_overwrite64k

Passed

N/A

0.327154s

ffs_overwrite_trunc

Passed

N/A

0.333684s

ffs_read_after_unlink

Passed

N/A

0.346718s

ffs_read_fault

Passed

N/A

0.342940s

ffs_shrinkfile

Passed

N/A

0.324102s

ffs_wrrd_after_unlink

Passed

N/A

0.335118s

ffslog_extendfile

Passed

N/A

0.329288s

ffslog_extendfile_append

Passed

N/A

0.354678s

ffslog_holywrite

Passed

N/A

0.350814s

ffslog_overwrite512

Passed

N/A

0.333000s

ffslog_overwrite64k

Passed

N/A

0.344359s

ffslog_overwrite_trunc

Passed

N/A

0.361687s

ffslog_read_after_unlink

Passed

N/A

0.352227s

ffslog_read_fault

Passed

N/A

0.355007s

ffslog_shrinkfile

Passed

N/A

0.328262s

ffslog_wrrd_after_unlink

Passed

N/A

0.330935s

lfs_extendfile

Passed

N/A

0.422990s

lfs_extendfile_append

Passed

N/A

0.423482s

lfs_holywrite

Passed

N/A

0.427343s

lfs_overwrite512

Passed

N/A

0.427221s

lfs_overwrite64k

Passed

N/A

0.400278s

lfs_overwrite_trunc

Passed

N/A

0.407453s

lfs_read_after_unlink

Passed

N/A

0.426306s

lfs_read_fault

Passed

N/A

0.514296s

lfs_shrinkfile

Passed

N/A

0.395965s

lfs_wrrd_after_unlink

Passed

N/A

0.401688s

msdosfs_extendfile

Passed

N/A

0.317207s

msdosfs_extendfile_append

Passed

N/A

0.302255s

msdosfs_holywrite

Passed

N/A

0.333493s

msdosfs_overwrite512

Passed

N/A

0.328013s

msdosfs_overwrite64k

Passed

N/A

0.306626s

msdosfs_overwrite_trunc

Passed

N/A

0.328182s

msdosfs_read_after_unlink

Passed

N/A

0.308937s

msdosfs_read_fault

Passed

N/A

0.322256s

msdosfs_shrinkfile

Passed

N/A

0.310552s

msdosfs_wrrd_after_unlink

Passed

N/A

0.319516s

nfs_extendfile

Passed

N/A

0.658593s

nfs_extendfile_append

Passed

N/A

0.628890s

nfs_holywrite

Passed

N/A

0.652374s

nfs_overwrite512

Passed

N/A

0.631909s

nfs_overwrite64k

Passed

N/A

0.678334s

nfs_overwrite_trunc

Passed

N/A

0.693669s

nfs_read_after_unlink

Passed

N/A

0.640363s

nfs_read_fault

Passed

N/A

0.651127s

nfs_shrinkfile

Passed

N/A

0.662284s

nfs_wrrd_after_unlink

Passed

N/A

0.659191s

p2k_ffs_extendfile

Passed

N/A

0.466189s

p2k_ffs_extendfile_append

Passed

N/A

0.488153s

p2k_ffs_holywrite

Passed

N/A

0.488097s

p2k_ffs_overwrite512

Passed

N/A

0.447565s

p2k_ffs_overwrite64k

Passed

N/A

0.477889s

p2k_ffs_overwrite_trunc

Passed

N/A

0.478548s

p2k_ffs_read_after_unlink

Passed

N/A

0.487333s

p2k_ffs_read_fault

Passed

N/A

0.438737s

p2k_ffs_shrinkfile

Passed

N/A

0.457968s

p2k_ffs_wrrd_after_unlink

Passed

N/A

0.478022s

puffs_extendfile

Passed

N/A

0.357258s

puffs_extendfile_append

Passed

N/A

0.369729s

puffs_holywrite

Passed

N/A

0.358896s

puffs_overwrite512

Passed

N/A

0.359750s

puffs_overwrite64k

Passed

N/A

0.379495s

puffs_overwrite_trunc

Passed

N/A

0.378943s

puffs_read_after_unlink

Passed

N/A

0.379293s

puffs_read_fault

Passed

N/A

0.368791s

puffs_shrinkfile

Passed

N/A

0.379335s

puffs_wrrd_after_unlink

Passed

N/A

0.359575s

rumpfs_extendfile

Passed

N/A

0.301932s

rumpfs_extendfile_append

Passed

N/A

0.281709s

rumpfs_holywrite

Passed

N/A

0.279231s

rumpfs_overwrite512

Passed

N/A

0.297744s

rumpfs_overwrite64k

Passed

N/A

0.283260s

rumpfs_overwrite_trunc

Passed

N/A

0.282441s

rumpfs_read_after_unlink

Passed

N/A

0.281680s

rumpfs_read_fault

Passed

N/A

0.305160s

rumpfs_shrinkfile

Passed

N/A

0.305116s

rumpfs_wrrd_after_unlink

Passed

N/A

0.287595s

sysvbfs_extendfile

Passed

N/A

0.313231s

sysvbfs_extendfile_append

Passed

N/A

0.330236s

sysvbfs_holywrite

Passed

N/A

0.326006s

sysvbfs_overwrite512

Passed

N/A

0.306391s

sysvbfs_overwrite64k

Passed

N/A

0.332555s

sysvbfs_overwrite_trunc

Passed

N/A

0.337324s

sysvbfs_read_after_unlink

Passed

N/A

0.311519s

sysvbfs_read_fault

Passed

N/A

0.306396s

sysvbfs_shrinkfile

Passed

N/A

0.301253s

sysvbfs_wrrd_after_unlink

Passed

N/A

0.305481s

tmpfs_extendfile

Passed

N/A

0.308968s

tmpfs_extendfile_append

Passed

N/A

0.286148s

tmpfs_holywrite

Passed

N/A

0.283593s

tmpfs_overwrite512

Passed

N/A

0.287583s

tmpfs_overwrite64k

Passed

N/A

0.286101s

tmpfs_overwrite_trunc

Passed

N/A

0.290543s

tmpfs_read_after_unlink

Passed

N/A

0.309589s

tmpfs_read_fault

Passed

N/A

0.309490s

tmpfs_shrinkfile

Passed

N/A

0.286258s

tmpfs_wrrd_after_unlink

Passed

N/A

0.307942s

udf_extendfile

Passed

N/A

0.592253s

udf_extendfile_append

Passed

N/A

0.588394s

udf_holywrite

Passed

N/A

0.578534s

udf_overwrite512

Passed

N/A

0.588713s

udf_overwrite64k

Passed

N/A

0.588318s

udf_overwrite_trunc

Passed

N/A

0.587642s

udf_read_after_unlink

Passed

N/A

0.837637s

udf_read_fault

Passed

N/A

0.568557s

udf_shrinkfile

Passed

N/A

0.588942s

udf_wrrd_after_unlink

Passed

N/A

0.568345s

v7fs_extendfile

Passed

N/A

0.318041s

v7fs_extendfile_append

Passed

N/A

0.324973s

v7fs_holywrite

Passed

N/A

0.349942s

v7fs_overwrite512

Passed

N/A

0.343474s

v7fs_overwrite64k

Passed

N/A

0.370798s

v7fs_overwrite_trunc

Passed

N/A

0.375279s

v7fs_read_after_unlink

Passed

N/A

0.327532s

v7fs_read_fault

Passed

N/A

0.343385s

v7fs_shrinkfile

Passed

N/A

0.350485s

v7fs_wrrd_after_unlink

Passed

N/A

0.631526s

fs/vfs/t_renamerace

116.555531s

ext2fs_renamerace

Passed

N/A

5.338364s

ext2fs_renamerace_dirs

Passed

N/A

5.336246s

ffs_renamerace

Passed

N/A

5.346539s

ffs_renamerace_dirs

Passed

N/A

5.319662s

ffslog_renamerace

Passed

N/A

5.345776s

ffslog_renamerace_dirs

Passed

N/A

5.361726s

lfs_renamerace

Passed

N/A

5.802321s

lfs_renamerace_dirs

Passed

N/A

5.781264s

msdosfs_renamerace

Expected failure

PR kern/43626: unmount failed: Device busy

5.344805s

msdosfs_renamerace_dirs

Expected signal

PR kern/43626

0.643925s

nfs_renamerace

Passed

N/A

5.791915s

nfs_renamerace_dirs

Passed

N/A

5.671705s

p2k_ffs_renamerace

Passed

N/A

5.511522s

p2k_ffs_renamerace_dirs

Passed

N/A

5.466693s

puffs_renamerace

Passed

N/A

5.377321s

puffs_renamerace_dirs

Passed

N/A

5.579550s

rumpfs_renamerace

Skipped

rename not supported by file system

0.265575s

rumpfs_renamerace_dirs

Skipped

rename not supported by file system

0.270074s

sysvbfs_renamerace

Skipped

filesystem has not enough inodes

0.314524s

sysvbfs_renamerace_dirs

Skipped

directories not supported by file system

0.301944s

tmpfs_renamerace

Passed

N/A

5.315244s

tmpfs_renamerace_dirs

Passed

N/A

5.277537s

udf_renamerace

Expected failure

PR kern/49046: race did not trigger this time

5.311508s

udf_renamerace_dirs

Passed

N/A

5.586701s

v7fs_renamerace

Passed

N/A

5.392316s

v7fs_renamerace_dirs

Passed

N/A

5.357547s

fs/vfs/t_ro

29.616724s

ext2fs_attrs

Passed

N/A

0.332378s

ext2fs_create

Passed

N/A

0.315848s

ext2fs_createdir

Passed

N/A

0.323409s

ext2fs_createfifo

Passed

N/A

0.318483s

ext2fs_createlink

Passed

N/A

0.324727s

ext2fs_createsymlink

Passed

N/A

0.313686s

ext2fs_fileio

Passed

N/A

0.315195s

ext2fs_rmfile

Passed

N/A

0.309723s

ffs_attrs

Passed

N/A

0.328677s

ffs_create

Passed

N/A

0.307990s

ffs_createdir

Passed

N/A

0.321458s

ffs_createfifo

Passed

N/A

0.305779s

ffs_createlink

Passed

N/A

0.316573s

ffs_createsymlink

Passed

N/A

0.322462s

ffs_fileio

Passed

N/A

0.331455s

ffs_rmfile

Passed

N/A

0.344201s

ffslog_attrs

Passed

N/A

0.343510s

ffslog_create

Passed

N/A

0.326637s

ffslog_createdir

Passed

N/A

0.339653s

ffslog_createfifo

Passed

N/A

0.332059s

ffslog_createlink

Passed

N/A

0.347277s

ffslog_createsymlink

Passed

N/A

0.345843s

ffslog_fileio

Passed

N/A

0.345407s

ffslog_rmfile

Passed

N/A

0.324289s

msdosfs_attrs

Passed

N/A

0.297195s

msdosfs_create

Passed

N/A

0.295809s

msdosfs_createdir

Passed

N/A

0.306059s

msdosfs_createfifo

Passed

N/A

0.319176s

msdosfs_createlink

Passed

N/A

0.319687s

msdosfs_createsymlink

Passed

N/A

0.312964s

msdosfs_fileio

Passed

N/A

0.328226s

msdosfs_rmfile

Passed

N/A

0.322352s

nfs_attrs

Passed

N/A

0.648024s

nfs_create

Passed

N/A

0.616811s

nfs_createdir

Passed

N/A

0.634590s

nfs_createfifo

Passed

N/A

0.646784s

nfs_createlink

Passed

N/A

0.633941s

nfs_createsymlink

Passed

N/A

0.644925s

nfs_fileio

Passed

N/A

0.637471s

nfs_rmfile

Passed

N/A

0.701752s

nfsro_attrs

Passed

N/A

0.667973s

nfsro_create

Passed

N/A

0.634536s

nfsro_createdir

Passed

N/A

0.664588s

nfsro_createfifo

Passed

N/A

0.661880s

nfsro_createlink

Passed

N/A

0.656195s

nfsro_createsymlink

Passed

N/A

0.647574s

nfsro_fileio

Passed

N/A

0.654632s

nfsro_rmfile

Passed

N/A

0.624123s

sysvbfs_attrs

Passed

N/A

0.322584s

sysvbfs_create

Passed

N/A

0.299796s

sysvbfs_createdir

Passed

N/A

0.312634s

sysvbfs_createfifo

Passed

N/A

0.318375s

sysvbfs_createlink

Passed

N/A

0.313852s

sysvbfs_createsymlink

Passed

N/A

0.317521s

sysvbfs_fileio

Passed

N/A

0.321503s

sysvbfs_rmfile

Passed

N/A

0.298392s

udf_attrs

Passed

N/A

0.576815s

udf_create

Passed

N/A

0.315766s

udf_createdir

Passed

N/A

0.309164s

udf_createfifo

Passed

N/A

0.312011s

udf_createlink

Passed

N/A

0.585854s

udf_createsymlink

Passed

N/A

0.303668s

udf_fileio

Passed

N/A

0.563562s

udf_rmfile

Passed

N/A

0.587770s

v7fs_attrs

Passed

N/A

0.343487s

v7fs_create

Passed

N/A

0.332589s

v7fs_createdir

Passed

N/A

0.317633s

v7fs_createfifo

Passed

N/A

0.321244s

v7fs_createlink

Passed

N/A

0.336104s

v7fs_createsymlink

Passed

N/A

0.337399s

v7fs_fileio

Passed

N/A

0.341829s

v7fs_rmfile

Passed

N/A

0.343941s

fs/vfs/t_rmdirrace

125.172632s

ext2fs_race

Passed

N/A

10.317610s

ffs_race

Passed

N/A

10.316384s

ffslog_race

Passed

N/A

10.330774s

lfs_race

Passed

N/A

10.455245s

msdosfs_race

Passed

N/A

10.300353s

nfs_race

Passed

N/A

10.670775s

p2k_ffs_race

Passed

N/A

10.439353s

puffs_race

Passed

N/A

10.347991s

rumpfs_race

Passed

N/A

10.280194s

sysvbfs_race

Skipped

directories not supported by file system

0.311704s

tmpfs_race

Passed

N/A

10.287411s

udf_race

Passed

N/A

10.738690s

v7fs_race

Passed

N/A

10.338419s

fs/vfs/t_union

9.728684s

ext2fs_basic

Skipped

fs does not support VOP_WHITEOUT

0.304365s

ext2fs_whiteout

Skipped

fs does not support VOP_WHITEOUT

0.360282s

ffs_basic

Passed

N/A

0.312494s

ffs_whiteout

Passed

N/A

0.373500s

ffslog_basic

Passed

N/A

0.313632s

ffslog_whiteout

Passed

N/A

0.382197s

lfs_basic

Passed

N/A

0.434465s

lfs_whiteout

Passed

N/A

0.446420s

msdosfs_basic

Skipped

fs does not support VOP_WHITEOUT

0.316190s

msdosfs_whiteout

Skipped

fs does not support VOP_WHITEOUT

0.337362s

nfs_basic

Skipped

fs does not support VOP_WHITEOUT

0.628983s

nfs_whiteout

Skipped

fs does not support VOP_WHITEOUT

0.692994s

p2k_ffs_basic

Skipped

fs does not support VOP_WHITEOUT

0.400392s

p2k_ffs_whiteout

Skipped

fs does not support VOP_WHITEOUT

0.442323s

puffs_basic

Skipped

fs does not support VOP_WHITEOUT

0.314203s

puffs_whiteout

Skipped

fs does not support VOP_WHITEOUT

0.335087s

rumpfs_basic

Passed

N/A

0.291270s

rumpfs_whiteout

Passed

N/A

0.328081s

sysvbfs_basic

Skipped

fs does not support VOP_WHITEOUT

0.313196s

sysvbfs_whiteout

Skipped

fs does not support VOP_WHITEOUT

0.330641s

tmpfs_basic

Passed

N/A

0.287786s

tmpfs_whiteout

Passed

N/A

0.332420s

udf_basic

Skipped

fs does not support VOP_WHITEOUT

0.327767s

udf_whiteout

Skipped

fs does not support VOP_WHITEOUT

0.351002s

v7fs_basic

Skipped

fs does not support VOP_WHITEOUT

0.325036s

v7fs_whiteout

Skipped

fs does not support VOP_WHITEOUT

0.365768s

fs/vfs/t_unpriv

19.509806s

ext2fs_dirperms

Passed

N/A

0.469341s

ext2fs_flags

Passed

N/A

0.328030s

ext2fs_owner

Passed

N/A

0.297408s

ext2fs_times

Passed

N/A

0.313196s

ffs_dirperms

Passed

N/A

0.337070s

ffs_flags

Passed

N/A

0.338089s

ffs_owner

Passed

N/A

0.330294s

ffs_times

Passed

N/A

0.330378s

ffslog_dirperms

Passed

N/A

0.321158s

ffslog_flags

Passed

N/A

0.312748s

ffslog_owner

Passed

N/A

0.314749s

ffslog_times

Passed

N/A

0.327610s

lfs_dirperms

Passed

N/A

0.418269s

lfs_flags

Passed

N/A

0.423449s

lfs_owner

Passed

N/A

0.406024s

lfs_times

Passed

N/A

0.413813s

msdosfs_dirperms

Passed

N/A

0.299777s

msdosfs_flags

Passed

N/A

0.317462s

msdosfs_owner

Skipped

owner not supported by file system

0.307883s

msdosfs_times

Passed

N/A

0.296125s

nfs_dirperms

Passed

N/A

0.653863s

nfs_flags

Skipped

file flags not supported by file system

0.650881s

nfs_owner

Passed

N/A

0.619311s

nfs_times

Passed

N/A

0.678011s

p2k_ffs_dirperms

Passed

N/A

0.471073s

p2k_ffs_flags

Passed

N/A

0.447465s

p2k_ffs_owner

Passed

N/A

0.448294s

p2k_ffs_times

Passed

N/A

0.468622s

puffs_dirperms

Passed

N/A

0.357518s

puffs_flags

Skipped

file flags not supported by file system

0.314065s

puffs_owner

Passed

N/A

0.354195s

puffs_times

Passed

N/A

0.379737s

rumpfs_dirperms

Passed

N/A

0.272433s

rumpfs_flags

Passed

N/A

0.279825s

rumpfs_owner

Passed

N/A

0.298838s

rumpfs_times

Passed

N/A

0.299417s

sysvbfs_dirperms

Skipped

directories not supported by file system

0.286086s

sysvbfs_flags

Skipped

file flags not supported by file system

0.296479s

sysvbfs_owner

Passed

N/A

0.313474s

sysvbfs_times

Passed

N/A

0.293718s

tmpfs_dirperms

Passed

N/A

0.284883s

tmpfs_flags

Passed

N/A

0.302936s

tmpfs_owner

Passed

N/A

0.298330s

tmpfs_times

Passed

N/A

0.281033s

udf_dirperms

Passed

N/A

0.573001s

udf_flags

Skipped

file flags not supported by file system

0.315399s

udf_owner

Passed

N/A

0.326831s

udf_times

Passed

N/A

0.583571s

v7fs_dirperms

Passed

N/A

0.317211s

v7fs_flags

Passed

N/A

0.343041s

v7fs_owner

Passed

N/A

0.332481s

v7fs_times

Passed

N/A

0.335216s

fs/vfs/t_vfsops

28.222161s

ext2fs_tfhinval

Passed

N/A

0.328751s

ext2fs_tfhremove

Passed

N/A

0.304764s

ext2fs_tfilehandle

Passed

N/A

0.334246s

ext2fs_tmount

Passed

N/A

0.327671s

ext2fs_tstatvfs

Passed

N/A

0.328250s

ext2fs_tsync

Passed

N/A

0.329366s

ffs_tfhinval

Passed

N/A

0.326655s

ffs_tfhremove

Passed

N/A

0.328656s

ffs_tfilehandle

Passed

N/A

0.316182s

ffs_tmount

Passed

N/A

0.335637s

ffs_tstatvfs

Passed

N/A

0.336986s

ffs_tsync

Passed

N/A

0.322107s

ffslog_tfhinval

Passed

N/A

0.315881s

ffslog_tfhremove

Passed

N/A

0.345140s

ffslog_tfilehandle

Passed

N/A

0.344735s

ffslog_tmount

Passed

N/A

0.313722s

ffslog_tstatvfs

Passed

N/A

0.316588s

ffslog_tsync

Passed

N/A

0.335434s

lfs_tfhinval

Passed

N/A

0.389181s

lfs_tfhremove

Expected failure

fhopen() for removed file succeeds (PR kern/43745): /usr/src/tests/fs/vfs/t_vfsops.c:152: Expected true value in rump_sys_fhopen(fhp, fhsize, O_RDONLY) == -1

0.385480s

lfs_tfilehandle

Passed

N/A

0.418382s

lfs_tmount

Passed

N/A

0.384961s

lfs_tstatvfs

Passed

N/A

0.417341s

lfs_tsync

Passed

N/A

0.401416s

msdosfs_tfhinval

Passed

N/A

0.325307s

msdosfs_tfhremove

Passed

N/A

0.317189s

msdosfs_tfilehandle

Passed

N/A

0.297742s

msdosfs_tmount

Passed

N/A

0.293621s

msdosfs_tstatvfs

Passed

N/A

0.311850s

msdosfs_tsync

Passed

N/A

0.305534s

nfs_tfhinval

Passed

N/A

0.848671s

nfs_tfhremove

Passed

N/A

0.644122s

nfs_tfilehandle

Passed

N/A

0.650980s

nfs_tmount

Passed

N/A

0.606703s

nfs_tstatvfs

Passed

N/A

0.606234s

nfs_tsync

Passed

N/A

0.621428s

p2k_ffs_tfhinval

Passed

N/A

0.441189s

p2k_ffs_tfhremove

Passed

N/A

0.467622s

p2k_ffs_tfilehandle

Passed

N/A

0.438175s

p2k_ffs_tmount

Passed

N/A

0.438454s

p2k_ffs_tstatvfs

Passed

N/A

0.438044s

p2k_ffs_tsync

Passed

N/A

0.468441s

puffs_tfhinval

Passed

N/A

0.358078s

puffs_tfhremove

Passed

N/A

0.338662s

puffs_tfilehandle

Passed

N/A

0.339024s

puffs_tmount

Passed

N/A

0.329101s

puffs_tstatvfs

Passed

N/A

0.349105s

puffs_tsync

Passed

N/A

0.349383s

rumpfs_tfhinval

Skipped

file handles not supported

0.296666s

rumpfs_tfhremove

Skipped

file handles not supported

0.279366s

rumpfs_tfilehandle

Skipped

file handles not supported

0.289373s

rumpfs_tmount

Passed

N/A

0.277106s

rumpfs_tstatvfs

Passed

N/A

0.277032s

rumpfs_tsync

Passed

N/A

0.288833s

sysvbfs_tfhinval

Skipped

file handles not supported

0.307558s

sysvbfs_tfhremove

Skipped

file handles not supported

0.317170s

sysvbfs_tfilehandle

Skipped

file handles not supported

0.319904s

sysvbfs_tmount

Passed

N/A

0.317990s

sysvbfs_tstatvfs

Passed

N/A

0.294291s

sysvbfs_tsync

Passed

N/A

0.297559s

tmpfs_tfhinval

Passed

N/A

0.293063s

tmpfs_tfhremove

Passed

N/A

0.292361s

tmpfs_tfilehandle

Passed

N/A

0.283665s

tmpfs_tmount

Passed

N/A

0.297787s

tmpfs_tstatvfs

Passed

N/A

0.278658s

tmpfs_tsync

Passed

N/A

0.303712s

udf_tfhinval

Skipped

file handles not supported

0.301988s

udf_tfhremove

Skipped

file handles not supported

0.315930s

udf_tfilehandle

Skipped

file handles not supported

0.322862s

udf_tmount

Passed

N/A

0.304402s

udf_tstatvfs

Passed

N/A

0.317885s

udf_tsync

Passed

N/A

0.318901s

v7fs_tfhinval

Skipped

file handles not supported

0.333306s

v7fs_tfhremove

Skipped

file handles not supported

0.329563s

v7fs_tfilehandle

Skipped

file handles not supported

0.306505s

v7fs_tmount

Passed

N/A

0.336463s

v7fs_tstatvfs

Passed

N/A

0.333179s

v7fs_tsync

Passed

N/A

0.324444s

fs/vfs/t_vnops

163.081466s

ext2fs_access_simple

Passed

N/A

0.325093s

ext2fs_attrs

Passed

N/A

0.345127s

ext2fs_create_exist

Passed

N/A

0.353358s

ext2fs_create_many

Passed

N/A

2.716441s

ext2fs_create_nametoolong

Passed

N/A

0.347416s

ext2fs_create_nonalphanum

Passed

N/A

0.481678s

ext2fs_dir_notempty

Passed

N/A

0.334740s

ext2fs_dir_rmdirdotdot

Passed

N/A

0.345880s

ext2fs_dir_simple

Passed

N/A

0.349981s

ext2fs_fcntl_getlock_pids

Passed

N/A

0.352580s

ext2fs_fcntl_lock

Passed

N/A

0.334739s

ext2fs_lookup_complex

Passed

N/A

0.331835s

ext2fs_lookup_simple

Passed

N/A

0.350737s

ext2fs_lstat_symlink

Passed

N/A

0.327649s

ext2fs_read_directory

Passed

N/A

0.327740s

ext2fs_rename_dir

Passed

N/A

0.341271s

ext2fs_rename_dotdot

Passed

N/A

0.329436s

ext2fs_rename_nametoolong

Passed

N/A

0.358623s

ext2fs_rename_reg_nodir

Passed

N/A

0.335688s

ext2fs_symlink_long

Passed

N/A

0.366952s

ext2fs_symlink_root

Passed

N/A

0.349644s

ext2fs_symlink_zerolen

Passed

N/A

0.348327s

ffs_access_simple

Passed

N/A

0.347551s

ffs_attrs

Passed

N/A

0.341856s

ffs_create_exist

Passed

N/A

0.355120s

ffs_create_many

Passed

N/A

1.552169s

ffs_create_nametoolong

Passed

N/A

0.343550s

ffs_create_nonalphanum

Passed

N/A

0.503093s

ffs_dir_notempty

Passed

N/A

0.354283s

ffs_dir_rmdirdotdot

Passed

N/A

0.356554s

ffs_dir_simple

Passed

N/A

0.363861s

ffs_fcntl_getlock_pids

Passed

N/A

0.352079s

ffs_fcntl_lock

Passed

N/A

0.346764s

ffs_lookup_complex

Passed

N/A

0.358367s

ffs_lookup_simple

Passed

N/A

0.359710s

ffs_lstat_symlink

Passed

N/A

0.361410s

ffs_read_directory

Passed

N/A

0.357208s

ffs_rename_dir

Passed

N/A

0.344562s

ffs_rename_dotdot

Passed

N/A

0.357455s

ffs_rename_nametoolong

Passed

N/A

0.354679s

ffs_rename_reg_nodir

Passed

N/A

0.363915s

ffs_symlink_long

Passed

N/A

0.377875s

ffs_symlink_root

Passed

N/A

0.363639s

ffs_symlink_zerolen

Passed

N/A

0.360997s

ffslog_access_simple

Passed

N/A

0.367891s

ffslog_attrs

Passed

N/A

0.352983s

ffslog_create_exist

Passed

N/A

0.367321s

ffslog_create_many

Passed

N/A

1.313620s

ffslog_create_nametoolong

Passed

N/A

0.353124s

ffslog_create_nonalphanum

Passed

N/A

0.478404s

ffslog_dir_notempty

Passed

N/A

0.343471s

ffslog_dir_rmdirdotdot

Passed

N/A

0.345091s

ffslog_dir_simple

Passed

N/A

0.368017s

ffslog_fcntl_getlock_pids

Passed

N/A

0.347067s

ffslog_fcntl_lock

Passed

N/A

0.353824s

ffslog_lookup_complex

Passed

N/A

0.370043s

ffslog_lookup_simple

Passed

N/A

0.355596s

ffslog_lstat_symlink

Passed

N/A

0.362327s

ffslog_read_directory

Passed

N/A

0.355539s

ffslog_rename_dir

Passed

N/A

0.355651s

ffslog_rename_dotdot

Passed

N/A

0.349128s

ffslog_rename_nametoolong

Passed

N/A

0.341901s

ffslog_rename_reg_nodir

Passed

N/A

0.364075s

ffslog_symlink_long

Passed

N/A

0.358538s

ffslog_symlink_root

Passed

N/A

0.356982s

ffslog_symlink_zerolen

Passed

N/A

0.358275s

lfs_access_simple

Passed

N/A

0.434195s

lfs_attrs

Passed

N/A

0.442957s

lfs_create_exist

Passed

N/A

0.424190s

lfs_create_many

Passed

N/A

3.593732s

lfs_create_nametoolong

Passed

N/A

0.428391s

lfs_create_nonalphanum

Passed

N/A

1.491759s

lfs_dir_notempty

Passed

N/A

0.433968s

lfs_dir_rmdirdotdot

Passed

N/A

0.430399s

lfs_dir_simple

Passed

N/A

0.416945s

lfs_fcntl_getlock_pids

Passed

N/A

0.422417s

lfs_fcntl_lock

Passed

N/A

0.438457s

lfs_lookup_complex

Passed

N/A

0.417812s

lfs_lookup_simple

Passed

N/A

0.425742s

lfs_lstat_symlink

Passed

N/A

0.435475s

lfs_read_directory

Passed

N/A

0.428030s

lfs_rename_dir

Passed

N/A

0.439610s

lfs_rename_dotdot

Passed

N/A

0.440648s

lfs_rename_nametoolong

Passed

N/A

0.451294s

lfs_rename_reg_nodir

Passed

N/A

0.433714s

lfs_symlink_long

Passed

N/A

0.436531s

lfs_symlink_root

Passed

N/A

0.449711s

lfs_symlink_zerolen

Passed

N/A

0.435285s

msdosfs_access_simple

Passed

N/A

0.355317s

msdosfs_attrs

Passed

N/A

0.347655s

msdosfs_create_exist

Passed

N/A

0.339129s

msdosfs_create_many

Passed

N/A

7.914940s

msdosfs_create_nametoolong

Passed

N/A

0.347349s

msdosfs_create_nonalphanum

Passed

N/A

0.429695s

msdosfs_dir_notempty

Passed

N/A

0.331374s

msdosfs_dir_rmdirdotdot

Passed

N/A

0.349311s

msdosfs_dir_simple

Passed

N/A

0.328971s

msdosfs_fcntl_getlock_pids

Passed

N/A

0.358066s

msdosfs_fcntl_lock

Passed

N/A

0.329032s

msdosfs_lookup_complex

Passed

N/A

0.333793s

msdosfs_lookup_simple

Passed

N/A

0.349590s

msdosfs_lstat_symlink

Skipped

symlinks not supported by file system

0.325017s

msdosfs_read_directory

Passed

N/A

0.324700s

msdosfs_rename_dir

Passed

N/A

0.327089s

msdosfs_rename_dotdot

Passed

N/A

0.323651s

msdosfs_rename_nametoolong

Passed

N/A

0.338914s

msdosfs_rename_reg_nodir

Passed

N/A

0.321981s

msdosfs_symlink_long

Skipped

symlinks not supported by file system

0.319189s

msdosfs_symlink_root

Skipped

symlinks not supported by file system

0.316661s

msdosfs_symlink_zerolen

Skipped

symlinks not supported by file system

0.325174s

nfs_access_simple

Passed

N/A

0.671337s

nfs_attrs

Passed

N/A

0.654779s

nfs_create_exist

Passed

N/A

0.649157s

nfs_create_many

Passed

N/A

7.469624s

nfs_create_nametoolong

Passed

N/A

0.648887s

nfs_create_nonalphanum

Passed

N/A

1.324660s

nfs_dir_notempty

Passed

N/A

0.664032s

nfs_dir_rmdirdotdot

Passed

N/A

0.667302s

nfs_dir_simple

Passed

N/A

0.641180s

nfs_fcntl_getlock_pids

Passed

N/A

0.659963s

nfs_fcntl_lock

Passed

N/A

0.797344s

nfs_lookup_complex

Passed

N/A

0.649758s

nfs_lookup_simple

Passed

N/A

0.642808s

nfs_lstat_symlink

Passed

N/A

0.647326s

nfs_read_directory

Passed

N/A

0.655728s

nfs_rename_dir

Passed

N/A

0.699037s

nfs_rename_dotdot

Passed

N/A

0.676205s

nfs_rename_nametoolong

Passed

N/A

0.666071s

nfs_rename_reg_nodir

Passed

N/A

0.675119s

nfs_symlink_long

Passed

N/A

0.719371s

nfs_symlink_root

Passed

N/A

0.664476s

nfs_symlink_zerolen

Passed

N/A

0.643408s

p2k_ffs_access_simple

Passed

N/A

0.497984s

p2k_ffs_attrs

Passed

N/A

0.497717s

p2k_ffs_create_exist

Passed

N/A

0.488905s

p2k_ffs_create_many

Passed

N/A

5.959062s

p2k_ffs_create_nametoolong

Passed

N/A

0.473103s

p2k_ffs_create_nonalphanum

Passed

N/A

1.028315s

p2k_ffs_dir_notempty

Passed

N/A

0.473927s

p2k_ffs_dir_rmdirdotdot

Passed

N/A

0.498295s

p2k_ffs_dir_simple

Passed

N/A

0.518019s

p2k_ffs_fcntl_getlock_pids

Passed

N/A

0.508573s

p2k_ffs_fcntl_lock

Passed

N/A

0.498176s

p2k_ffs_lookup_complex

Passed

N/A

0.508067s

p2k_ffs_lookup_simple

Passed

N/A

0.467524s

p2k_ffs_lstat_symlink

Passed

N/A

0.488570s

p2k_ffs_read_directory

Passed

N/A

0.478446s

p2k_ffs_rename_dir

Passed

N/A

0.538089s

p2k_ffs_rename_dotdot

Passed

N/A

0.468041s

p2k_ffs_rename_nametoolong

Passed

N/A

0.468040s

p2k_ffs_rename_reg_nodir

Passed

N/A

0.478294s

p2k_ffs_symlink_long

Passed

N/A

0.538288s

p2k_ffs_symlink_root

Passed

N/A

0.467657s

p2k_ffs_symlink_zerolen

Passed

N/A

0.468652s

puffs_access_simple

Passed

N/A

0.387278s

puffs_attrs

Passed

N/A

0.399741s

puffs_create_exist

Passed

N/A

0.389283s

puffs_create_many

Passed

N/A

4.279995s

puffs_create_nametoolong

Passed

N/A

0.368238s

puffs_create_nonalphanum

Passed

N/A

0.699890s

puffs_dir_notempty

Passed

N/A

0.409251s

puffs_dir_rmdirdotdot

Passed

N/A

0.379703s

puffs_dir_simple

Passed

N/A

0.398813s

puffs_fcntl_getlock_pids

Passed

N/A

0.389306s

puffs_fcntl_lock

Passed

N/A

0.379588s

puffs_lookup_complex

Passed

N/A

0.389453s

puffs_lookup_simple

Passed

N/A

0.379230s

puffs_lstat_symlink

Passed

N/A

0.389506s

puffs_read_directory

Passed

N/A

0.388925s

puffs_rename_dir

Passed

N/A

0.399632s

puffs_rename_dotdot

Passed

N/A

0.399514s

puffs_rename_nametoolong

Passed

N/A

0.359162s

puffs_rename_reg_nodir

Passed

N/A

0.379447s

puffs_symlink_long

Passed

N/A

0.429790s

puffs_symlink_root

Passed

N/A

0.399047s

puffs_symlink_zerolen

Passed

N/A

0.399351s

rumpfs_access_simple

Passed

N/A

0.309688s

rumpfs_attrs

Passed

N/A

0.295240s

rumpfs_create_exist

Passed

N/A

0.318927s

rumpfs_create_many

Passed

N/A

1.414114s

rumpfs_create_nametoolong

Passed

N/A

0.299963s

rumpfs_create_nonalphanum

Passed

N/A

0.355430s

rumpfs_dir_notempty

Passed

N/A

0.320585s

rumpfs_dir_rmdirdotdot

Passed

N/A

0.325623s

rumpfs_dir_simple

Passed

N/A

0.314241s

rumpfs_fcntl_getlock_pids

Passed

N/A

0.323356s

rumpfs_fcntl_lock

Passed

N/A

0.305228s

rumpfs_lookup_complex

Passed

N/A

0.320243s

rumpfs_lookup_simple

Passed

N/A

0.321088s

rumpfs_lstat_symlink

Passed

N/A

0.316795s

rumpfs_read_directory

Passed

N/A

0.319470s

rumpfs_rename_dir

Skipped

rename not supported by file system

0.316557s

rumpfs_rename_dotdot

Skipped

rename not supported by file system

0.318281s

rumpfs_rename_nametoolong

Skipped

rename not supported by file system

0.296292s

rumpfs_rename_reg_nodir

Skipped

rename not supported by file system

0.314768s

rumpfs_symlink_long

Passed

N/A

0.332413s

rumpfs_symlink_root

Passed

N/A

0.321473s

rumpfs_symlink_zerolen

Passed

N/A

0.324891s

sysvbfs_access_simple

Passed

N/A

0.350012s

sysvbfs_attrs

Passed

N/A

0.325910s

sysvbfs_create_exist

Passed

N/A

0.329050s

sysvbfs_create_many

Passed

N/A

0.343557s

sysvbfs_create_nametoolong

Passed

N/A

0.336473s

sysvbfs_create_nonalphanum

Passed

N/A

0.342346s

sysvbfs_dir_notempty

Skipped

directories not supported by file system

0.341441s

sysvbfs_dir_rmdirdotdot

Skipped

directories not supported by file system

0.340877s

sysvbfs_dir_simple

Skipped

directories not supported by file system

0.339269s

sysvbfs_fcntl_getlock_pids

Passed

N/A

0.338102s

sysvbfs_fcntl_lock

Passed

N/A

0.333969s

sysvbfs_lookup_complex

Skipped

directories not supported by file system

0.324365s

sysvbfs_lookup_simple

Passed

N/A

0.316778s

sysvbfs_lstat_symlink

Skipped

symlinks not supported by file system

0.316606s

sysvbfs_read_directory

Passed

N/A

0.330358s

sysvbfs_rename_dir

Skipped

directories not supported by file system

0.343162s

sysvbfs_rename_dotdot

Skipped

directories not supported by file system

0.318912s

sysvbfs_rename_nametoolong

Passed

N/A

0.334883s

sysvbfs_rename_reg_nodir

Passed

N/A

0.328898s

sysvbfs_symlink_long

Skipped

symlinks not supported by file system

0.339081s

sysvbfs_symlink_root

Skipped

symlinks not supported by file system

0.319857s

sysvbfs_symlink_zerolen

Skipped

symlinks not supported by file system

0.343366s

tmpfs_access_simple

Passed

N/A

0.327532s

tmpfs_attrs

Passed

N/A

0.304383s

tmpfs_create_exist

Passed

N/A

0.331883s

tmpfs_create_many

Passed

N/A

1.052218s

tmpfs_create_nametoolong

Passed

N/A

0.324733s

tmpfs_create_nonalphanum

Passed

N/A

0.369757s

tmpfs_dir_notempty

Passed

N/A

0.311549s

tmpfs_dir_rmdirdotdot

Passed

N/A

0.299163s

tmpfs_dir_simple

Passed

N/A

0.311026s

tmpfs_fcntl_getlock_pids

Passed

N/A

0.328156s

tmpfs_fcntl_lock

Passed

N/A

0.316897s

tmpfs_lookup_complex

Passed

N/A

0.298907s

tmpfs_lookup_simple

Passed

N/A

0.316617s

tmpfs_lstat_symlink

Passed

N/A

0.302830s

tmpfs_read_directory

Passed

N/A

0.305577s

tmpfs_rename_dir

Passed

N/A

0.305996s

tmpfs_rename_dotdot

Passed

N/A

0.309981s

tmpfs_rename_nametoolong

Passed

N/A

0.307898s

tmpfs_rename_reg_nodir

Passed

N/A

0.303270s

tmpfs_symlink_long

Passed

N/A

0.326943s

tmpfs_symlink_root

Passed

N/A

0.312453s

tmpfs_symlink_zerolen

Passed

N/A

0.325579s

udf_access_simple

Passed

N/A

0.613946s

udf_attrs

Passed

N/A

0.618277s

udf_create_exist

Passed

N/A

0.617891s

udf_create_many

Passed

N/A

1.585029s

udf_create_nametoolong

Passed

N/A

0.348473s

udf_create_nonalphanum

Passed

N/A

0.700541s

udf_dir_notempty

Passed

N/A

0.607767s

udf_dir_rmdirdotdot

Passed

N/A

0.618868s

udf_dir_simple

Passed

N/A

0.588093s

udf_fcntl_getlock_pids

Passed

N/A

0.619211s

udf_fcntl_lock

Passed

N/A

0.608441s

udf_lookup_complex

Passed

N/A

0.598736s

udf_lookup_simple

Passed

N/A

0.355280s

udf_lstat_symlink

Passed

N/A

0.611781s

udf_read_directory

Passed

N/A

0.325642s

udf_rename_dir

Passed

N/A

0.621458s

udf_rename_dotdot

Passed

N/A

0.349375s

udf_rename_nametoolong

Passed

N/A

0.587858s

udf_rename_reg_nodir

Passed

N/A

0.587915s

udf_symlink_long

Passed

N/A

0.608814s

udf_symlink_root

Passed

N/A

0.589355s

udf_symlink_zerolen

Passed

N/A

0.608044s

v7fs_access_simple

Passed

N/A

0.352541s

v7fs_attrs

Passed

N/A

0.360202s

v7fs_create_exist

Passed

N/A

0.349998s

v7fs_create_many

Passed

N/A

9.206519s

v7fs_create_nametoolong

Passed

N/A

0.352554s

v7fs_create_nonalphanum

Passed

N/A

0.692283s

v7fs_dir_notempty

Passed

N/A

0.349699s

v7fs_dir_rmdirdotdot

Passed

N/A

0.344882s

v7fs_dir_simple

Passed

N/A

0.347986s

v7fs_fcntl_getlock_pids

Passed

N/A

0.359951s

v7fs_fcntl_lock

Passed

N/A

0.357365s

v7fs_lookup_complex

Passed

N/A

0.360259s

v7fs_lookup_simple

Passed

N/A

0.333940s

v7fs_lstat_symlink

Passed

N/A

0.341620s

v7fs_read_directory

Passed

N/A

0.355617s

v7fs_rename_dir

Passed

N/A

0.375199s

v7fs_rename_dotdot

Passed

N/A

0.360906s

v7fs_rename_nametoolong

Passed

N/A

0.353347s

v7fs_rename_reg_nodir

Passed

N/A

0.342043s

v7fs_symlink_long

Passed

N/A

0.359618s

v7fs_symlink_root

Passed

N/A

0.353326s

v7fs_symlink_zerolen

Passed

N/A

0.362406s

fs/cd9660/t_high_ino_big_file

0.318059s

pr_kern_48787

Skipped

not enough free disk space, have 1048344 Kbytes, need ~ 4500000 Kbytes

0.317195s

rump/rumpkern/t_copy

0.201981s

copy_efault

Passed

N/A

0.020977s

copyinstr

Passed

N/A

0.059896s

copyoutstr

Passed

N/A

0.058932s

copystr

Passed

N/A

0.058836s

rump/rumpkern/t_kern

0.555572s

lockme_DESTROYHELD

Passed

N/A

0.087646s

lockme_DOUBLEFREE

Passed

N/A

0.091027s

lockme_DOUBLEINIT

Skipped

test requires LOCKDEBUG kernel

0.021766s

lockme_MEMFREE

Skipped

test requires LOCKDEBUG kernel

0.021126s

lockme_MTX

Passed

N/A

0.090913s

lockme_RWDOUBLEX

Passed

N/A

0.089185s

lockme_RWRX

Skipped

test requires LOCKDEBUG kernel

0.020254s

lockme_RWXR

Passed

N/A

0.102029s

rump/rumpkern/t_lwproc

0.538665s

inherit

Passed

N/A

0.065894s

lwps

Passed

N/A

0.073302s

makelwp

Passed

N/A

0.061835s

nolwp

Passed

N/A

0.059382s

nolwprelease

Passed

N/A

0.084345s

nullswitch

Passed

N/A

0.061729s

proccreds

Passed

N/A

0.061593s

rfork

Passed

N/A

0.060327s

rump/rumpkern/t_modcmd

0.064243s

cmsg_modcmd

Passed

N/A

0.063690s

rump/rumpkern/t_modlinkset

0.069381s

modlinkset

Passed

N/A

0.068792s

rump/rumpkern/t_signals

0.231894s

sigignore

Passed

N/A

0.063780s

sigpanic

Passed

N/A

0.096568s

sigraise

Passed

N/A

0.064423s

rump/rumpkern/t_threads

0.159597s

kthread

Passed

N/A

0.078772s

threadjoin

Passed

N/A

0.079558s

rump/rumpkern/t_tsleep

0.194434s

tsleep

Passed

N/A

0.193649s

rump/rumpkern/t_vm

10.228844s

busypage

Passed

N/A

0.065600s

uvmwait

Passed

N/A

10.161671s

rump/rumpkern/t_sp

30.807709s

basic

Passed

N/A

0.315651s

fork_fakeauth

Passed

N/A

0.328541s

fork_pipecomm

Passed

N/A

0.320777s

fork_simple

Passed

N/A

0.335141s

reconnect

Passed

N/A

2.378005s

signal

Passed

N/A

0.348137s

sigsafe

Passed

N/A

5.494963s

stress_killer

Passed

N/A

9.816697s

stress_long

Passed

N/A

6.982584s

stress_short

Passed

N/A

4.475683s

rump/rumpnet/t_shmif

7.234568s

crossping

Passed

N/A

7.232780s

rump/rumpvfs/t_basic

0.063240s

lseekrv

Passed

N/A

0.062291s

rump/rumpvfs/t_etfs

0.553941s

key

Passed

N/A

0.062514s

large_blk

Passed

N/A

0.197296s

range_blk

Passed

N/A

0.112894s

reregister_blk

Passed

N/A

0.110552s

reregister_reg

Passed

N/A

0.065759s

rump/rumpvfs/t_p2kifs

0.061649s

makecn

Passed

N/A

0.060995s

rump/modautoload/t_modautoload

0.022872s

modautoload

Skipped

host kernel modules not supported

0.022229s

modules/t_modctl

0.681289s

cmd_load

Passed

N/A

0.057172s

cmd_load_props

Passed

N/A

0.100058s

cmd_load_recurse

Passed

N/A

0.156983s

cmd_stat

Passed

N/A

0.100111s

cmd_unload

Passed

N/A

0.263901s

modules/t_builtin

0.344471s

busydisable

Passed

N/A

0.067305s

disable

Passed

N/A

0.068936s

disabledstat

Passed

N/A

0.067749s

forcereload

Passed

N/A

0.068900s

noauto

Passed

N/A

0.067691s

modules/t_abi_uvm

0.425490s

PAGE_SIZE

Passed

N/A

0.424734s

modules/t_modload

2.400860s

bflag

Passed

N/A

0.620931s

iflag

Passed

N/A

0.755496s

plain

Passed

N/A

0.450004s

sflag

Passed

N/A

0.568861s

crypto/libcrypto/t_certs

0.139424s

x509v3

Passed

N/A

0.138556s

crypto/libcrypto/t_ciphers

4.235889s

bf

Passed

N/A

0.161185s

cast

Passed

N/A

3.046907s

des

Passed

N/A

0.157046s

evp

Passed

N/A

0.306687s

idea

Passed

N/A

0.140579s

rc2

Passed

N/A

0.137495s

rc4

Passed

N/A

0.177971s

rc5

Skipped

RC5 support not available; system built with MKCRYPTO_RC5=no

0.102958s

crypto/libcrypto/t_hashes

1.008109s

hmac

Passed

N/A

0.156186s

md2

Passed

N/A

0.146571s

md4

Passed

N/A

0.139854s

md5

Passed

N/A

0.133028s

mdc2

Passed

N/A

0.137641s

ripemd

Passed

N/A

0.141017s

sha

Passed

N/A

0.148961s

crypto/libcrypto/t_libcrypto

8.813559s

bn

Passed

N/A

7.881750s

conf

Passed

N/A

0.159718s

engine

Passed

N/A

0.248238s

lhash

Passed

N/A

0.148535s

rand

Passed

N/A

0.141319s

threads

Passed

N/A

0.230124s

crypto/libcrypto/t_pubkey

25.340283s

dh

Passed

N/A

0.410315s

dsa

Passed

N/A

0.487690s

ec

Passed

N/A

8.687655s

ecdh

Passed

N/A

1.358682s

ecdsa

Passed

N/A

8.951172s

rsa

Passed

N/A

5.150240s

srp

Passed

N/A

0.289467s

crypto/opencrypto/t_opencrypto

5.387673s

aesctr1

Passed

N/A

0.457352s

aesctr2

Passed

N/A

0.383301s

arc4

Skipped

ARC4 not implemented by swcrypto

0.275531s

camellia

Passed

N/A

0.385278s

cbcdes

Passed

N/A

0.377199s

comp

Passed

N/A

0.432263s

comp_deflate

Passed

N/A

0.385153s

comp_zlib_rnd

Passed

N/A

0.380074s

gcm

Passed

N/A

0.383625s

md5

Passed

N/A

0.386334s

md5_hmac

Passed

N/A

0.375656s

null

Passed

N/A

0.368949s

sha1_hmac

Passed

N/A

0.389506s

xcbcmac

Passed

N/A

0.383960s

ipf/t_filter_exec

16.368762s

f1

Passed

N/A

0.541861s

f10

Passed

N/A

1.091531s

f11

Passed

N/A

0.490126s

f12

Passed

N/A

0.436703s

f13

Passed

N/A

0.594076s

f14

Passed

N/A

0.544472s

f15

Passed

N/A

0.182563s

f16

Passed

N/A

0.179718s

f17

Passed

N/A

0.177712s

f18

Passed

N/A

0.177186s

f19

Passed

N/A

0.238919s

f2

Passed

N/A

0.438999s

f20

Passed

N/A

0.166210s

f24

Passed

N/A

0.165372s

f25

Passed

N/A

0.175123s

f26

Expected failure

Known to be broken: results differ

0.429415s

f27

Expected failure

Known to be broken: results differ

0.448157s

f3

Passed

N/A

0.526273s

f30

Passed

N/A

0.348971s

f4

Passed

N/A

0.544771s

f5

Passed

N/A

2.569065s

f6

Passed

N/A

2.520934s

f7

Passed

N/A

0.572078s

f8

Passed

N/A

0.437613s

f9

Passed

N/A

1.015520s

ipv6_1

Passed

N/A

0.226246s

ipv6_2

Passed

N/A

0.338755s

ipv6_3

Passed

N/A

0.210208s

ipv6_5

Passed

N/A

0.271995s

ipv6_6

Passed

N/A

0.263488s

ipf/t_filter_parse

3.763089s

i1

Passed

N/A

0.222318s

i10

Passed

N/A

0.163147s

i11

Passed

N/A

0.166551s

i12

Passed

N/A

0.155875s

i13

Passed

N/A

0.146752s

i14

Passed

N/A

0.150022s

i15

Passed

N/A

0.140203s

i16

Passed

N/A

0.148408s

i17

Expected failure

Known to be broken: atf-check failed; see the output of the test for details

0.164371s

i18

Passed

N/A

0.146883s

i19

Passed

N/A

0.251629s

i2

Passed

N/A

0.150408s

i20

Passed

N/A

0.154010s

i21

Passed

N/A

0.151638s

i22

Passed

N/A

0.154451s

i23

Passed

N/A

0.154697s

i3

Passed

N/A

0.157973s

i4

Passed

N/A

0.147923s

i5

Passed

N/A

0.151861s

i6

Passed

N/A

0.147915s

i7

Passed

N/A

0.146872s

i8

Passed

N/A

0.182852s

i9

Passed

N/A

0.182043s

ipf/t_logging

1.434123s

l1

Passed

N/A

1.432199s

ipf/t_nat_exec

10.607532s

n1

Passed

N/A

0.356053s

n10

Passed

N/A

0.310582s

n100

Passed

N/A

0.223544s

n101

Passed

N/A

0.216289s

n102

Passed

N/A

0.217230s

n103

Passed

N/A

0.219803s

n104

Passed

N/A

0.226800s

n105

Passed

N/A

0.227596s

n106

Passed

N/A

0.216059s

n11

Passed

N/A

0.333032s

n11_6

Passed

N/A

0.325285s

n12

Passed

N/A

0.205054s

n12_6

Passed

N/A

0.213808s

n13

Passed

N/A

0.210174s

n14

Passed

N/A

0.230333s

n15_6

Passed

N/A

0.283346s

n16

Passed

N/A

0.226612s

n17

Passed

N/A

0.206183s

n1_6

Passed

N/A

0.335752s

n2

Passed

N/A

0.374170s

n200

Passed

N/A

0.212909s

n2_6

Passed

N/A

0.383760s

n3

Passed

N/A

0.278695s

n4

Passed

N/A

0.498627s

n4_6

Passed

N/A

0.514150s

n5

Passed

N/A

0.528715s

n5_6

Passed

N/A

0.541586s

n6

Passed

N/A

0.456608s

n6_6

Passed

N/A

0.460697s

n7

Passed

N/A

0.328228s

n7_6

Passed

N/A

0.316983s

n8

Passed

N/A

0.207286s

n8_6

Expected failure

See PR kern/47665: results differ

0.224093s

n9

Passed

N/A

0.217191s

n9_6

Expected failure

See PR kern/47665: results differ

0.225874s

ipf/t_nat_ipf_exec

4.493405s

ni1

Passed

N/A

0.193788s

ni10

Passed

N/A

0.201695s

ni11

Passed

N/A

0.205242s

ni12

Passed

N/A

0.205803s

ni13

Passed

N/A

0.201210s

ni14

Passed

N/A

0.198799s

ni15

Passed

N/A

0.211324s

ni16

Passed

N/A

0.201641s

ni17

Passed

N/A

0.184593s

ni18

Passed

N/A

0.182228s

ni19

Passed

N/A

0.215323s

ni2

Passed

N/A

0.214731s

ni20

Passed

N/A

0.224499s

ni21

Passed

N/A

0.199224s

ni23

Passed

N/A

0.185645s

ni3

Passed

N/A

0.205883s

ni4

Passed

N/A

0.203748s

ni5

Passed

N/A

0.215262s

ni6

Passed

N/A

0.181744s

ni7

Passed

N/A

0.215418s

ni8

Passed

N/A

0.205624s

ni9

Passed

N/A

0.201419s

ipf/t_nat_parse

3.160081s

in1

Passed

N/A

0.219988s

in100

Passed

N/A

0.162194s

in100_6

Passed

N/A

0.150493s

in101

Passed

N/A

0.151863s

in101_6

Passed

N/A

0.159599s

in102

Passed

N/A

0.149652s

in102_6

Passed

N/A

0.193747s

in1_6

Passed

N/A

0.163938s

in2

Passed

N/A

0.171866s

in2_6

Passed

N/A

0.165666s

in3

Passed

N/A

0.146834s

in3_6

Passed

N/A

0.142601s

in4

Passed

N/A

0.139241s

in4_6

Passed

N/A

0.148798s

in5

Passed

N/A

0.153584s

in5_6

Passed

N/A

0.144329s

in6

Passed

N/A

0.140445s

in6_6

Passed

N/A

0.149475s

in7

Passed

N/A

0.145783s

in8_6

Passed

N/A

0.140061s

ipf/t_pools

3.042365s

f28

Passed

N/A

0.183439s

f29

Passed

N/A

0.167683s

ip1

Passed

N/A

0.203090s

ip2

Passed

N/A

0.169058s

ip3

Passed

N/A

0.164857s

p1

Passed

N/A

0.177081s

p10

Passed

N/A

0.184510s

p11

Passed

N/A

0.172667s

p12

Passed

N/A

0.180663s

p13

Passed

N/A

0.170429s

p2

Passed

N/A

0.179249s

p3

Passed

N/A

0.184421s

p4

Passed

N/A

0.184795s

p5

Passed

N/A

0.181325s

p6

Passed

N/A

0.164467s

p7

Passed

N/A

0.169142s

p9

Passed

N/A

0.178841s

share/examples/t_asm

0.367887s

hello

Skipped

Example program not implemented on this platform

0.366975s

share/mk/t_lib

2.653940s

defaults__build_and_install

Passed

N/A

2.647664s

share/mk/t_own

0.610515s

makeconf__missing

Passed

N/A

0.239026s

makeconf__ok

Passed

N/A

0.368910s

share/mk/t_prog

2.482136s

defaults__build_and_install

Passed

N/A

1.583683s

without_man__build_and_install

Passed

N/A

0.889250s

share/mk/t_test

8.347843s

one_c

Passed

N/A

1.199776s

one_cxx

Passed

N/A

6.357028s

one_sh

Passed

N/A

0.780012s

atf/atf-c/detail/dynstr_test

5.507429s

append_ap

Passed

N/A

1.153690s

append_fmt

Passed

N/A

1.145666s

clear

Passed

N/A

0.013076s

copy

Passed

N/A

0.014339s

cstring

Passed

N/A

0.012718s

equal_cstring

Passed

N/A

0.013741s

equal_dynstr

Passed

N/A

0.012836s

fini_disown

Passed

N/A

0.012407s

init

Passed

N/A

0.012394s

init_ap

Passed

N/A

0.012773s

init_fmt

Passed

N/A

0.013169s

init_raw

Passed

N/A

0.013857s

init_rep

Passed

N/A

0.405355s

init_substr

Passed

N/A

0.012610s

length

Passed

N/A

0.034156s

prepend_ap

Passed

N/A

1.296344s

prepend_fmt

Passed

N/A

1.300647s

rfind_ch

Passed

N/A

0.014868s

atf/atf-c/detail/env_test

0.056062s

get

Passed

N/A

0.012899s

has

Passed

N/A

0.013407s

set

Passed

N/A

0.013575s

unset

Passed

N/A

0.012478s

atf/atf-c/detail/fs_test

0.384571s

eaccess

Passed

N/A

0.023744s

exists

Passed

N/A

0.015338s

getcwd

Passed

N/A

0.014372s

mkdtemp_err

Passed

N/A

0.016569s

mkdtemp_ok

Passed

N/A

0.014616s

mkdtemp_umask

Passed

N/A

0.014768s

mkstemp_err

Passed

N/A

0.016447s

mkstemp_ok

Passed

N/A

0.014929s

mkstemp_umask

Passed

N/A

0.014184s

path_append

Passed

N/A

0.015283s

path_branch_path

Passed

N/A

0.016999s

path_copy

Passed

N/A

0.013659s

path_equal

Passed

N/A

0.014797s

path_is_absolute

Passed

N/A

0.015254s

path_is_root

Passed

N/A

0.015773s

path_leaf_name

Passed

N/A

0.015682s

path_normalize

Passed

N/A

0.014370s

path_to_absolute

Passed

N/A

0.014571s

rmdir_empty

Passed

N/A

0.013094s

rmdir_enotempty

Passed

N/A

0.013156s

rmdir_eperm

Passed

N/A

0.012792s

stat_mode

Passed

N/A

0.012758s

stat_perms

Passed

N/A

0.015884s

stat_type

Passed

N/A

0.014751s

atf/atf-c/detail/list_test

0.126881s

list_append

Passed

N/A

0.013285s

list_append_list

Passed

N/A

0.013626s

list_for_each

Passed

N/A

0.014092s

list_for_each_c

Passed

N/A

0.013769s

list_index

Passed

N/A

0.013573s

list_index_c

Passed

N/A

0.013325s

list_init

Passed

N/A

0.013524s

list_to_charpp_empty

Passed

N/A

0.012530s

list_to_charpp_some

Passed

N/A

0.013272s

atf/atf-c/detail/map_test

0.180028s

find

Passed

N/A

0.012817s

find_c

Passed

N/A

0.013530s

map_for_each

Passed

N/A

0.014235s

map_for_each_c

Passed

N/A

0.014254s

map_init

Passed

N/A

0.012352s

map_init_charpp_empty

Passed

N/A

0.013406s

map_init_charpp_null

Passed

N/A

0.013249s

map_init_charpp_short

Passed

N/A

0.013679s

map_init_charpp_some

Passed

N/A

0.013358s

map_insert

Passed

N/A

0.012597s

stable_keys

Passed

N/A

0.013014s

to_charpp_empty

Passed

N/A

0.012707s

to_charpp_some

Passed

N/A

0.012314s

atf/atf-c/detail/process_test

2.067584s

child_pid

Passed

N/A

0.017516s

child_wait_eintr

Passed

N/A

1.024694s

exec_failure

Passed

N/A

0.031251s

exec_list

Passed

N/A

0.022975s

exec_prehook

Passed

N/A

0.017242s

exec_success

Passed

N/A

0.021577s

fork_cookie

Passed

N/A

0.019298s

fork_out_capture_err_capture

Passed

N/A

0.018781s

fork_out_capture_err_connect

Passed

N/A

0.020416s

fork_out_capture_err_default

Passed

N/A

0.018632s

fork_out_capture_err_inherit

Passed

N/A

0.019203s

fork_out_capture_err_redirect_fd

Passed

N/A

0.020303s

fork_out_capture_err_redirect_path

Passed

N/A

0.020122s

fork_out_connect_err_capture

Passed

N/A

0.019363s

fork_out_connect_err_connect

Passed

N/A

0.019070s

fork_out_connect_err_default

Passed

N/A

0.019366s

fork_out_connect_err_inherit

Passed

N/A

0.021298s

fork_out_connect_err_redirect_fd

Passed

N/A

0.020112s

fork_out_connect_err_redirect_path

Passed

N/A

0.020591s

fork_out_default_err_capture

Passed

N/A

0.020835s

fork_out_default_err_connect

Passed

N/A

0.021123s

fork_out_default_err_default

Passed

N/A

0.020521s

fork_out_default_err_inherit

Passed

N/A

0.019634s

fork_out_default_err_redirect_fd

Passed

N/A

0.020636s

fork_out_default_err_redirect_path

Passed

N/A

0.020746s

fork_out_inherit_err_capture

Passed

N/A

0.020883s

fork_out_inherit_err_connect

Passed

N/A

0.020739s

fork_out_inherit_err_default

Passed

N/A

0.020792s

fork_out_inherit_err_inherit

Passed

N/A

0.020107s

fork_out_inherit_err_redirect_fd

Passed

N/A

0.020659s

fork_out_inherit_err_redirect_path

Passed

N/A

0.019878s

fork_out_redirect_fd_err_capture

Passed

N/A

0.019432s

fork_out_redirect_fd_err_connect

Passed

N/A

0.019670s

fork_out_redirect_fd_err_default

Passed

N/A

0.020907s

fork_out_redirect_fd_err_inherit

Passed

N/A

0.020943s

fork_out_redirect_fd_err_redirect_fd

Passed

N/A

0.019821s

fork_out_redirect_fd_err_redirect_path

Passed

N/A

0.019791s

fork_out_redirect_path_err_capture

Passed

N/A

0.020823s

fork_out_redirect_path_err_connect

Passed

N/A

0.020579s

fork_out_redirect_path_err_default

Passed

N/A

0.020337s

fork_out_redirect_path_err_inherit

Passed

N/A

0.021532s

fork_out_redirect_path_err_redirect_fd

Passed

N/A

0.021107s

fork_out_redirect_path_err_redirect_path

Passed

N/A

0.020864s

status_coredump

Passed

N/A

0.023372s

status_exited

Passed

N/A

0.020758s

status_signaled

Passed

N/A

0.019646s

stream_init_capture

Passed

N/A

0.015010s

stream_init_connect

Passed

N/A

0.014555s

stream_init_inherit

Passed

N/A

0.015487s

stream_init_redirect_fd

Passed

N/A

0.014807s

stream_init_redirect_path

Passed

N/A

0.016156s

atf/atf-c/detail/sanity_test

0.121325s

inv

Passed

N/A

0.028086s

post

Passed

N/A

0.029232s

pre

Passed

N/A

0.029456s

unreachable

Passed

N/A

0.027612s

atf/atf-c/detail/text_test

0.104547s

for_each_word

Passed

N/A

0.012249s

format

Passed

N/A

0.014162s

format_ap

Passed

N/A

0.012380s

split

Passed

N/A

0.020313s

split_delims

Passed

N/A

0.013845s

to_bool

Passed

N/A

0.013940s

to_long

Passed

N/A

0.012411s

atf/atf-c/detail/user_test

0.053614s

euid

Passed

N/A

0.013038s

is_member_of_group

Passed

N/A

0.013056s

is_root

Passed

N/A

0.013447s

is_unprivileged

Passed

N/A

0.011789s

atf/atf-c/atf_c_test

0.223598s

include

Passed

N/A

0.222676s

atf/atf-c/build_test

0.225743s

c_o

Passed

N/A

0.014802s

cpp

Passed

N/A

0.015512s

cxx_o

Passed

N/A

0.014492s

equal_arrays

Passed

N/A

0.012036s

include

Passed

N/A

0.165713s

atf/atf-c/check_test

2.682578s

build_c_o

Passed

N/A

0.512513s

build_cpp

Passed

N/A

0.345912s

build_cxx_o

Passed

N/A

1.515664s

exec_array

Passed

N/A

0.022314s

exec_cleanup

Passed

N/A

0.020540s

exec_exitstatus

Passed

N/A

0.032314s

exec_stdout_stderr

Passed

N/A

0.030810s

exec_umask

Passed

N/A

0.012684s

exec_unknown

Passed

N/A

0.016937s

include

Passed

N/A

0.164412s

atf/atf-c/config_test

0.175396s

get

Passed

N/A

0.015370s

include

Passed

N/A

0.158309s

atf/atf-c/error_test

0.462795s

error_new

Passed

N/A

0.014111s

error_new_wo_memory

Passed

N/A

0.012889s

format

Passed

N/A

0.014567s

include

Passed

N/A

0.169080s

include_fwd

Passed

N/A

0.149026s

is_error

Passed

N/A

0.013511s

libc_format

Passed

N/A

0.016155s

libc_new

Passed

N/A

0.013815s

no_error

Passed

N/A

0.013410s

no_memory_format

Passed

N/A

0.013221s

no_memory_new

Passed

N/A

0.012484s

no_memory_twice

Passed

N/A

0.012330s

atf/atf-c/macros_test

1.351334s

check

Passed

N/A

0.034895s

check_eq

Passed

N/A

0.054088s

check_errno

Passed

N/A

0.031240s

check_match

Passed

N/A

0.036920s

check_streq

Passed

N/A

0.059019s

detect_unused_tests

Expected failure

PR 49187: Build of unused_test.c passed; unused test cases are not properly detected

0.370219s

include

Passed

N/A

0.224810s

msg_embedded_fmt

Passed

N/A

0.036692s

require

Passed

N/A

0.030764s

require_eq

Passed

N/A

0.047858s

require_errno

Passed

N/A

0.029291s

require_match

Passed

N/A

0.035655s

require_streq

Passed

N/A

0.050175s

use

Passed

N/A

0.295063s

atf/atf-c/tc_test

0.221570s

config

Passed

N/A

0.012748s

include

Passed

N/A

0.165633s

init

Passed

N/A

0.013852s

init_pack

Passed

N/A

0.012966s

vars

Passed

N/A

0.012777s

atf/atf-c/tp_test

0.163910s

getopt

Passed

N/A

0.011725s

include

Passed

N/A

0.150520s

atf/atf-c/utils_test

0.721163s

cat_file__empty

Passed

N/A

0.025283s

cat_file__no_newline_eof

Passed

N/A

0.019488s

cat_file__one_line

Passed

N/A

0.018773s

cat_file__several_lines

Passed

N/A

0.013909s

compare_file__empty__match

Passed

N/A

0.014833s

compare_file__empty__not_match

Passed

N/A

0.013237s

compare_file__long__match

Passed

N/A

0.014785s

compare_file__long__not_match

Passed

N/A

0.014522s

compare_file__short__match

Passed

N/A

0.013323s

compare_file__short__not_match

Passed

N/A

0.015063s

copy_file__empty

Passed

N/A

0.013399s

copy_file__some_contents

Passed

N/A

0.013316s

create_file

Passed

N/A

0.012905s

file_exists

Passed

N/A

0.013200s

fork

Passed

N/A

0.017266s

free_charpp__empty

Passed

N/A

0.012898s

free_charpp__some

Passed

N/A

0.012697s

grep_file

Passed

N/A

0.015242s

grep_string

Passed

N/A

0.012750s

include

Passed

N/A

0.202901s

readline__none

Passed

N/A

0.014207s

readline__some

Passed

N/A

0.015372s

redirect__other

Passed

N/A

0.012730s

redirect__stderr

Passed

N/A

0.013146s

redirect__stdout

Passed

N/A

0.018961s

wait__invalid_exitstatus

Passed

N/A

0.022828s

wait__invalid_stderr

Passed

N/A

0.022568s

wait__invalid_stdout

Passed

N/A

0.022374s

wait__ok

Passed

N/A

0.021214s

wait__save_stderr

Passed

N/A

0.020477s

wait__save_stdout

Passed

N/A

0.019860s

atf/atf-c/pkg_config_test

0.003675s

build

Skipped

Required program 'pkg-config' not found in the PATH

0.001687s

version

Skipped

Required program 'pkg-config' not found in the PATH

0.001902s

atf/atf-c++/detail/application_test

0.026850s

getopt

Passed

N/A

0.026059s

atf/atf-c++/detail/auto_array_test

0.242728s

auto_array_access

Passed

N/A

0.025937s

auto_array_assign

Passed

N/A

0.026980s

auto_array_assign_ref

Passed

N/A

0.024027s

auto_array_copy

Passed

N/A

0.024327s

auto_array_copy_ref

Passed

N/A

0.028368s

auto_array_get

Passed

N/A

0.026583s

auto_array_release

Passed

N/A

0.026517s

auto_array_reset

Passed

N/A

0.027018s

auto_array_scope

Passed

N/A

0.026651s

atf/atf-c++/detail/env_test

0.078104s

has_get

Passed

N/A

0.025663s

set

Passed

N/A

0.025475s

unset

Passed

N/A

0.025097s

atf/atf-c++/detail/exceptions_test

0.120314s

throw_atf_error_libc

Passed

N/A

0.037712s

throw_atf_error_no_memory

Passed

N/A

0.040322s

throw_atf_error_unknown

Passed

N/A

0.040382s

atf/atf-c++/detail/fs_test

0.518978s

directory_file_info

Passed

N/A

0.024828s

directory_names

Passed

N/A

0.027893s

directory_read

Passed

N/A

0.025045s

exists

Passed

N/A

0.028204s

file_info_perms

Passed

N/A

0.032820s

file_info_stat

Passed

N/A

0.027270s

is_executable

Passed

N/A

0.025027s

path_branch_path

Passed

N/A

0.028839s

path_compare_different

Passed

N/A

0.027691s

path_compare_equal

Passed

N/A

0.026844s

path_concat

Passed

N/A

0.027444s

path_is_absolute

Passed

N/A

0.025443s

path_is_root

Passed

N/A

0.025247s

path_leaf_name

Passed

N/A

0.027544s

path_normalize

Passed

N/A

0.026346s

path_op_less

Passed

N/A

0.027289s

path_to_absolute

Passed

N/A

0.025387s

remove

Passed

N/A

0.039006s

atf/atf-c++/detail/process_test

0.279534s

argv_array_assign

Passed

N/A

0.023444s

argv_array_copy

Passed

N/A

0.025674s

argv_array_exec_argv

Passed

N/A

0.024207s

argv_array_init_carray

Passed

N/A

0.027301s

argv_array_init_col

Passed

N/A

0.024450s

argv_array_init_empty

Passed

N/A

0.026789s

argv_array_init_varargs

Passed

N/A

0.024953s

argv_array_iter

Passed

N/A

0.024283s

exec_failure

Passed

N/A

0.034845s

exec_success

Passed

N/A

0.034874s

atf/atf-c++/detail/sanity_test

0.027193s

nothing

Passed

N/A

0.026223s

atf/atf-c++/detail/text_test

0.324387s

duplicate

Passed

N/A

0.026975s

join

Passed

N/A

0.026065s

match

Passed

N/A

0.041522s

split

Passed

N/A

0.030553s

split_delims

Passed

N/A

0.025813s

to_bool

Passed

N/A

0.039066s

to_bytes

Passed

N/A

0.039046s

to_string

Passed

N/A

0.023648s

to_type

Passed

N/A

0.040250s

trim

Passed

N/A

0.023511s

atf/atf-c++/atf_c++_test

1.810912s

include

Passed

N/A

1.809608s

atf/atf-c++/build_test

0.958729s

c_o

Passed

N/A

0.028907s

cpp

Passed

N/A

0.027071s

cxx_o

Passed

N/A

0.027625s

equal_argvs

Passed

N/A

0.026364s

include

Passed

N/A

0.845664s

atf/atf-c++/check_test

3.225565s

build_c_o

Passed

N/A

0.310018s

build_cpp

Passed

N/A

0.193188s

build_cxx_o

Passed

N/A

1.524297s

exec_cleanup

Passed

N/A

0.036694s

exec_exitstatus

Passed

N/A

0.052817s

exec_stdout_stderr

Passed

N/A

0.044737s

exec_unknown

Passed

N/A

0.031951s

include

Passed

N/A

1.023685s

atf/atf-c++/config_test

1.051665s

get

Passed

N/A

0.028100s

get_all

Passed

N/A

0.025346s

has

Passed

N/A

0.023622s

include

Passed

N/A

0.971855s

atf/atf-c++/macros_test

7.100349s

check_errno

Passed

N/A

0.051339s

detect_unused_tests

Expected failure

PR 49187: Build of unused_test.cpp passed; unused test cases are not properly detected

2.344062s

fail

Passed

N/A

0.031214s

include

Passed

N/A

1.979116s

pass

Passed

N/A

0.032749s

require

Passed

N/A

0.062391s

require_eq

Passed

N/A

0.056399s

require_errno

Passed

N/A

0.049116s

require_in

Passed

N/A

0.067143s

require_match

Passed

N/A

0.041777s

require_not_in

Passed

N/A

0.062818s

require_throw

Passed

N/A

0.077389s

require_throw_re

Passed

N/A

0.100787s

skip

Passed

N/A

0.030987s

use

Passed

N/A

2.096609s

atf/atf-c++/tests_test

1.066755s

atf_tp_writer

Passed

N/A

0.027794s

include

Passed

N/A

1.037106s

atf/atf-c++/utils_test

1.686050s

cat_file__empty

Passed

N/A

0.033282s

cat_file__no_newline_eof

Passed

N/A

0.029515s

cat_file__one_line

Passed

N/A

0.026513s

cat_file__several_lines

Passed

N/A

0.031307s

compare_file__empty__match

Passed

N/A

0.024611s

compare_file__empty__not_match

Passed

N/A

0.024253s

compare_file__long__match

Passed

N/A

0.027233s

compare_file__long__not_match

Passed

N/A

0.025014s

compare_file__short__match

Passed

N/A

0.024321s

compare_file__short__not_match

Passed

N/A

0.027169s

copy_file__empty

Passed

N/A

0.024597s

copy_file__some_contents

Passed

N/A

0.024269s

create_file

Passed

N/A

0.025099s

file_exists

Passed

N/A

0.026635s

fork

Passed

N/A

0.034310s

grep_collection__set

Passed

N/A

0.024967s

grep_collection__vector

Passed

N/A

0.027944s

grep_file

Passed

N/A

0.027794s

grep_string

Passed

N/A

0.027130s

include

Passed

N/A

0.845900s

redirect__other

Passed

N/A

0.024945s

redirect__stderr

Passed

N/A

0.026265s

redirect__stdout

Passed

N/A

0.024493s

wait__invalid_exitstatus

Passed

N/A

0.037087s

wait__invalid_stderr

Passed

N/A

0.036193s

wait__invalid_stdout

Passed

N/A

0.037157s

wait__ok

Passed

N/A

0.036862s

wait__save_stderr

Passed

N/A

0.036927s

wait__save_stdout

Passed

N/A

0.039388s

atf/atf-c++/pkg_config_test

0.003290s

build

Skipped

Required program 'pkg-config' not found in the PATH

0.001569s

version

Skipped

Required program 'pkg-config' not found in the PATH

0.001632s

atf/atf-sh/atf-check_test

6.554775s

eflag_empty

Passed

N/A

0.201595s

eflag_file

Passed

N/A

0.313276s

eflag_ignore

Passed

N/A

0.183058s

eflag_inline

Passed

N/A

0.481412s

eflag_match

Passed

N/A

0.331399s

eflag_multiple

Passed

N/A

0.272655s

eflag_negated

Passed

N/A

0.287559s

eflag_save

Passed

N/A

0.147553s

invalid_umask

Passed

N/A

0.147108s

oflag_empty

Passed

N/A

0.190730s

oflag_file

Passed

N/A

0.311739s

oflag_ignore

Passed

N/A

0.182000s

oflag_inline

Passed

N/A

0.467075s

oflag_match

Passed

N/A

0.335549s

oflag_multiple

Passed

N/A

0.282334s

oflag_negated

Passed

N/A

0.288558s

oflag_save

Passed

N/A

0.148485s

sflag_eq_ne

Passed

N/A

0.472823s

sflag_exit

Passed

N/A

0.565348s

sflag_ignore

Passed

N/A

0.232258s

sflag_signal

Passed

N/A

0.362084s

stdin

Passed

N/A

0.132059s

xflag

Passed

N/A

0.194033s

atf/atf-sh/atf_check_test

12.386718s

equal

Passed

N/A

0.636178s

experr_mismatch

Passed

N/A

0.300817s

expout_mismatch

Passed

N/A

0.314927s

flush_stdout_on_timeout

Passed

N/A

10.131454s

info_ok

Passed

N/A

0.412296s

null_stderr

Passed

N/A

0.289553s

null_stdout

Passed

N/A

0.294024s

atf/atf-sh/config_test

0.959685s

get

Passed

N/A

0.452291s

has

Passed

N/A

0.505776s

atf/atf-sh/integration_test

0.530870s

arguments

Passed

N/A

0.237007s

missing_script

Passed

N/A

0.147064s

no_args

Passed

N/A

0.144322s

atf/atf-sh/normalize_test

0.265674s

main

Passed

N/A

0.265124s

atf/atf-sh/tc_test

0.741212s

default_status

Passed

N/A

0.526989s

missing_body

Passed

N/A

0.212724s

atf/atf-sh/tp_test

0.257390s

srcdir

Passed

N/A

0.255953s

atf/test-programs/config_test

1.373678s

vflag

Passed

N/A

1.372980s

atf/test-programs/expect_test

4.606655s

expect_death

Passed

N/A

0.879011s

expect_exit

Passed

N/A

0.874682s

expect_fail

Passed

N/A

0.797994s

expect_pass

Passed

N/A

0.748520s

expect_signal

Passed

N/A

0.920591s

expect_timeout

Passed

N/A

0.381718s

atf/test-programs/meta_data_test

3.728906s

no_descr

Passed

N/A

1.839842s

no_head

Passed

N/A

1.887820s

atf/test-programs/result_test

2.260293s

atf_run_warnings

Passed

N/A

0.280989s

result_exception

Passed

N/A

0.167369s

result_on_stdout

Passed

N/A

0.620480s

result_to_file

Passed

N/A

0.867116s

result_to_file_fail

Passed

N/A

0.316818s

atf/test-programs/srcdir_test

4.185755s

default

Passed

N/A

0.629982s

libtool

Passed

N/A

0.611497s

relative

Passed

N/A

2.124826s

sflag

Passed

N/A

0.809023s

atf/tools/application_test

0.024333s

getopt

Passed

N/A

0.023755s

atf/tools/atffile_test

0.560150s

atffile_1

Passed

N/A

0.037596s

atffile_2

Passed

N/A

0.024515s

atffile_3

Passed

N/A

0.027337s

atffile_4

Passed

N/A

0.024858s

atffile_5

Passed

N/A

0.028472s

atffile_50

Passed

N/A

0.041837s

atffile_51

Passed

N/A

0.039546s

atffile_52

Passed

N/A

0.043979s

atffile_53

Passed

N/A

0.041283s

atffile_54

Passed

N/A

0.041772s

atffile_6

Passed

N/A

0.026212s

atffile_getters

Passed

N/A

0.026963s

read_missing_test_program

Passed

N/A

0.042987s

read_missing_test_suite

Passed

N/A

0.043139s

read_ok_simple

Passed

N/A

0.027709s

read_ok_some_globs

Passed

N/A

0.028930s

atf/tools/auto_array_test

0.244858s

auto_array_access

Passed

N/A

0.026555s

auto_array_assign

Passed

N/A

0.026533s

auto_array_assign_ref

Passed

N/A

0.026565s

auto_array_copy

Passed

N/A

0.026447s

auto_array_copy_ref

Passed

N/A

0.026518s

auto_array_get

Passed

N/A

0.027252s

auto_array_release

Passed

N/A

0.026349s

auto_array_reset

Passed

N/A

0.026088s

auto_array_scope

Passed

N/A

0.026428s

atf/tools/config_file_test

0.449488s

config_1

Passed

N/A

0.031803s

config_2

Passed

N/A

0.026362s

config_3

Passed

N/A

0.025190s

config_4

Passed

N/A

0.024990s

config_50

Passed

N/A

0.039139s

config_51

Passed

N/A

0.039026s

config_52

Passed

N/A

0.041759s

config_53

Passed

N/A

0.041502s

config_54

Passed

N/A

0.040922s

merge_configs_both_empty

Passed

N/A

0.024394s

merge_configs_lower_empty

Passed

N/A

0.026320s

merge_configs_mixed

Passed

N/A

0.024203s

merge_configs_upper_empty

Passed

N/A

0.024530s

read_config_files_none

Passed

N/A

0.028601s

atf/tools/config_test

0.081854s

get

Passed

N/A

0.029084s

get_all

Passed

N/A

0.023824s

has

Passed

N/A

0.026821s

atf/tools/env_test

0.075403s

has_get

Passed

N/A

0.025946s

set

Passed

N/A

0.023964s

unset

Passed

N/A

0.023430s

atf/tools/expand_test

0.153044s

expand_glob_base

Passed

N/A

0.024601s

expand_glob_tps

Passed

N/A

0.027536s

is_glob

Passed

N/A

0.025436s

matches_glob_plain

Passed

N/A

0.023766s

matches_glob_question

Passed

N/A

0.023767s

matches_glob_star

Passed

N/A

0.023596s

atf/tools/fs_test

0.755817s

change_directory

Passed

N/A

0.047213s

cleanup

Passed

N/A

0.047209s

cleanup_eacces_on_root

Passed

N/A

0.027077s

cleanup_eacces_on_subdir

Passed

N/A

0.041113s

directory_file_info

Passed

N/A

0.026076s

directory_names

Passed

N/A

0.025382s

directory_read

Passed

N/A

0.025476s

exists

Passed

N/A

0.038697s

file_info_perms

Passed

N/A

0.025420s

file_info_stat

Passed

N/A

0.024502s

get_current_dir

Passed

N/A

0.025395s

is_executable

Passed

N/A

0.038948s

path_branch_path

Passed

N/A

0.024800s

path_compare_different

Passed

N/A

0.024096s

path_compare_equal

Passed

N/A

0.024098s

path_concat

Passed

N/A

0.024036s

path_is_absolute

Passed

N/A

0.026033s

path_is_root

Passed

N/A

0.025134s

path_leaf_name

Passed

N/A

0.027515s

path_normalize

Passed

N/A

0.026910s

path_op_less

Passed

N/A

0.028937s

path_to_absolute

Passed

N/A

0.025534s

remove

Passed

N/A

0.040121s

temp_dir_raii

Passed

N/A

0.041199s

atf/tools/io_test

4.149918s

file_handle_copy

Passed

N/A

0.023659s

file_handle_ctor

Passed

N/A

0.025710s

file_handle_get

Passed

N/A

0.023776s

file_handle_posix_remap

Passed

N/A

0.026340s

muxer_large_buffer

Passed

N/A

2.670269s

muxer_small_buffer

Passed

N/A

1.196845s

pistream

Passed

N/A

0.025954s

systembuf_long_read

Passed

N/A

0.051132s

systembuf_long_write

Passed

N/A

0.049717s

systembuf_short_read

Passed

N/A

0.024768s

systembuf_short_write

Passed

N/A

0.024203s

atf/tools/parser_test

0.818796s

headers_1

Passed

N/A

0.045114s

headers_10

Passed

N/A

0.038741s

headers_11

Passed

N/A

0.042466s

headers_12

Passed

N/A

0.043376s

headers_2

Passed

N/A

0.042066s

headers_3

Passed

N/A

0.042601s

headers_4

Passed

N/A

0.042684s

headers_5

Passed

N/A

0.042796s

headers_6

Passed

N/A

0.041346s

headers_7

Passed

N/A

0.040177s

headers_8

Passed

N/A

0.038161s

headers_9

Passed

N/A

0.039210s

parse_error_to_string

Passed

N/A

0.024811s

parse_errors_what

Passed

N/A

0.024537s

token_getters

Passed

N/A

0.024212s

tokenizer_delims_nows

Passed

N/A

0.024300s

tokenizer_delims_ws

Passed

N/A

0.024167s

tokenizer_keywords_nows

Passed

N/A

0.046097s

tokenizer_keywords_ws

Passed

N/A

0.024624s

tokenizer_minimal_nows

Passed

N/A

0.032198s

tokenizer_minimal_ws

Passed

N/A

0.028654s

tokenizer_quotes_nows

Passed

N/A

0.025658s

tokenizer_quotes_ws

Passed

N/A

0.025093s

atf/tools/process_test

0.287784s

argv_array_assign

Passed

N/A

0.028031s

argv_array_copy

Passed

N/A

0.026047s

argv_array_exec_argv

Passed

N/A

0.025432s

argv_array_init_carray

Passed

N/A

0.027781s

argv_array_init_col

Passed

N/A

0.025807s

argv_array_init_empty

Passed

N/A

0.027241s

argv_array_init_varargs

Passed

N/A

0.027101s

argv_array_iter

Passed

N/A

0.023705s

exec_failure

Passed

N/A

0.035242s

exec_success

Passed

N/A

0.033702s

atf/tools/reader_test

0.897016s

tps_1

Passed

N/A

0.029822s

tps_2

Passed

N/A

0.028180s

tps_3

Passed

N/A

0.028847s

tps_4

Passed

N/A

0.029049s

tps_5

Passed

N/A

0.027972s

tps_50

Passed

N/A

0.039043s

tps_51

Passed

N/A

0.040890s

tps_52

Passed

N/A

0.038732s

tps_53

Passed

N/A

0.042513s

tps_54

Passed

N/A

0.046238s

tps_55

Passed

N/A

0.043293s

tps_56

Passed

N/A

0.042775s

tps_57

Passed

N/A

0.041992s

tps_58

Passed

N/A

0.042254s

tps_59

Passed

N/A

0.041557s

tps_6

Passed

N/A

0.028667s

tps_60

Passed

N/A

0.041343s

tps_61

Passed

N/A

0.041502s

tps_62

Passed

N/A

0.042177s

tps_63

Passed

N/A

0.040455s

tps_64

Passed

N/A

0.042705s

tps_65

Passed

N/A

0.040857s

tps_66

Passed

N/A

0.039448s

atf/tools/requirements_test

0.992529s

require_arch_many_fail

Passed

N/A

0.025644s

require_arch_many_ok

Passed

N/A

0.025552s

require_arch_one_fail

Passed

N/A

0.025570s

require_arch_one_ok

Passed

N/A

0.025060s

require_config_many_fail

Passed

N/A

0.027149s

require_config_many_ok

Passed

N/A

0.027623s

require_config_one_fail

Passed

N/A

0.027517s

require_config_one_ok

Passed

N/A

0.027032s

require_files_many_fail

Passed

N/A

0.040701s

require_files_many_missing

Passed

N/A

0.042358s

require_files_many_ok

Passed

N/A

0.027104s

require_files_one_fail

Passed

N/A

0.041642s

require_files_one_missing

Passed

N/A

0.039406s

require_files_one_ok

Passed

N/A

0.026734s

require_machine_many_fail

Passed

N/A

0.028443s

require_machine_many_ok

Passed

N/A

0.028254s

require_machine_one_fail

Passed

N/A

0.026461s

require_machine_one_ok

Passed

N/A

0.025099s

require_memory_fail

Passed

N/A

0.038928s

require_memory_not_enough

Passed

N/A

0.025399s

require_memory_ok

Passed

N/A

0.026584s

require_progs_many_fail

Passed

N/A

0.042909s

require_progs_many_missing

Passed

N/A

0.044587s

require_progs_many_ok

Passed

N/A

0.041614s

require_progs_one_fail

Passed

N/A

0.038839s

require_progs_one_missing

Passed

N/A

0.040071s

require_progs_one_ok

Passed

N/A

0.041542s

require_user_fail

Passed

N/A

0.041529s

require_user_root

Passed

N/A

0.027463s

require_user_unprivileged

Passed

N/A

0.025572s

atf/tools/signals_test

0.148901s

reset

Passed

N/A

0.027099s

signal_holder_destructor

Passed

N/A

0.023340s

signal_holder_preserve

Passed

N/A

0.023411s

signal_holder_process

Passed

N/A

0.023612s

signal_programmer_preserve

Passed

N/A

0.023204s

signal_programmer_program

Passed

N/A

0.023429s

atf/tools/test_program_test

1.428908s

atf_tps_writer

Passed

N/A

0.100373s

get_metadata_bad

Passed

N/A

0.061431s

get_metadata_several_tcs

Passed

N/A

0.042631s

get_metadata_zero_tcs

Passed

N/A

0.058999s

parse_test_case_result_expected_death

Passed

N/A

0.045088s

parse_test_case_result_expected_exit

Passed

N/A

0.043651s

parse_test_case_result_expected_failure

Passed

N/A

0.042066s

parse_test_case_result_expected_signal

Passed

N/A

0.041779s

parse_test_case_result_expected_timeout

Passed

N/A

0.042386s

parse_test_case_result_failed

Passed

N/A

0.042808s

parse_test_case_result_passed

Passed

N/A

0.042989s

parse_test_case_result_skipped

Passed

N/A

0.041202s

parse_test_case_result_unknown

Passed

N/A

0.043197s

read_test_case_result_empty_file

Passed

N/A

0.041572s

read_test_case_result_failed

Passed

N/A

0.026845s

read_test_case_result_invalid

Passed

N/A

0.040979s

read_test_case_result_multiline

Passed

N/A

0.029032s

read_test_case_result_no_file

Passed

N/A

0.041089s

read_test_case_result_skipped

Passed

N/A

0.027669s

tp_1

Passed

N/A

0.026199s

tp_2

Passed

N/A

0.026789s

tp_3

Passed

N/A

0.028853s

tp_4

Passed

N/A

0.025651s

tp_50

Passed

N/A

0.044237s

tp_51

Passed

N/A

0.043557s

tp_52

Passed

N/A

0.026895s

tp_53

Passed

N/A

0.040404s

tp_54

Passed

N/A

0.040839s

tp_55

Passed

N/A

0.041567s

tp_56

Passed

N/A

0.040869s

tp_57

Passed

N/A

0.040159s

tp_58

Passed

N/A

0.039762s

tp_59

Passed

N/A

0.040087s

tp_60

Passed

N/A

0.040753s

atf/tools/text_test

0.325423s

duplicate

Passed

N/A

0.023700s

join

Passed

N/A

0.026025s

match

Passed

N/A

0.039998s

split

Passed

N/A

0.027183s

split_delims

Passed

N/A

0.026563s

to_bool

Passed

N/A

0.042374s

to_bytes

Passed

N/A

0.040609s

to_string

Passed

N/A

0.026325s

to_type

Passed

N/A

0.041138s

trim

Passed

N/A

0.023873s

atf/tools/ui_test

0.163813s

paragraphs

Passed

N/A

0.027887s

w_tag_col

Passed

N/A

0.027394s

w_tag_no_repeat

Passed

N/A

0.027238s

w_tag_repeat

Passed

N/A

0.027387s

wo_tag

Passed

N/A

0.025446s

wo_tag_col

Passed

N/A

0.025161s

atf/tools/user_test

0.104440s

euid

Passed

N/A

0.026230s

is_member_of_group

Passed

N/A

0.026496s

is_root

Passed

N/A

0.025662s

is_unprivileged

Passed

N/A

0.023626s

atf/tools/atf-config_test

12.180999s

list_all

Passed

N/A

0.651441s

override_env

Passed

N/A

5.444145s

query_mixture

Passed

N/A

1.611245s

query_multiple

Passed

N/A

0.177766s

query_one

Passed

N/A

1.341059s

query_one_terse

Passed

N/A

2.793637s

query_unknown

Passed

N/A

0.155651s

atf/tools/atf-report_test

6.711294s

default

Passed

N/A

0.615984s

expect

Passed

N/A

2.646255s

oflag

Passed

N/A

1.187269s

output_csv

Passed

N/A

0.571866s

output_ticker

Passed

N/A

0.573054s

output_xml

Passed

N/A

0.577266s

output_xml_space

Passed

N/A

0.367589s

too_many_args

Passed

N/A

0.153318s

atf/tools/atf-run_test

65.283587s

atffile

Passed

N/A

2.904052s

atffile_recursive

Passed

N/A

1.502048s

broken_results

Passed

N/A

0.861641s

broken_tp_list

Passed

N/A

0.754940s

cleanup_curdir

Passed

N/A

0.815554s

cleanup_fail

Passed

N/A

0.827412s

cleanup_mount

Passed

N/A

1.167746s

cleanup_pass

Passed

N/A

0.851829s

cleanup_signal

Passed

N/A

0.109121s

cleanup_skip

Passed

N/A

0.851177s

cleanup_symlink

Passed

N/A

1.210403s

config

Passed

N/A

2.908032s

exit_codes

Passed

N/A

0.840980s

expect

Passed

N/A

1.966747s

fds

Passed

N/A

0.827472s

hooks

Passed

N/A

2.510953s

ignore_deprecated_use_fs

Passed

N/A

0.818499s

isolation_env

Passed

N/A

1.343596s

isolation_home

Passed

N/A

0.801341s

isolation_stdin

Passed

N/A

0.835708s

isolation_umask

Passed

N/A

0.820033s

missing_results

Passed

N/A

0.856119s

mux_streams

Passed

N/A

6.579564s

no_warnings

Passed

N/A

0.797310s

require_arch

Passed

N/A

6.058255s

require_config

Passed

N/A

2.033668s

require_files

Passed

N/A

3.361148s

require_machine

Passed

N/A

6.123940s

require_progs

Passed

N/A

3.379373s

require_user_bad

Passed

N/A

0.758634s

require_user_root

Passed

N/A

0.818743s

require_user_unprivileged

Passed

N/A

0.779967s

signaled

Passed

N/A

0.914446s

timeout

Passed

N/A

2.795194s

timeout_forkexit

Passed

N/A

0.809401s

vflag

Passed

N/A

2.856642s

zero_tcs

Passed

N/A

0.778725s

Failed test cases summary

Test case

Result

Reason

Duration

kernel/t_ptrace_wait

1.015679s

fpregs2

Failed

/usr/src/tests/kernel/t_ptrace_wait.c:3894: ptrace(PT_SETFPREGS, child, &r, 0) != -1 not met

0.019818s

kernel/t_ptrace_wait3

0.982063s

fpregs2

Failed

/usr/src/tests/kernel/t_ptrace_wait.c:3894: ptrace(PT_SETFPREGS, child, &r, 0) != -1 not met

0.021412s

kernel/t_ptrace_wait4

1.257693s

fork1

Failed

/usr/src/tests/kernel/t_ptrace_wait.h:295: Reported exited process

0.022996s

fpregs2

Failed

/usr/src/tests/kernel/t_ptrace_wait.c:3894: ptrace(PT_SETFPREGS, child, &r, 0) != -1 not met

0.020146s

kernel/t_ptrace_wait6

1.251809s

fork1

Failed

/usr/src/tests/kernel/t_ptrace_wait.h:295: Reported exited process

0.022620s

fpregs2

Failed

/usr/src/tests/kernel/t_ptrace_wait.c:3894: ptrace(PT_SETFPREGS, child, &r, 0) != -1 not met

0.021025s

kernel/t_ptrace_waitid

302.271006s

fork1

Failed

/usr/src/tests/kernel/t_ptrace_wait.c:1152: ptrace(PT_GET_PROCESS_STATE, child2, &state, slen) != -1 not met

0.022550s

fpregs2

Failed

/usr/src/tests/kernel/t_ptrace_wait.c:3894: ptrace(PT_SETFPREGS, child, &r, 0) != -1 not met

0.021755s

vfork1

Failed

Test case timed out after 300 seconds

301.018034s

kernel/t_ptrace_waitpid

1.256345s

fork1

Failed

/usr/src/tests/kernel/t_ptrace_wait.h:295: Reported exited process

0.024593s

fpregs2

Failed

/usr/src/tests/kernel/t_ptrace_wait.c:3894: ptrace(PT_SETFPREGS, child, &r, 0) != -1 not met

0.021287s

lib/libc/sys/t_mprotect

0.083754s

mprotect_pax

Failed

non-executable mapping made executable

0.013430s

lib/libpthread/t_timedmutex

85.458442s

mutex6

Failed

/usr/src/tests/lib/libpthread/t_mutex.c:524: start != 1

21.219746s

net/net/t_mtudisc

301.217002s

mtudisc_basic

Failed

Test case timed out after 300 seconds

301.213462s

net/npf/t_npf

2.185178s

npf_table

Failed

atf-check failed; see the output of the test for details

0.394452s

sbin/gpt/t_gpt

4.377443s

migrate_disklabel

Failed

atf-check failed; see the output of the test for details

0.255723s

recover_backup

Failed

atf-check failed; see the output of the test for details

0.314775s

Expected failures summary

Test case

Result

Reason

Duration

include/t_errno

0.014494s

errno_constants

Expected failure

PR standards/44921: 2 checks failed as expected; see output for more details

0.013314s

include/t_netdb

0.014421s

netdb_constants

Expected failure

PR standards/44777: 2 checks failed as expected; see output for more details

0.013839s

kernel/t_ptrace_wait4

1.257693s

vfork1

Expected failure

PR kern/51630: /usr/src/tests/kernel/t_ptrace_wait.h:305: WSTOPSIG(status) != expected: Unexpected stop signal received [Child exited] != [Trace/BPT trap]

0.020750s

kernel/t_ptrace_wait6

1.251809s

vfork1

Expected failure

PR kern/51630: /usr/src/tests/kernel/t_ptrace_wait.h:305: WSTOPSIG(status) != expected: Unexpected stop signal received [Child exited] != [Trace/BPT trap]

0.022653s

kernel/t_ptrace_waitpid

1.256345s

vfork1

Expected failure

PR kern/51630: /usr/src/tests/kernel/t_ptrace_wait.h:305: WSTOPSIG(status) != expected: Unexpected stop signal received [Child exited] != [Trace/BPT trap]

0.021445s

lib/libc/c063/t_fexecve

0.018653s

fexecve

Expected failure

fexecve not implemented: /usr/src/tests/lib/libc/c063/t_fexecve.c:85: access("test", F_OK) == 0 not met

0.018121s

lib/libc/regex/t_regex_att

0.134968s

leftassoc

Expected failure

Reason for breakage unknown: /usr/src/tests/lib/libc/regex/t_regex_att.c:377: res != matches ((0,4)(0,2)(2,3)(3,4) != (0,4)(0,1)(1,4)(4,4)): at line 3

0.012729s

lib/libc/sys/t_getrusage

9.235104s

getrusage_utime_back

Expected failure

PR kern/30115: anticipated error did not occur

9.193666s

getrusage_utime_zero

Expected failure

PR kern/30115: zero user time from getrusage(2)

0.014661s

lib/libtre/t_regex_att

0.204279s

rightassoc

Expected failure

Reason for breakage unknown: /usr/src/tests/lib/libtre/../libc/regex/t_regex_att.c:377: res != matches ((0,4)(0,1)(1,4)(4,4) != (0,4)(0,2)(2,3)(3,4)): at line 3

0.020073s

lib/libusbhid/t_usbhid

0.093916s

check_hid_get_data

Expected failure

only the 32-bit opcode works, 8 and 16-bit is broken: 4 checks failed as expected; see output for more details

0.015033s

check_hid_logical_range

Expected failure

only the 32-bit opcode works, 8 and 16-bit is broken: 4 checks failed as expected; see output for more details

0.015305s

check_hid_physical_range

Expected failure

only the 32-bit opcode works, 8 and 16-bit is broken: 4 checks failed as expected; see output for more details

0.015455s

lib/librumphijack/t_tcpip

4.470628s

ssh

Expected failure

PR lib/50174: atf-check failed; see the output of the test for details

1.391573s

net/if/t_compat

0.187698s

OOSIOCGIFBRDADDR

Expected failure

PR kern/51610: rump does not include COMPAT_43: /usr/src/tests/net/if/t_compat.c:72: rump_sys_ioctl(fd, ((((unsigned long)0x80000000|(unsigned long)0x40000000)) | (((sizeof(struct oifreq)) & 0x1fff) << 16) | ((('i')) << 8) | ((18))), &ifreq): Inappropriate ioctl for device

0.185693s

sbin/resize_ffs/t_shrink

38.879890s

shrink_24M_16M_v2_4096

Expected failure

PR bin/44205: atf-check failed; see the output of the test for details

11.152219s

sbin/resize_ffs/t_shrink_swapped

40.836428s

shrink_24M_16M_v2_16384

Expected failure

PR bin/44205: atf-check failed; see the output of the test for details

11.404094s

usr.bin/make/t_make

42.357007s

escape

Expected failure

see PR toolchain/49085: atf-check failed; see the output of the test for details

0.961011s

impsrc

Expected failure

see PR toolchain/49085: atf-check failed; see the output of the test for details

0.900250s

phony_end

Expected failure

see PR toolchain/49085: atf-check failed; see the output of the test for details

0.813147s

posix1

Expected failure

see PR toolchain/49085: atf-check failed; see the output of the test for details

1.382067s

suffixes

Expected failure

see PR toolchain/49085: this uses up all memory and then fails

0.527249s

usr.bin/sed/t_sed

1.359084s

emptybackref

Expected failure

PR bin/28126: atf-check failed; see the output of the test for details

0.200268s

usr.sbin/useradd/t_useradd

0.352519s

longname

Expected failure

PR bin/39546: atf-check failed; see the output of the test for details

0.351947s

fs/ffs/t_mount

0.410745s

48Kimage

Expected failure

PR kern/43573: mount failed: Invalid argument

0.117690s

fs/nfs/t_mountd

0.844548s

mountdhup

Expected failure

PR kern/5844: op failed with EACCES

0.839175s

fs/vfs/t_renamerace

116.555531s

msdosfs_renamerace

Expected failure

PR kern/43626: unmount failed: Device busy

5.344805s

msdosfs_renamerace_dirs

Expected signal

PR kern/43626

0.643925s

udf_renamerace

Expected failure

PR kern/49046: race did not trigger this time

5.311508s

fs/vfs/t_vfsops

28.222161s

lfs_tfhremove

Expected failure

fhopen() for removed file succeeds (PR kern/43745): /usr/src/tests/fs/vfs/t_vfsops.c:152: Expected true value in rump_sys_fhopen(fhp, fhsize, O_RDONLY) == -1

0.385480s

ipf/t_filter_exec

16.368762s

f26

Expected failure

Known to be broken: results differ

0.429415s

f27

Expected failure

Known to be broken: results differ

0.448157s

ipf/t_filter_parse

3.763089s

i17

Expected failure

Known to be broken: atf-check failed; see the output of the test for details

0.164371s

ipf/t_nat_exec

10.607532s

n8_6

Expected failure

See PR kern/47665: results differ

0.224093s

n9_6

Expected failure

See PR kern/47665: results differ

0.225874s

atf/atf-c/macros_test

1.351334s

detect_unused_tests

Expected failure

PR 49187: Build of unused_test.c passed; unused test cases are not properly detected

0.370219s

atf/atf-c++/macros_test

7.100349s

detect_unused_tests

Expected failure

PR 49187: Build of unused_test.cpp passed; unused test cases are not properly detected

2.344062s

Skipped test cases summary

Test case

Result

Reason

Duration

include/t_paths

0.013928s

paths

Skipped

PR port-sparc/45580

0.013169s

kernel/t_ptrace

0.074767s

attach_pid1_securelevel

Skipped

Test must be run with securelevel >= 1

0.013412s

lib/libc/gen/exect/t_exect

0.013924s

t_exect_null

Skipped

exect(3) misdesigned and hangs - PR port-amd64/51700

0.013048s

lib/libc/string/t_popcount

0.024611s

popcount_basic

Skipped

config variable "run_popcount" not set to YES/TRUE

0.011842s

popcountll_basic

Skipped

config variable "run_popcount" not set to YES/TRUE

0.011490s

lib/libc/sys/t_kevent

0.102165s

kqueue_desc_passing

Skipped

PR kern/46523

0.014438s

lib/libc/sys/t_mmap

0.193102s

mmap_block

Skipped

The test case causes a panic (PR kern/38889, kern/46592)

0.011834s

lib/libc/sys/t_mprotect

0.083754s

mprotect_exec

Skipped

Execute protection callback check not implemented

0.012987s

lib/librumphijack/t_tcpip

4.470628s

nfs_autoload

Skipped

test currently valid only on i386

0.241297s

sbin/gpt/t_gpt

4.377443s

bootable_2part

Skipped

Required file '/usr/mdec/gptmbr.bin' not found

0.000510s

fs/vfs/t_full

10.307769s

p2k_ffs_fillfs

Skipped

fs does not support explicit block allocation (GOP_ALLOC)

0.415389s

puffs_fillfs

Skipped

fs does not support explicit block allocation (GOP_ALLOC)

0.302988s

rumpfs_fillfs

Skipped

fs does not support explicit block allocation (GOP_ALLOC)

0.270146s

fs/vfs/t_renamerace

116.555531s

rumpfs_renamerace

Skipped

rename not supported by file system

0.265575s

rumpfs_renamerace_dirs

Skipped

rename not supported by file system

0.270074s

sysvbfs_renamerace

Skipped

filesystem has not enough inodes

0.314524s

sysvbfs_renamerace_dirs

Skipped

directories not supported by file system

0.301944s

fs/vfs/t_rmdirrace

125.172632s

sysvbfs_race

Skipped

directories not supported by file system

0.311704s

fs/vfs/t_union

9.728684s

ext2fs_basic

Skipped

fs does not support VOP_WHITEOUT

0.304365s

ext2fs_whiteout

Skipped

fs does not support VOP_WHITEOUT

0.360282s

msdosfs_basic

Skipped

fs does not support VOP_WHITEOUT

0.316190s

msdosfs_whiteout

Skipped

fs does not support VOP_WHITEOUT

0.337362s

nfs_basic

Skipped

fs does not support VOP_WHITEOUT

0.628983s

nfs_whiteout

Skipped

fs does not support VOP_WHITEOUT

0.692994s

p2k_ffs_basic

Skipped

fs does not support VOP_WHITEOUT

0.400392s

p2k_ffs_whiteout

Skipped

fs does not support VOP_WHITEOUT

0.442323s

puffs_basic

Skipped

fs does not support VOP_WHITEOUT

0.314203s

puffs_whiteout

Skipped

fs does not support VOP_WHITEOUT

0.335087s

sysvbfs_basic

Skipped

fs does not support VOP_WHITEOUT

0.313196s

sysvbfs_whiteout

Skipped

fs does not support VOP_WHITEOUT

0.330641s

udf_basic

Skipped

fs does not support VOP_WHITEOUT

0.327767s

udf_whiteout

Skipped

fs does not support VOP_WHITEOUT

0.351002s

v7fs_basic

Skipped

fs does not support VOP_WHITEOUT

0.325036s

v7fs_whiteout

Skipped

fs does not support VOP_WHITEOUT

0.365768s

fs/vfs/t_unpriv

19.509806s

msdosfs_owner

Skipped

owner not supported by file system

0.307883s

nfs_flags

Skipped

file flags not supported by file system

0.650881s

puffs_flags

Skipped

file flags not supported by file system

0.314065s

sysvbfs_dirperms

Skipped

directories not supported by file system

0.286086s

sysvbfs_flags

Skipped

file flags not supported by file system

0.296479s

udf_flags

Skipped

file flags not supported by file system

0.315399s

fs/vfs/t_vfsops

28.222161s

rumpfs_tfhinval

Skipped

file handles not supported

0.296666s

rumpfs_tfhremove

Skipped

file handles not supported

0.279366s

rumpfs_tfilehandle

Skipped

file handles not supported

0.289373s

sysvbfs_tfhinval

Skipped

file handles not supported

0.307558s

sysvbfs_tfhremove

Skipped

file handles not supported

0.317170s

sysvbfs_tfilehandle

Skipped

file handles not supported

0.319904s

udf_tfhinval

Skipped

file handles not supported

0.301988s

udf_tfhremove

Skipped

file handles not supported

0.315930s

udf_tfilehandle

Skipped

file handles not supported

0.322862s

v7fs_tfhinval

Skipped

file handles not supported

0.333306s

v7fs_tfhremove

Skipped

file handles not supported

0.329563s

v7fs_tfilehandle

Skipped

file handles not supported

0.306505s

fs/vfs/t_vnops

163.081466s

msdosfs_lstat_symlink

Skipped

symlinks not supported by file system

0.325017s

msdosfs_symlink_long

Skipped

symlinks not supported by file system

0.319189s

msdosfs_symlink_root

Skipped

symlinks not supported by file system

0.316661s

msdosfs_symlink_zerolen

Skipped

symlinks not supported by file system

0.325174s

rumpfs_rename_dir

Skipped

rename not supported by file system

0.316557s

rumpfs_rename_dotdot

Skipped

rename not supported by file system

0.318281s

rumpfs_rename_nametoolong

Skipped

rename not supported by file system

0.296292s

rumpfs_rename_reg_nodir

Skipped

rename not supported by file system

0.314768s

sysvbfs_dir_notempty

Skipped

directories not supported by file system

0.341441s

sysvbfs_dir_rmdirdotdot

Skipped

directories not supported by file system

0.340877s

sysvbfs_dir_simple

Skipped

directories not supported by file system

0.339269s

sysvbfs_lookup_complex

Skipped

directories not supported by file system

0.324365s

sysvbfs_lstat_symlink

Skipped

symlinks not supported by file system

0.316606s

sysvbfs_rename_dir

Skipped

directories not supported by file system

0.343162s

sysvbfs_rename_dotdot

Skipped

directories not supported by file system

0.318912s

sysvbfs_symlink_long

Skipped

symlinks not supported by file system

0.339081s

sysvbfs_symlink_root

Skipped

symlinks not supported by file system

0.319857s

sysvbfs_symlink_zerolen

Skipped

symlinks not supported by file system

0.343366s

fs/cd9660/t_high_ino_big_file

0.318059s

pr_kern_48787

Skipped

not enough free disk space, have 1048344 Kbytes, need ~ 4500000 Kbytes

0.317195s

rump/rumpkern/t_kern

0.555572s

lockme_DOUBLEINIT

Skipped

test requires LOCKDEBUG kernel

0.021766s

lockme_MEMFREE

Skipped

test requires LOCKDEBUG kernel

0.021126s

lockme_RWRX

Skipped

test requires LOCKDEBUG kernel

0.020254s

rump/modautoload/t_modautoload

0.022872s

modautoload

Skipped

host kernel modules not supported

0.022229s

crypto/libcrypto/t_ciphers

4.235889s

rc5

Skipped

RC5 support not available; system built with MKCRYPTO_RC5=no

0.102958s

crypto/opencrypto/t_opencrypto

5.387673s

arc4

Skipped

ARC4 not implemented by swcrypto

0.275531s

share/examples/t_asm

0.367887s

hello

Skipped

Example program not implemented on this platform

0.366975s

atf/atf-c/pkg_config_test

0.003675s

build

Skipped

Required program 'pkg-config' not found in the PATH

0.001687s

version

Skipped

Required program 'pkg-config' not found in the PATH

0.001902s

atf/atf-c++/pkg_config_test

0.003290s

build

Skipped

Required program 'pkg-config' not found in the PATH

0.001569s

version

Skipped

Required program 'pkg-config' not found in the PATH

0.001632s

Execution details

Environment variables

Test case: include/t_errno/errno_constants

Duration: 0.013314 seconds

Termination reason

XFAIL: PR standards/44921: 2 checks failed as expected; see output for more details

Standard error stream

*** Expected check failure: PR standards/44921: ENOTRECOVERABLE not defined
*** Expected check failure: PR standards/44921: EOWNERDEAD not defined

Test case: include/t_netdb/netdb_constants

Duration: 0.013839 seconds

Termination reason

XFAIL: PR standards/44777: 2 checks failed as expected; see output for more details

Standard error stream

*** Expected check failure: PR standards/44777: AI_V4MAPPED not defined
*** Expected check failure: PR standards/44777: AI_ALL not defined

Test case: include/t_paths/paths

Duration: 0.013169 seconds

Termination reason

SKIPPED: PR port-sparc/45580

Test case: kernel/t_ptrace/attach_pid1_securelevel

Duration: 0.013412 seconds

Termination reason

SKIPPED: Test must be run with securelevel >= 1

Test case: kernel/t_ptrace_wait/fpregs2

Duration: 0.019818 seconds

Termination reason

FAILED: /usr/src/tests/kernel/t_ptrace_wait.c:3894: ptrace(PT_SETFPREGS, child, &r, 0) != -1 not met

Standard output stream

Before forking process PID=10748
Parent process PID=10748, child's PID=11613
Before calling wait() for the child
Before calling PT_TRACE_ME from child 11613
Before raising Stopped (signal) from child
Call GETFPREGS for the child process
Call SETFPREGS for the child (without changed regs)

Test case: kernel/t_ptrace_wait3/fpregs2

Duration: 0.021412 seconds

Termination reason

FAILED: /usr/src/tests/kernel/t_ptrace_wait.c:3894: ptrace(PT_SETFPREGS, child, &r, 0) != -1 not met

Standard output stream

Before forking process PID=11205
Parent process PID=11205, child's PID=22436
Before calling wait3() for the child
Before calling PT_TRACE_ME from child 22436
Before raising Stopped (signal) from child
Call GETFPREGS for the child process
Call SETFPREGS for the child (without changed regs)

Test case: kernel/t_ptrace_wait4/fork1

Duration: 0.022996 seconds

Termination reason

FAILED: /usr/src/tests/kernel/t_ptrace_wait.h:295: Reported exited process

Standard output stream

Before forking process PID=22036
Parent process PID=22036, child's PID=11148
Before calling wait4() for the child
Before calling PT_TRACE_ME from child 11148
Before raising Stopped (signal) from child
Enable PTRACE_FORK in EVENT_MASK for the child 11148
Before resuming the child process where it left off and without signal to be sent
Before calling wait4() for the child 11148
Reported PTRACE_FORK event with forkee 11221
Before calling wait4() for the forkee 11221 of the child 11148

Test case: kernel/t_ptrace_wait4/fpregs2

Duration: 0.020146 seconds

Termination reason

FAILED: /usr/src/tests/kernel/t_ptrace_wait.c:3894: ptrace(PT_SETFPREGS, child, &r, 0) != -1 not met

Standard output stream

Before forking process PID=11068
Parent process PID=11068, child's PID=21858
Before calling wait4() for the child
Before calling PT_TRACE_ME from child 21858
Before raising Stopped (signal) from child
Call GETFPREGS for the child process
Call SETFPREGS for the child (without changed regs)

Test case: kernel/t_ptrace_wait4/vfork1

Duration: 0.020750 seconds

Termination reason

XFAIL: PR kern/51630: /usr/src/tests/kernel/t_ptrace_wait.h:305: WSTOPSIG(status) != expected: Unexpected stop signal received [Child exited] != [Trace/BPT trap]

Standard output stream

Before forking process PID=11276
Parent process PID=11276, child's PID=18187
Before calling wait4() for the child
Before calling PT_TRACE_ME from child 18187
Before raising Stopped (signal) from child
Enable PTRACE_VFORK in EVENT_MASK for the child 18187
Before resuming the child process where it left off and without signal to be sent
Before calling wait4() for the child 18187

Test case: kernel/t_ptrace_wait6/fork1

Duration: 0.022620 seconds

Termination reason

FAILED: /usr/src/tests/kernel/t_ptrace_wait.h:295: Reported exited process

Standard output stream

Before forking process PID=22456
Parent process PID=22456, child's PID=10610
Before calling wait6() for the child
Before calling PT_TRACE_ME from child 10610
Before raising Stopped (signal) from child
Enable PTRACE_FORK in EVENT_MASK for the child 10610
Before resuming the child process where it left off and without signal to be sent
Before calling wait6() for the child 10610
Reported PTRACE_FORK event with forkee 18928
Before calling wait6() for the forkee 18928 of the child 10610

Test case: kernel/t_ptrace_wait6/fpregs2

Duration: 0.021025 seconds

Termination reason

FAILED: /usr/src/tests/kernel/t_ptrace_wait.c:3894: ptrace(PT_SETFPREGS, child, &r, 0) != -1 not met

Standard output stream

Before forking process PID=11413
Parent process PID=11413, child's PID=22228
Before calling wait6() for the child
Before calling PT_TRACE_ME from child 22228
Before raising Stopped (signal) from child
Call GETFPREGS for the child process
Call SETFPREGS for the child (without changed regs)

Test case: kernel/t_ptrace_wait6/vfork1

Duration: 0.022653 seconds

Termination reason

XFAIL: PR kern/51630: /usr/src/tests/kernel/t_ptrace_wait.h:305: WSTOPSIG(status) != expected: Unexpected stop signal received [Child exited] != [Trace/BPT trap]

Standard output stream

Before forking process PID=10738
Parent process PID=10738, child's PID=22424
Before calling wait6() for the child
Before calling PT_TRACE_ME from child 22424
Before raising Stopped (signal) from child
Enable PTRACE_VFORK in EVENT_MASK for the child 22424
Before resuming the child process where it left off and without signal to be sent
Before calling wait6() for the child 22424

Test case: kernel/t_ptrace_waitid/fork1

Duration: 0.022550 seconds

Termination reason

FAILED: /usr/src/tests/kernel/t_ptrace_wait.c:1152: ptrace(PT_GET_PROCESS_STATE, child2, &state, slen) != -1 not met

Standard output stream

Before forking process PID=20923
Parent process PID=20923, child's PID=20443
Before calling waitid() for the child
Before calling PT_TRACE_ME from child 20443
Before raising Stopped (signal) from child
Enable PTRACE_FORK in EVENT_MASK for the child 20443
Before resuming the child process where it left off and without signal to be sent
Before calling waitid() for the child 20443
Reported PTRACE_FORK event with forkee 25143
Before calling waitid() for the forkee 25143 of the child 20443

Test case: kernel/t_ptrace_waitid/fpregs2

Duration: 0.021755 seconds

Termination reason

FAILED: /usr/src/tests/kernel/t_ptrace_wait.c:3894: ptrace(PT_SETFPREGS, child, &r, 0) != -1 not met

Standard output stream

Before forking process PID=19120
Parent process PID=19120, child's PID=22648
Before calling waitid() for the child
Before calling PT_TRACE_ME from child 22648
Before raising Stopped (signal) from child
Call GETFPREGS for the child process
Call SETFPREGS for the child (without changed regs)

Test case: kernel/t_ptrace_waitid/vfork1

Duration: 301.018034 seconds

Termination reason

FAILED: Test case timed out after 300 seconds

Standard output stream

Before forking process PID=20571
Parent process PID=20571, child's PID=10145
Before calling waitid() for the child
Before calling PT_TRACE_ME from child 10145
Before raising Stopped (signal) from child
Enable PTRACE_VFORK in EVENT_MASK for the child 10145
Before resuming the child process where it left off and without signal to be sent
Before calling waitid() for the child 10145
Reported PTRACE_VFORK event with forkee 0
Before calling waitid() for the forkee 0 of the child 10145

Test case: kernel/t_ptrace_waitpid/fork1

Duration: 0.024593 seconds

Termination reason

FAILED: /usr/src/tests/kernel/t_ptrace_wait.h:295: Reported exited process

Standard output stream

Before forking process PID=11434
Parent process PID=11434, child's PID=11987
Before calling waitpid() for the child
Before calling PT_TRACE_ME from child 11987
Before raising Stopped (signal) from child
Enable PTRACE_FORK in EVENT_MASK for the child 11987
Before resuming the child process where it left off and without signal to be sent
Before calling waitpid() for the child 11987
Reported PTRACE_FORK event with forkee 25335
Before calling waitpid() for the forkee 25335 of the child 11987

Test case: kernel/t_ptrace_waitpid/fpregs2

Duration: 0.021287 seconds

Termination reason

FAILED: /usr/src/tests/kernel/t_ptrace_wait.c:3894: ptrace(PT_SETFPREGS, child, &r, 0) != -1 not met

Standard output stream

Before forking process PID=10994
Parent process PID=10994, child's PID=22680
Before calling waitpid() f