ATF Tests Results

Execution summary

Item

Value

ATF

Version

Automated Testing Framework 0.20 (atf-0.20)

Timings

Start time of tests

Tue Dec 13 21:25:11 CET 2016

End time of tests

Tue Dec 13 21:52:11 CET 2016

System information

Host name

thirdstage.duskware.de

Operating system

NetBSD

Operating system release

7.99.47

Operating system version

NetBSD 7.99.47 (MODULAR) #582: Tue Dec 13 10:32:34 CET 2016 martin@thirdstage.duskware.de:/usr/src/sys/arch/sparc64/compile/MODULAR

Platform

sparc64

Tests results

Root

/usr/tests

Test programs

675

Bogus test programs

0

Test cases

4781

Passed test cases

4644

Failed test cases

18

Expected failures

37

Skipped test cases

82

See more execution details

Test cases summary

Test case

Result

Reason

Duration

bin/cat/t_cat

0.531417s

align

Passed

N/A

0.240188s

nonexistent

Passed

N/A

0.150623s

se_output

Passed

N/A

0.138392s

bin/cp/t_cp

2.331052s

dir_to_dir

Passed

N/A

0.543521s

dir_to_file

Passed

N/A

0.180219s

file_over_link

Passed

N/A

0.149816s

file_to_file

Passed

N/A

0.333422s

file_to_link

Passed

N/A

0.157158s

file_to_linkdir

Passed

N/A

0.218909s

files_to_dir

Passed

N/A

0.184901s

link_over_file

Passed

N/A

0.158068s

link_to_file

Passed

N/A

0.184082s

linkdir_to_file

Passed

N/A

0.199538s

bin/dd/t_dd

1.006968s

io

Passed

N/A

0.499516s

length

Passed

N/A

0.195993s

seek

Passed

N/A

0.308404s

bin/df/t_df

0.310277s

hflag

Passed

N/A

0.165683s

normal

Passed

N/A

0.142952s

bin/expr/t_expr

2.020196s

arithmetic_ops

Passed

N/A

0.164875s

basic_functional

Passed

N/A

0.137578s

basic_math

Passed

N/A

0.114329s

colon_vs_math

Passed

N/A

0.117911s

compare_ops

Passed

N/A

0.230025s

compare_ops_precedence

Passed

N/A

0.106549s

gtkmm

Passed

N/A

0.152163s

lang

Passed

N/A

0.200998s

math_precedence

Passed

N/A

0.108438s

multiply

Passed

N/A

0.114847s

negative

Passed

N/A

0.138712s

overflow

Passed

N/A

0.215700s

precedence

Passed

N/A

0.106245s

regex

Passed

N/A

0.103878s

bin/pax/t_pax

0.297149s

append

Passed

N/A

0.295714s

bin/ps/t_ps

3.092959s

default_columns

Passed

N/A

0.889946s

duplicate_column

Passed

N/A

0.234504s

minus_O

Passed

N/A

0.305937s

minus_o

Passed

N/A

0.387861s

override_heading_all_null

Passed

N/A

0.257570s

override_heading_embedded_specials

Passed

N/A

0.328925s

override_heading_simple

Passed

N/A

0.301110s

override_heading_some_null

Passed

N/A

0.380854s

bin/sh/dotcmd/t_dotcmd

-3299.223240s

case_break_case

Passed

N/A

0.214356s

case_break_compound

Passed

N/A

0.200022s

case_break_file

Passed

N/A

0.198288s

case_break_for

Passed

N/A

0.194999s

case_break_func

Passed

N/A

0.191661s

case_break_subshell

Passed

N/A

0.192698s

case_break_until

Passed

N/A

0.193769s

case_break_while

Passed

N/A

0.190709s

case_continue_case

Passed

N/A

0.196019s

case_continue_compound

Passed

N/A

0.199203s

case_continue_file

Passed

N/A

0.189694s

case_continue_for

Passed

N/A

0.272529s

case_continue_func

Passed

N/A

0.213134s

case_continue_subshell

Passed

N/A

0.195451s

case_continue_until

Passed

N/A

0.193510s

case_continue_while

Passed

N/A

0.189410s

case_return_case

Passed

N/A

0.201576s

case_return_compound

Passed

N/A

0.192849s

case_return_file

Passed

N/A

0.193691s

case_return_for

Passed

N/A

0.189472s

case_return_func

Passed

N/A

0.189859s

case_return_subshell

Passed

N/A

0.209713s

case_return_until

Passed

N/A

0.193254s

case_return_while

Passed

N/A

0.190463s

compound_break_case

Passed

N/A

0.193552s

compound_break_compound

Passed

N/A

0.189538s

compound_break_file

Passed

N/A

0.193835s

compound_break_for

Passed

N/A

0.189234s

compound_break_func

Passed

N/A

0.190276s

compound_break_subshell

Passed

N/A

0.195881s

compound_break_until

Passed

N/A

0.196441s

compound_break_while

Passed

N/A

0.195159s

compound_continue_case

Passed

N/A

0.197792s

compound_continue_compound

Passed

N/A

0.191046s

compound_continue_file

Passed

N/A

0.192286s

compound_continue_for

Passed

N/A

0.189064s

compound_continue_func

Passed

N/A

0.191201s

compound_continue_subshell

Passed

N/A

0.194471s

compound_continue_until

Passed

N/A

0.198384s

compound_continue_while

Passed

N/A

0.189701s

compound_return_case

Passed

N/A

0.192057s

compound_return_compound

Passed

N/A

0.197883s

compound_return_file

Passed

N/A

0.196896s

compound_return_for

Passed

N/A

0.197950s

compound_return_func

Passed

N/A

0.197434s

compound_return_subshell

Passed

N/A

0.204544s

compound_return_until

Passed

N/A

0.199552s

compound_return_while

Passed

N/A

0.201637s

file_break_case

Passed

N/A

0.192090s

file_break_compound

Passed

N/A

0.191865s

file_break_file

Passed

N/A

0.189841s

file_break_for

Passed

N/A

0.189728s

file_break_func

Passed

N/A

0.195173s

file_break_subshell

Passed

N/A

0.199904s

file_break_until

Passed

N/A

0.189235s

file_break_while

Passed

N/A

0.189009s

file_continue_case

Passed

N/A

0.189556s

file_continue_compound

Passed

N/A

0.198166s

file_continue_file

Passed

N/A

0.193491s

file_continue_for

Passed

N/A

0.190274s

file_continue_func

Passed

N/A

0.191425s

file_continue_subshell

Passed

N/A

0.205314s

file_continue_until

Passed

N/A

0.282871s

file_continue_while

Passed

N/A

0.217065s

file_return_case

Passed

N/A

0.206255s

file_return_compound

Passed

N/A

0.203228s

file_return_file

Passed

N/A

0.201654s

file_return_for

Passed

N/A

0.198352s

file_return_func

Passed

N/A

0.190440s

file_return_subshell

Passed

N/A

0.198776s

file_return_until

Passed

N/A

0.203817s

file_return_while

Passed

N/A

0.200180s

for_break_case

Passed

N/A

0.197039s

for_break_compound

Passed

N/A

0.196724s

for_break_file

Passed

N/A

0.196549s

for_break_for

Passed

N/A

0.197470s

for_break_func

Passed

N/A

0.205089s

for_break_subshell

Passed

N/A

0.204719s

for_break_until

Passed

N/A

0.192102s

for_break_while

Passed

N/A

0.189587s

for_continue_case

Passed

N/A

0.189952s

for_continue_compound

Passed

N/A

0.189982s

for_continue_file

Passed

N/A

0.190524s

for_continue_for

Passed

N/A

0.198661s

for_continue_func

Passed

N/A

0.192027s

for_continue_subshell

Passed

N/A

0.201160s

for_continue_until

Passed

N/A

0.198593s

for_continue_while

Passed

N/A

0.194023s

for_return_case

Passed

N/A

0.189163s

for_return_compound

Passed

N/A

0.191017s

for_return_file

Passed

N/A

0.197681s

for_return_for

Passed

N/A

0.203056s

for_return_func

Passed

N/A

0.199003s

for_return_subshell

Passed

N/A

0.209228s

for_return_until

Passed

N/A

0.200589s

for_return_while

Passed

N/A

0.197896s

func_break_case

Passed

N/A

0.198701s

func_break_compound

Passed

N/A

0.201158s

func_break_file

Passed

N/A

0.196308s

func_break_for

Passed

N/A

0.194119s

func_break_func

Passed

N/A

0.195726s

func_break_subshell

Passed

N/A

0.202487s

func_break_until

Passed

N/A

0.195941s

func_break_while

Passed

N/A

0.202930s

func_continue_case

Passed

N/A

0.198905s

func_continue_compound

Passed

N/A

0.197548s

func_continue_file

Passed

N/A

0.198434s

func_continue_for

Passed

N/A

0.196289s

func_continue_func

Passed

N/A

0.201823s

func_continue_subshell

Passed

N/A

0.203779s

func_continue_until

Passed

N/A

0.198158s

func_continue_while

Passed

N/A

0.201814s

func_return_case

Passed

N/A

0.306699s

func_return_compound

Passed

N/A

0.199869s

func_return_file

Passed

N/A

0.196472s

func_return_for

Passed

N/A

0.199467s

func_return_func

Passed

N/A

0.202683s

func_return_subshell

Passed

N/A

0.200985s

func_return_until

Passed

N/A

0.200828s

func_return_while

Passed

N/A

0.197116s

subshell_break_case

Passed

N/A

0.206470s

subshell_break_compound

Passed

N/A

0.198717s

subshell_break_file

Passed

N/A

0.199026s

subshell_break_for

Passed

N/A

0.197602s

subshell_break_func

Passed

N/A

0.200375s

subshell_break_subshell

Passed

N/A

0.199928s

subshell_break_until

Passed

N/A

0.194635s

subshell_break_while

Passed

N/A

0.197979s

subshell_continue_case

Passed

N/A

0.195075s

subshell_continue_compound

Passed

N/A

0.202141s

subshell_continue_file

Passed

N/A

0.196298s

subshell_continue_for

Passed

N/A

0.197621s

subshell_continue_func

Passed

N/A

0.201726s

subshell_continue_subshell

Passed

N/A

0.206111s

subshell_continue_until

Passed

N/A

0.200944s

subshell_continue_while

Passed

N/A

0.201382s

subshell_return_case

Passed

N/A

0.200776s

subshell_return_compound

Passed

N/A

0.201768s

subshell_return_file

Passed

N/A

0.200390s

subshell_return_for

Passed

N/A

0.202891s

subshell_return_func

Passed

N/A

0.203288s

subshell_return_subshell

Passed

N/A

0.204275s

subshell_return_until

Passed

N/A

0.204573s

subshell_return_while

Passed

N/A

0.201900s

until_break_case

Passed

N/A

0.200327s

until_break_compound

Passed

N/A

0.202520s

until_break_file

Passed

N/A

0.193688s

until_break_for

Passed

N/A

0.198325s

until_break_func

Passed

N/A

0.197189s

until_break_subshell

Passed

N/A

-3338.998104s

until_break_until

Passed

N/A

0.199893s

until_break_while

Passed

N/A

0.197179s

until_continue_case

Passed

N/A

0.196228s

until_continue_compound

Passed

N/A

0.200131s

until_continue_file

Passed

N/A

0.205403s

until_continue_for

Passed

N/A

0.192617s

until_continue_func

Passed

N/A

0.204889s

until_continue_subshell

Passed

N/A

0.203558s

until_continue_until

Passed

N/A

0.203956s

until_continue_while

Passed

N/A

0.197024s

until_return_case

Passed

N/A

0.195181s

until_return_compound

Passed

N/A

0.199430s

until_return_file

Passed

N/A

0.239567s

until_return_for

Passed

N/A

0.195765s

until_return_func

Passed

N/A

0.198118s

until_return_subshell

Passed

N/A

0.205670s

until_return_until

Passed

N/A

0.201970s

until_return_while

Passed

N/A

0.200834s

while_break_case

Passed

N/A

0.199993s

while_break_compound

Passed

N/A

0.195897s

while_break_file

Passed

N/A

0.196194s

while_break_for

Passed

N/A

0.195762s

while_break_func

Passed

N/A

0.195974s

while_break_subshell

Passed

N/A

0.201971s

while_break_until

Passed

N/A

0.202560s

while_break_while

Passed

N/A

0.197550s

while_continue_case

Passed

N/A

0.196199s

while_continue_compound

Passed

N/A

0.196830s

while_continue_file

Passed

N/A

0.208379s

while_continue_for

Passed

N/A

0.199047s

while_continue_func

Passed

N/A

0.203488s

while_continue_subshell

Passed

N/A

0.200817s

while_continue_until

Passed

N/A

0.197155s

while_continue_while

Passed

N/A

0.196715s

while_return_case

Passed

N/A

0.198845s

while_return_compound

Passed

N/A

0.198488s

while_return_file

Passed

N/A

0.197112s

while_return_for

Passed

N/A

0.197232s

while_return_func

Passed

N/A

0.196933s

while_return_subshell

Passed

N/A

0.200922s

while_return_until

Passed

N/A

0.201966s

while_return_while

Passed

N/A

0.196623s

bin/sh/t_arith

12.598645s

constants

Passed

N/A

0.747249s

do_unary_minus

Passed

N/A

0.393523s

do_unary_not

Passed

N/A

0.330867s

do_unary_plus

Passed

N/A

0.335695s

do_unary_tilde

Passed

N/A

0.300607s

elementary_add

Passed

N/A

0.522125s

elementary_div

Passed

N/A

0.474367s

elementary_eq

Passed

N/A

0.619344s

elementary_ge

Passed

N/A

0.299190s

elementary_gt

Passed

N/A

0.553547s

elementary_le

Passed

N/A

0.458618s

elementary_lt

Passed

N/A

0.424812s

elementary_mul

Passed

N/A

0.552503s

elementary_ne

Passed

N/A

0.521932s

elementary_rem

Passed

N/A

0.658155s

elementary_shl

Passed

N/A

0.409380s

elementary_shr

Passed

N/A

0.501912s

elementary_sub

Passed

N/A

0.471849s

fiddle_bits_and

Passed

N/A

0.394840s

fiddle_bits_or

Passed

N/A

0.376747s

fiddle_bits_xor

Passed

N/A

0.376611s

logical_and

Passed

N/A

0.346438s

logical_or

Passed

N/A

0.345208s

make_selection

Passed

N/A

0.347133s

operator_precedence

Passed

N/A

0.939459s

parentheses

Passed

N/A

0.877695s

bin/sh/t_cmdsub

7.396932s

a_basic_cmdsub

Passed

N/A

0.589492s

b_basic_backticks

Passed

N/A

0.589927s

c_nested_cmdsub

Passed

N/A

0.219387s

d_nested_backticks

Passed

N/A

0.221652s

e_perverse_mixing

Passed

N/A

0.305538s

f_redirect_in_cmdsub

Passed

N/A

0.340500s

g_redirect_in_backticks

Passed

N/A

0.336631s

h_vars_in_cmdsub

Passed

N/A

0.458746s

i_vars_in_backticks

Passed

N/A

0.415175s

j_cmdsub_in_varexpand

Passed

N/A

0.235234s

k_backticks_in_varexpand

Passed

N/A

0.234934s

l_arithmetic_in_cmdsub

Passed

N/A

0.206113s

m_arithmetic_in_backticks

Passed

N/A

0.205760s

n_cmdsub_in_arithmetic

Passed

N/A

0.209214s

o_backticks_in_arithmetic

Passed

N/A

0.204919s

p_cmdsub_in_heredoc

Passed

N/A

0.155974s

q_backticks_in_heredoc

Passed

N/A

0.155814s

r_heredoc_in_cmdsub

Passed

N/A

0.249958s

s_heredoc_in_backticks

Passed

N/A

0.196195s

t_nested_cmdsubs_in_heredoc

Passed

N/A

0.274061s

u_nested_backticks_in_heredoc

Passed

N/A

0.267740s

v_cmdsub_paren_tests

Passed

N/A

0.632211s

w_heredoc_outside_cmdsub

Passed

N/A

0.245080s

x_heredoc_outside_backticks

Passed

N/A

0.185644s

z_absurd_heredoc_cmdsub_combos

Passed

N/A

0.240499s

bin/sh/t_evaltested

0.115861s

evaltested

Passed

N/A

0.114793s

bin/sh/t_exit

2.378571s

background

Passed

N/A

0.166222s

function

Passed

N/A

0.141141s

readout

Passed

N/A

0.137902s

simple_exit

Passed

N/A

0.636948s

subshell_background

Passed

N/A

0.162008s

subshell_exit

Passed

N/A

0.708638s

trap_subshell

Passed

N/A

0.150472s

trap_zero__explicit_exit

Passed

N/A

0.134177s

trap_zero__implicit_exit

Passed

N/A

0.134015s

bin/sh/t_expand

2.435677s

arithmetic

Passed

N/A

0.193807s

dollar_at

Passed

N/A

0.208235s

dollar_at_with_text

Passed

N/A

0.489285s

iteration_on_null_or_missing_parameter

Passed

N/A

0.123500s

iteration_on_null_or_null_parameter

Passed

N/A

0.125899s

iteration_on_null_parameter

Passed

N/A

0.126737s

iteration_on_quoted_null_parameter

Passed

N/A

0.126570s

shell_params

Passed

N/A

0.439417s

strip

Passed

N/A

0.468445s

varpattern_backslashes

Passed

N/A

0.126738s

bin/sh/t_fsplit

3.288204s

default_val

Passed

N/A

0.657807s

dollar_at

Passed

N/A

0.569587s

for

Passed

N/A

0.116993s

ifs

Passed

N/A

0.333037s

ifs_alpha

Passed

N/A

0.242931s

quote

Passed

N/A

0.169252s

replacement_val

Passed

N/A

0.993352s

var_length

Passed

N/A

0.199149s

bin/sh/t_here

11.231751s

do_simple

Passed

N/A

0.800264s

end_markers

Passed

N/A

8.297431s

incomplete

Passed

N/A

0.568051s

lineends

Passed

N/A

0.483964s

multiple

Passed

N/A

0.283999s

nested

Passed

N/A

0.200672s

quoting

Passed

N/A

0.244627s

side_effects

Passed

N/A

0.143309s

vicious

Passed

N/A

0.203183s

bin/sh/t_option

6.980407s

Option_switching

Passed

N/A

1.540758s

restore_local_opts

Passed

N/A

0.190472s

set_C

Passed

N/A

0.434136s

set_a

Passed

N/A

0.260168s

set_e

Passed

N/A

0.260540s

set_f

Passed

N/A

0.254594s

set_n

Passed

N/A

2.444119s

set_u

Passed

N/A

0.577979s

set_v

Passed

N/A

0.316979s

set_x

Passed

N/A

0.267790s

vi_emacs_VE_toggle

Passed

N/A

0.288026s

xx_bogus

Passed

N/A

0.132582s

bin/sh/t_redir

32.129149s

basic_test_method_test

Passed

N/A

0.422059s

do_input_redirections

Passed

N/A

0.711976s

do_output_redirections

Passed

N/A

0.712902s

fd_redirections

Passed

N/A

1.153520s

incorrect_redirections

Passed

N/A

0.564089s

local_redirections

Passed

N/A

0.275150s

named_fd_redirections

Passed

N/A

0.369009s

redir_here_doc

Passed

N/A

0.150248s

redir_in_case

Passed

N/A

0.225501s

subshell_redirections

Passed

N/A

0.306240s

ulimit_redirection_interaction

Passed

N/A

0.284683s

validate_fn_redirects

Passed

N/A

26.925803s

bin/sh/t_redircloexec

1.170134s

compound_redir_open

Passed

N/A

0.143753s

exec_redir_closed

Passed

N/A

0.303743s

exec_redir_open

Passed

N/A

0.300698s

loop_redir_open

Passed

N/A

0.136148s

simple_redir_open

Passed

N/A

0.135344s

subshell_redir_open

Passed

N/A

0.146401s

bin/sh/t_set_e

2.525034s

all

Passed

N/A

2.524052s

bin/sh/t_shift

1.690016s

basic_shift_test

Passed

N/A

0.514966s

excessive_shift

Passed

N/A

0.403931s

function_shift

Passed

N/A

0.091182s

non_numeric_shift

Passed

N/A

0.392401s

too_many_args

Passed

N/A

0.284431s

bin/sh/t_ulimit

0.198829s

limits

Passed

N/A

0.197945s

bin/sh/t_varquote

0.387561s

all

Passed

N/A

0.109163s

default_assignment_with_arith

Passed

N/A

0.153232s

nested_quotes_multiword

Passed

N/A

0.123020s

bin/sh/t_varval

4.741880s

aaa

Passed

N/A

0.293797s

assignment

Passed

N/A

1.005303s

cmdline

Passed

N/A

1.030818s

read

Passed

N/A

1.123487s

redirect

Passed

N/A

1.185055s

bin/sh/t_wait

21.775107s

basic_wait

Passed

N/A

6.271151s

individual

Passed

N/A

3.137104s

jobs

Passed

N/A

7.179918s

kill

Passed

N/A

5.182796s

bin/sleep/t_sleep

2.165109s

fraction

Passed

N/A

0.814640s

hex

Passed

N/A

1.139125s

nonnumeric

Passed

N/A

0.208826s

bin/tar/t_tar

0.248664s

append

Passed

N/A

0.247038s

dev/cgd/t_cgd_3des

0.294933s

cgd_3des_cbc_192_encblkno1

Passed

N/A

0.210882s

cgd_3des_cbc_192_encblkno8

Passed

N/A

0.082819s

dev/cgd/t_cgd_aes

0.616224s

cgd_aes_cbc_128_encblkno1

Passed

N/A

0.075033s

cgd_aes_cbc_128_encblkno8

Passed

N/A

0.074707s

cgd_aes_cbc_192_encblkno1

Passed

N/A

0.075232s

cgd_aes_cbc_192_encblkno8

Passed

N/A

0.074922s

cgd_aes_cbc_256_encblkno1

Passed

N/A

0.074953s

cgd_aes_cbc_256_encblkno8

Passed

N/A

0.077919s

cgd_aes_xts_256

Passed

N/A

0.084480s

cgd_aes_xts_512

Passed

N/A

0.074419s

dev/cgd/t_cgd_blowfish

0.492596s

cgd_bf_cbc_128_encblkno1

Passed

N/A

0.083721s

cgd_bf_cbc_128_encblkno8

Passed

N/A

0.075214s

cgd_bf_cbc_256_encblkno1

Passed

N/A

0.077281s

cgd_bf_cbc_256_encblkno8

Passed

N/A

0.084306s

cgd_bf_cbc_448_encblkno1

Passed

N/A

0.084633s

cgd_bf_cbc_448_encblkno8

Passed

N/A

0.083414s

dev/cgd/t_cgd

2.953497s

basic

Passed

N/A

0.698876s

unaligned_write

Passed

N/A

1.624802s

wrongpass

Passed

N/A

0.627037s

dev/clock_subr/t_clock_subr

0.024515s

secs_to_ymdhms

Passed

N/A

0.011973s

ymdhms_to_secs

Passed

N/A

0.011518s

dev/fss/t_fss

0.560883s

basic

Passed

N/A

0.556508s

dev/raidframe/t_raid

19.670562s

raid1_comp0fail

Passed

N/A

3.785706s

raid1_compfail

Passed

N/A

3.803542s

raid1_normal

Passed

N/A

3.759756s

raid5_compfail

Passed

N/A

3.814902s

raid5_normal

Passed

N/A

3.769549s

smalldisk

Passed

N/A

0.428019s

dev/audio/t_pad

0.433048s

pad_output

Failed

atf-check failed; see the output of the test for details

0.431950s

dev/md/t_md

0.515881s

basic

Passed

N/A

0.515006s

dev/scsipi/t_cd

0.099330s

noisyeject

Passed

N/A

0.098664s

dev/sysmon/t_swwdog

5.509129s

disarm

Passed

N/A

2.495149s

panic

Passed

N/A

1.514707s

reboot

Passed

N/A

1.491842s

dev/sysmon/t_swsensor

121.301989s

alarm_sensor

Passed

N/A

28.397604s

entropy_interrupt_sensor

Passed

N/A

16.852818s

entropy_polled_sensor

Passed

N/A

32.195886s

limit_sensor

Passed

N/A

26.955942s

simple_sensor

Passed

N/A

16.889823s

dev/usb/t_hid

0.095220s

khid

Passed

N/A

0.046794s

khid_parse_just_pop

Passed

N/A

0.046788s

games/t_factor

0.720856s

loop1

Passed

N/A

0.217840s

loop2

Passed

N/A

0.172505s

overflow1

Passed

N/A

0.162467s

overflow2

Passed

N/A

0.164425s

include/machine/t_bswap

0.079314s

bswap16_basic

Passed

N/A

0.012731s

bswap16_unconst

Passed

N/A

0.012548s

bswap32_basic

Passed

N/A

0.012430s

bswap32_unconst

Passed

N/A

0.012464s

bswap64_basic

Passed

N/A

0.012559s

bswap64_unconst

Passed

N/A

0.012505s

include/sys/t_bitops

0.088915s

bitmap_basic

Passed

N/A

0.015954s

fast_divide32

Passed

N/A

0.013866s

ffsfls

Passed

N/A

0.013749s

ilog2_32bit

Passed

N/A

0.013726s

ilog2_64bit

Passed

N/A

0.013681s

ilog2_const

Passed

N/A

0.013849s

include/sys/t_bootblock

0.025049s

mbr_partition

Passed

N/A

0.011993s

mbr_sector

Passed

N/A

0.011336s

include/sys/t_cdefs

0.105277s

sissigned

Passed

N/A

0.012016s

stypefit

Passed

N/A

0.011445s

stypemask

Passed

N/A

0.011460s

stypeminmax

Passed

N/A

0.013303s

uissigned

Passed

N/A

0.013079s

utypefit

Passed

N/A

0.012784s

utypemask

Passed

N/A

0.012890s

utypeminmax

Passed

N/A

0.012774s

include/sys/t_pslist

0.013547s

misc

Passed

N/A

0.012725s

include/sys/t_tree

0.502434s

tree_rbstress

Passed

N/A

0.501620s

include/sys/t_types

0.040050s

types_limits

Passed

N/A

0.013215s

types_signed

Passed

N/A

0.012456s

types_unsigned

Passed

N/A

0.012289s

include/sys/t_socket

0.252381s

cmsg_sendfd

Passed

N/A

0.088422s

cmsg_sendfd_bounds

Passed

N/A

0.086092s

sock_cloexec

Passed

N/A

0.075818s

include/t_bitstring

0.216362s

bits_27

Passed

N/A

0.027655s

bits_32

Passed

N/A

0.034361s

bits_49

Passed

N/A

0.042819s

bits_64

Passed

N/A

0.036280s

bits_67

Passed

N/A

0.037774s

bits_8

Passed

N/A

0.032480s

include/t_errno

0.012597s

errno_constants

Expected failure

PR standards/44921: 2 checks failed as expected; see output for more details

0.012072s

include/t_glob

0.012062s

glob_types

Passed

N/A

0.011461s

include/t_inttypes

0.012275s

int_fmtio

Passed

N/A

0.011664s

include/t_limits

0.037935s

char

Passed

N/A

0.011324s

posix

Passed

N/A

0.012586s

short

Passed

N/A

0.012241s

include/t_netdb

0.012835s

netdb_constants

Expected failure

PR standards/44777: 2 checks failed as expected; see output for more details

0.012186s

include/t_paths

0.012255s

paths

Skipped

PR port-sparc/45580

0.011546s

include/t_stdint

0.023555s

int16

Passed

N/A

0.011124s

int8

Passed

N/A

0.011046s

kernel/kqueue/read/t_fifo

0.012509s

fifo

Passed

N/A

0.011683s

kernel/kqueue/read/t_file

6.069986s

file

Passed

N/A

6.069163s

kernel/kqueue/read/t_file2

0.012369s

file2

Passed

N/A

0.011490s

kernel/kqueue/read/t_pipe

0.012239s

pipe

Passed

N/A

0.011688s

kernel/kqueue/read/t_ttypty

2.041777s

master

Passed

N/A

1.020999s

slave

Passed

N/A

1.019719s

kernel/kqueue/write/t_fifo

0.015191s

fifo

Passed

N/A

0.014492s

kernel/kqueue/write/t_pipe

0.094923s

pipe1

Passed

N/A

0.066567s

pipe2

Passed

N/A

0.014803s

pipe3

Passed

N/A

0.011588s

kernel/kqueue/write/t_ttypty

2.046248s

master

Passed

N/A

1.025660s

slave

Passed

N/A

1.019327s

kernel/kqueue/t_ioctl

0.027173s

kfilter_byfilter

Passed

N/A

0.013032s

kfilter_byname

Passed

N/A

0.013049s

kernel/kqueue/t_proc1

2.033054s

proc1

Passed

N/A

2.032414s

kernel/kqueue/t_proc2

2.061614s

proc2

Passed

N/A

2.060961s

kernel/kqueue/t_proc3

0.014774s

proc3

Passed

N/A

0.014137s

kernel/kqueue/t_sig

12.073628s

sig

Passed

N/A

12.073025s

kernel/kqueue/t_vnode

0.483001s

dir_no_note_link_create_file_in

Passed

N/A

0.026848s

dir_no_note_link_delete_file_in

Passed

N/A

0.026163s

dir_no_note_link_mv_dir_within

Passed

N/A

0.026140s

dir_no_note_link_mv_file_within

Passed

N/A

0.026289s

dir_note_link_create_dir_in

Passed

N/A

0.025831s

dir_note_link_delete_dir_in

Passed

N/A

0.026264s

dir_note_link_mv_dir_in

Passed

N/A

0.025730s

dir_note_link_mv_dir_out

Passed

N/A

0.026145s

dir_note_write_create_dir_in

Passed

N/A

0.026235s

dir_note_write_create_file_in

Passed

N/A

0.026617s

dir_note_write_delete_dir_in

Passed

N/A

0.026217s

dir_note_write_delete_file_in

Passed

N/A

0.026380s

dir_note_write_mv_dir_in

Passed

N/A

0.026321s

dir_note_write_mv_dir_out

Passed

N/A

0.026490s

dir_note_write_mv_dir_within

Passed

N/A

0.026345s

dir_note_write_mv_file_in

Passed

N/A

0.026147s

dir_note_write_mv_file_out

Passed

N/A

0.026436s

dir_note_write_mv_file_within

Passed

N/A

0.026486s

kernel/tty/t_pr

0.205205s

client_first

Passed

N/A

0.067686s

master_first

Passed

N/A

0.067754s

ptyioctl

Passed

N/A

0.067904s

kernel/t_lock

1.009343s

lock

Passed

N/A

1.008705s

kernel/t_lockf

61.060965s

deadlock

Passed

N/A

1.022358s

randlock

Passed

N/A

60.037101s

kernel/t_ptrace

0.068592s

attach_chroot

Passed

N/A

0.015845s

attach_pid0

Passed

N/A

0.011622s

attach_pid1

Passed

N/A

0.013819s

attach_pid1_securelevel

Skipped

Test must be run with securelevel >= 1

0.011802s

attach_self

Passed

N/A

0.011964s

kernel/t_ptrace_wait

0.997934s

attach3

Passed

N/A

0.019305s

attach4

Passed

N/A

0.018076s

eventmask1

Passed

N/A

0.019003s

eventmask2

Passed

N/A

0.018680s

fork2

Passed

N/A

0.022066s

fpregs1

Passed

N/A

0.023025s

fpregs2

Failed

/usr/src/tests/kernel/t_ptrace_wait.c:3894: ptrace(PT_SETFPREGS, child, &r, 0) != -1 not met

0.019820s

io_read_d1

Passed

N/A

0.019890s

io_read_d2

Passed

N/A

0.018663s

io_read_d3

Passed

N/A

0.019872s

io_read_d4

Passed

N/A

0.019043s

io_read_d_write_d_handshake1

Passed

N/A

0.021758s

io_read_d_write_d_handshake2

Passed

N/A

0.019630s

io_read_i1

Passed

N/A

0.020557s

io_read_i2

Passed

N/A

0.021129s

io_read_i3

Passed

N/A

0.020144s

io_read_i4

Passed

N/A

0.020877s

io_write_d1

Passed

N/A

0.019792s

io_write_d2

Passed

N/A

0.020934s

io_write_d3

Passed

N/A

0.018903s

io_write_d4

Passed

N/A

0.021027s

kill1

Passed

N/A

0.018521s

kill2

Passed

N/A

0.020719s

lwpinfo1

Passed

N/A

0.019725s

read_d1

Passed

N/A

0.020748s

read_d2

Passed

N/A

0.019250s

read_d3

Passed

N/A

0.019124s

read_d4

Passed

N/A

0.019144s

read_d_write_d_handshake1

Passed

N/A

0.018987s

read_d_write_d_handshake2

Passed

N/A

0.019504s

read_i1

Passed

N/A

0.020200s

read_i2

Passed

N/A

0.019464s

read_i3

Passed

N/A

0.020471s

read_i4

Passed

N/A

0.020229s

regs1

Passed

N/A

0.020280s

regs2

Passed

N/A

0.020111s

regs3

Passed

N/A

0.019516s

regs4

Passed

N/A

0.020348s

regs5

Passed

N/A

0.019131s

traceme1

Passed

N/A

0.019981s

traceme2

Passed

N/A

0.019809s

traceme3

Passed

N/A

0.019420s

traceme4

Passed

N/A

0.021369s

vfork2

Passed

N/A

0.020784s

write_d1

Passed

N/A

0.020480s

write_d2

Passed

N/A

0.020498s

write_d3

Passed

N/A

0.020952s

write_d4

Passed

N/A

0.021328s

kernel/t_ptrace_wait3

0.982605s

attach3

Passed

N/A

0.018661s

attach4

Passed

N/A

0.018661s

eventmask1

Passed

N/A

0.018515s

eventmask2

Passed

N/A

0.019778s

fork2

Passed

N/A

0.021841s

fpregs1

Passed

N/A

0.018675s

fpregs2

Failed

/usr/src/tests/kernel/t_ptrace_wait.c:3894: ptrace(PT_SETFPREGS, child, &r, 0) != -1 not met

0.020287s

io_read_d1

Passed

N/A

0.018499s

io_read_d2

Passed

N/A

0.020981s

io_read_d3

Passed

N/A

0.019559s

io_read_d4

Passed

N/A

0.020192s

io_read_d_write_d_handshake1

Passed

N/A

0.022608s

io_read_d_write_d_handshake2

Passed

N/A

0.019815s

io_read_i1

Passed

N/A

0.020457s

io_read_i2

Passed

N/A

0.019096s

io_read_i3

Passed

N/A

0.019197s

io_read_i4

Passed

N/A

0.019115s

io_write_d1

Passed

N/A

0.019481s

io_write_d2

Passed

N/A

0.019552s

io_write_d3

Passed

N/A

0.019358s

io_write_d4

Passed

N/A

0.019152s

kill1

Passed

N/A

0.018764s

kill2

Passed

N/A

0.019229s

lwpinfo1

Passed

N/A

0.020009s

read_d1

Passed

N/A

0.019223s

read_d2

Passed

N/A

0.019457s

read_d3

Passed

N/A

0.020299s

read_d4

Passed

N/A

0.020030s

read_d_write_d_handshake1

Passed

N/A

0.019982s

read_d_write_d_handshake2

Passed

N/A

0.020839s

read_i1

Passed

N/A

0.019452s

read_i2

Passed

N/A

0.021837s

read_i3

Passed

N/A

0.020418s

read_i4

Passed

N/A

0.020324s

regs1

Passed

N/A

0.020043s

regs2

Passed

N/A

0.020152s

regs3

Passed

N/A

0.020210s

regs4

Passed

N/A

0.020497s

regs5

Passed

N/A

0.020181s

traceme1

Passed

N/A

0.018748s

traceme2

Passed

N/A

0.019462s

traceme3

Passed

N/A

0.019850s

traceme4

Passed

N/A

0.019616s

vfork2

Passed

N/A

0.021742s

write_d1

Passed

N/A

0.018827s

write_d2

Passed

N/A

0.020761s

write_d3

Passed

N/A

0.018576s

write_d4

Passed

N/A

0.020324s

kernel/t_ptrace_wait4

1.272009s

attach1

Passed

N/A

0.035906s

attach2

Passed

N/A

0.037649s

attach3

Passed

N/A

0.019830s

attach4

Passed

N/A

0.019312s

attach5

Passed

N/A

0.038688s

attach6

Passed

N/A

0.037963s

attach7

Passed

N/A

0.039124s

eventmask1

Passed

N/A

0.019158s

eventmask2

Passed

N/A

0.018755s

fork1

Failed

/usr/src/tests/kernel/t_ptrace_wait.h:295: Reported exited process

0.022131s

fork2

Passed

N/A

0.022449s

fpregs1

Passed

N/A

0.020557s

fpregs2

Failed

/usr/src/tests/kernel/t_ptrace_wait.c:3894: ptrace(PT_SETFPREGS, child, &r, 0) != -1 not met

0.020404s

io_read_d1

Passed

N/A

0.021895s

io_read_d2

Passed

N/A

0.019299s

io_read_d3

Passed

N/A

0.020125s

io_read_d4

Passed

N/A

0.019211s

io_read_d_write_d_handshake1

Passed

N/A

0.020552s

io_read_d_write_d_handshake2

Passed

N/A

0.019379s

io_read_i1

Passed

N/A

0.020038s

io_read_i2

Passed

N/A

0.020462s

io_read_i3

Passed

N/A

0.020568s

io_read_i4

Passed

N/A

0.020155s

io_write_d1

Passed

N/A

0.020079s

io_write_d2

Passed

N/A

0.021274s

io_write_d3

Passed

N/A

0.018975s

io_write_d4

Passed

N/A

0.019582s

kill1

Passed

N/A

0.019068s

kill2

Passed

N/A

0.019108s

lwpinfo1

Passed

N/A

0.019381s

lwpinfo2

Passed

N/A

0.022540s

read_d1

Passed

N/A

0.020992s

read_d2

Passed

N/A

0.021717s

read_d3

Passed

N/A

0.020556s

read_d4

Passed

N/A

0.022076s

read_d_write_d_handshake1

Passed

N/A

0.020355s

read_d_write_d_handshake2

Passed

N/A

0.021355s

read_i1

Passed

N/A

0.019463s

read_i2

Passed

N/A

0.021252s

read_i3

Passed

N/A

0.020293s

read_i4

Passed

N/A

0.022566s

regs1

Passed

N/A

0.020076s

regs2

Passed

N/A

0.019920s

regs3

Passed

N/A

0.019779s

regs4

Passed

N/A

0.021701s

regs5

Passed

N/A

0.018232s

traceme1

Passed

N/A

0.019098s

traceme2

Passed

N/A

0.020859s

traceme3

Passed

N/A

0.019503s

traceme4

Passed

N/A

0.022505s

vfork1

Expected failure

PR kern/51630: /usr/src/tests/kernel/t_ptrace_wait.h:305: WSTOPSIG(status) != expected: Unexpected stop signal received [Child exited] != [Trace/BPT trap]

0.022607s

vfork2

Passed

N/A

0.020038s

write_d1

Passed

N/A

0.019665s

write_d2

Passed

N/A

0.020605s

write_d3

Passed

N/A

0.019069s

write_d4

Passed

N/A

0.019019s

kernel/t_ptrace_wait6

1.244545s

attach1

Passed

N/A

0.021368s

attach2

Passed

N/A

0.032671s

attach3

Passed

N/A

0.020079s

attach4

Passed

N/A

0.017087s

attach5

Passed

N/A

0.021769s

attach6

Passed

N/A

0.028263s

attach7

Passed

N/A

0.021628s

eventmask1

Passed

N/A

0.019634s

eventmask2

Passed

N/A

0.018302s

fork1

Failed

/usr/src/tests/kernel/t_ptrace_wait.h:295: Reported exited process

0.021699s

fork2

Passed

N/A

0.021504s

fpregs1

Passed

N/A

0.020928s

fpregs2

Failed

/usr/src/tests/kernel/t_ptrace_wait.c:3894: ptrace(PT_SETFPREGS, child, &r, 0) != -1 not met

0.020305s

io_read_d1

Passed

N/A

0.019726s

io_read_d2

Passed

N/A

0.019828s

io_read_d3

Passed

N/A

0.019467s

io_read_d4

Passed

N/A

0.020040s

io_read_d_write_d_handshake1

Passed

N/A

0.020922s

io_read_d_write_d_handshake2

Passed

N/A

0.019382s

io_read_i1

Passed

N/A

0.020754s

io_read_i2

Passed

N/A

0.021104s

io_read_i3

Passed

N/A

0.020714s

io_read_i4

Passed

N/A

0.020914s

io_write_d1

Passed

N/A

0.021715s

io_write_d2

Passed

N/A

0.021116s

io_write_d3

Passed

N/A

0.021649s

io_write_d4

Passed

N/A

0.021356s

kill1

Passed

N/A

0.020265s

kill2

Passed

N/A

0.020940s

lwpinfo1

Passed

N/A

0.021132s

lwpinfo2

Passed

N/A

0.035999s

read_d1

Passed

N/A

0.022408s

read_d2

Passed

N/A

0.021735s

read_d3

Passed

N/A

0.022516s

read_d4

Passed

N/A

0.022420s

read_d_write_d_handshake1

Passed

N/A

0.021764s

read_d_write_d_handshake2

Passed

N/A

0.020597s

read_i1

Passed

N/A

0.021312s

read_i2

Passed

N/A

0.019786s

read_i3

Passed

N/A

0.021660s

read_i4

Passed

N/A

0.020397s

regs1

Passed

N/A

0.022353s

regs2

Passed

N/A

0.021219s

regs3

Passed

N/A

0.021246s

regs4

Passed

N/A

0.020611s

regs5

Passed

N/A

0.020700s

traceme1

Passed

N/A

0.021785s

traceme2

Passed

N/A

0.021156s

traceme3

Passed

N/A

0.019344s

traceme4

Passed

N/A

0.022158s

vfork1

Expected failure

PR kern/51630: /usr/src/tests/kernel/t_ptrace_wait.h:305: WSTOPSIG(status) != expected: Unexpected stop signal received [Child exited] != [Trace/BPT trap]

0.021044s

vfork2

Passed

N/A

0.020818s

write_d1

Passed

N/A

0.020947s

write_d2

Passed

N/A

0.022263s

write_d3

Passed

N/A

0.019019s

write_d4

Passed

N/A

0.020865s

kernel/t_ptrace_waitid

301.221627s

attach1

Passed

N/A

0.035890s

attach2

Passed

N/A

0.022408s

attach3

Passed

N/A

0.020232s

attach4

Passed

N/A

0.019459s

attach5

Passed

N/A

0.033846s

attach6

Passed

N/A

0.039417s

attach7

Passed

N/A

0.038277s

eventmask1

Passed

N/A

0.019836s

eventmask2

Passed

N/A

0.021012s

fork1

Failed

/usr/src/tests/kernel/t_ptrace_wait.c:1152: ptrace(PT_GET_PROCESS_STATE, child2, &state, slen) != -1 not met

0.022713s

fork2

Passed

N/A

0.020579s

fpregs1

Passed

N/A

0.019963s

fpregs2

Failed

/usr/src/tests/kernel/t_ptrace_wait.c:3894: ptrace(PT_SETFPREGS, child, &r, 0) != -1 not met

0.021153s

io_read_d1

Passed

N/A

0.018980s

io_read_d2

Passed

N/A

0.019878s

io_read_d3

Passed

N/A

0.020246s

io_read_d4

Passed

N/A

0.019780s

io_read_d_write_d_handshake1

Passed

N/A

0.020113s

io_read_d_write_d_handshake2

Passed

N/A

0.019851s

io_read_i1

Passed

N/A

0.019521s

io_read_i2

Passed

N/A

0.019916s

io_read_i3

Passed

N/A

0.021332s

io_read_i4

Passed

N/A

0.018619s

io_write_d1

Passed

N/A

0.018669s

io_write_d2

Passed

N/A

0.018958s

io_write_d3

Passed

N/A

0.018866s

io_write_d4

Passed

N/A

0.020634s

kill1

Passed

N/A

0.018783s

kill2

Passed

N/A

0.018351s

lwpinfo1

Passed

N/A

0.018703s

lwpinfo2

Passed

N/A

0.036090s

read_d1

Passed

N/A

0.018698s

read_d2

Passed

N/A

0.018944s

read_d3

Passed

N/A

0.018531s

read_d4

Passed

N/A

0.018741s

read_d_write_d_handshake1

Passed

N/A

0.018871s

read_d_write_d_handshake2

Passed

N/A

0.018963s

read_i1

Passed

N/A

0.018599s

read_i2

Passed

N/A

0.018643s

read_i3

Passed

N/A

0.019362s

read_i4

Passed

N/A

0.020105s

regs1

Passed

N/A

0.020070s

regs2

Passed

N/A

0.018711s

regs3

Passed

N/A

0.018630s

regs4

Passed

N/A

0.018799s

regs5

Passed

N/A

0.018339s

traceme1

Passed

N/A

0.018568s

traceme2

Passed

N/A

0.018890s

traceme3

Passed

N/A

0.019280s

traceme4

Passed

N/A

0.018887s

vfork1

Failed

Test case timed out after 300 seconds

300.010029s

vfork2

Passed

N/A

0.020930s

write_d1

Passed

N/A

0.019323s

write_d2

Passed

N/A

0.019717s

write_d3

Passed

N/A

0.019473s

write_d4

Passed

N/A

0.019431s

kernel/t_ptrace_waitpid

1.301963s

attach1

Passed

N/A

0.034278s

attach2

Passed

N/A

0.038425s

attach3

Passed

N/A

0.020807s

attach4

Passed

N/A

0.018873s

attach5

Passed

N/A

0.037841s

attach6

Passed

N/A

0.038959s

attach7

Passed

N/A

0.039200s

eventmask1

Passed

N/A

0.019685s

eventmask2

Passed

N/A

0.021277s

fork1

Failed

/usr/src/tests/kernel/t_ptrace_wait.h:295: Reported exited process

0.025768s

fork2

Passed

N/A

0.024193s

fpregs1

Passed

N/A

0.020462s

fpregs2

Failed

/usr/src/tests/kernel/t_ptrace_wait.c:3894: ptrace(PT_SETFPREGS, child, &r, 0) != -1 not met

0.018589s

io_read_d1

Passed

N/A

0.021539s

io_read_d2

Passed

N/A

0.019386s

io_read_d3

Passed

N/A

0.023424s

io_read_d4

Passed

N/A

0.022252s

io_read_d_write_d_handshake1

Passed

N/A

0.025228s

io_read_d_write_d_handshake2

Passed

N/A

0.021748s

io_read_i1

Passed

N/A

0.021314s

io_read_i2

Passed

N/A

0.020769s

io_read_i3

Passed

N/A

0.020852s

io_read_i4

Passed

N/A

0.018850s

io_write_d1

Passed

N/A

0.021580s

io_write_d2

Passed

N/A

0.019777s

io_write_d3

Passed

N/A

0.019489s

io_write_d4

Passed

N/A

0.020836s

kill1

Passed

N/A

0.019605s

kill2

Passed

N/A

0.019490s

lwpinfo1

Passed

N/A

0.019439s

lwpinfo2

Passed

N/A

0.021726s

read_d1

Passed

N/A

0.019516s

read_d2

Passed

N/A

0.019096s

read_d3

Passed

N/A

0.019797s

read_d4

Passed

N/A

0.018889s

read_d_write_d_handshake1

Passed

N/A

0.019194s

read_d_write_d_handshake2

Passed

N/A

0.019967s

read_i1

Passed

N/A

0.019605s

read_i2

Passed

N/A

0.024380s

read_i3

Passed

N/A

0.022450s

read_i4

Passed

N/A

0.021507s

regs1

Passed

N/A

0.018831s

regs2

Passed

N/A

0.021683s

regs3

Passed

N/A

0.022098s

regs4

Passed

N/A

0.021438s

regs5

Passed

N/A

0.021764s

traceme1

Passed

N/A

0.021677s

traceme2

Passed

N/A

0.022694s

traceme3

Passed

N/A

0.021977s

traceme4

Passed

N/A

0.022487s

vfork1

Expected failure

PR kern/51630: /usr/src/tests/kernel/t_ptrace_wait.h:305: WSTOPSIG(status) != expected: Unexpected stop signal received [Child exited] != [Trace/BPT trap]

0.021590s

vfork2

Passed

N/A

0.021139s

write_d1

Passed

N/A

0.020602s

write_d2

Passed

N/A

0.019569s

write_d3

Passed

N/A

0.019994s

write_d4

Passed

N/A

0.020031s

kernel/t_pty

6.073837s

pty_no_queue

Passed

N/A

3.032828s

pty_queue

Passed

N/A

3.039918s

kernel/t_mqueue

0.012999s

mqueue

Passed

N/A

0.012151s

kernel/t_sysv

1.099792s

msg

Passed

N/A

0.027542s

sem

Passed

N/A

1.042786s

shm

Passed

N/A

0.027190s

kernel/t_subr_prf

0.047066s

snprintf_count

Passed

N/A

0.011255s

snprintf_count_overflow

Passed

N/A

0.010911s

snprintf_print

Passed

N/A

0.011105s

snprintf_print_overflow

Passed

N/A

0.011690s

kernel/t_kauth_pr_47598

0.341469s

kauth_curtain

Passed

N/A

0.340960s

kernel/t_sysctl

0.015891s

bufsize

Passed

N/A

0.015326s

kernel/t_extattrctl

0.056572s

extattrctl_namei

Passed

N/A

0.055988s

kernel/t_filedesc

16.225013s

getfilerace

Passed

N/A

16.224214s

kernel/t_rnd

0.211702s

RNDADDDATA

Passed

N/A

0.069856s

RNDADDDATA2

Passed

N/A

0.070041s

read_random

Passed

N/A

0.069364s

kernel/t_extent

0.153087s

bound1

Passed

N/A

0.013769s

bound2

Passed

N/A

0.013223s

bound3

Passed

N/A

0.013198s

bound4

Passed

N/A

0.013216s

bound5

Passed

N/A

0.013171s

coalesce

Passed

N/A

0.013147s

free

Passed

N/A

0.013037s

subregion1

Passed

N/A

0.013007s

subregion2

Passed

N/A

0.013358s

subregion3

Passed

N/A

0.012933s

subregion4

Passed

N/A

0.013170s

kernel/t_umount

0.830651s

umount

Passed

N/A

0.825188s

kernel/t_umountstress

2.779214s

fileop

Passed

N/A

1.038840s

mountlist

Passed

N/A

1.730027s

kernel/t_ps_strings

0.898784s

update

Passed

N/A

0.767142s

validate

Passed

N/A

0.129811s

lib/csu/t_crt0

0.613883s

initfini1

Passed

N/A

0.143519s

initfini2

Passed

N/A

0.163116s

initfini3

Passed

N/A

0.147886s

initfini4

Passed

N/A

0.156051s

lib/libbluetooth/t_bluetooth

0.028422s

check_bt_aton

Passed

N/A

0.013368s

check_bt_ntoa

Passed

N/A

0.013587s

lib/libbluetooth/t_sdp_data

0.027742s

check_sdp_data_size

Passed

N/A

0.014258s

check_sdp_data_type

Passed

N/A

0.012186s

lib/libbluetooth/t_sdp_get

0.140810s

check_sdp_get_alt

Passed

N/A

0.012444s

check_sdp_get_attr

Passed

N/A

0.012128s

check_sdp_get_bool

Passed

N/A

0.012075s

check_sdp_get_data

Passed

N/A

0.014346s

check_sdp_get_int

Passed

N/A

0.013953s

check_sdp_get_seq

Passed

N/A

0.013621s

check_sdp_get_str

Passed

N/A

0.013539s

check_sdp_get_uint

Passed

N/A

0.013558s

check_sdp_get_url

Passed

N/A

0.013643s

check_sdp_get_uuid

Passed

N/A

0.013747s

lib/libbluetooth/t_sdp_match

0.014798s

check_sdp_match_uuid16

Passed

N/A

0.013816s

lib/libbluetooth/t_sdp_put

0.307677s

check_sdp_put_alt

Passed

N/A

0.014583s

check_sdp_put_attr

Passed

N/A

0.014546s

check_sdp_put_bool

Passed

N/A

0.014035s

check_sdp_put_data

Passed

N/A

0.014173s

check_sdp_put_int

Passed

N/A

0.013920s

check_sdp_put_int16

Passed

N/A

0.014202s

check_sdp_put_int32

Passed

N/A

0.012889s

check_sdp_put_int64

Passed

N/A

0.012986s

check_sdp_put_int8

Passed

N/A

0.012996s

check_sdp_put_seq

Passed

N/A

0.012731s

check_sdp_put_str

Passed

N/A

0.013508s

check_sdp_put_uint

Passed

N/A

0.013492s

check_sdp_put_uint16

Passed

N/A

0.014199s

check_sdp_put_uint32

Passed

N/A

0.014024s

check_sdp_put_uint64

Passed

N/A

0.014040s

check_sdp_put_uint8

Passed

N/A

0.013875s

check_sdp_put_url

Passed

N/A

0.014063s

check_sdp_put_uuid

Passed

N/A

0.013699s

check_sdp_put_uuid128

Passed

N/A

0.014001s

check_sdp_put_uuid16

Passed

N/A

0.014031s

check_sdp_put_uuid32

Passed

N/A

0.013929s

lib/libbluetooth/t_sdp_set

0.073419s

check_sdp_set_alt

Passed

N/A

0.014032s

check_sdp_set_bool

Passed

N/A

0.014166s

check_sdp_set_int

Passed

N/A

0.013311s

check_sdp_set_seq

Passed

N/A

0.014143s

check_sdp_set_uint

Passed

N/A

0.013418s

lib/libc/c063/t_faccessat

0.095597s

faccessat_fd

Passed

N/A

0.012412s

faccessat_fdcwd

Passed

N/A

0.011827s

faccessat_fdcwderr

Passed

N/A

0.013243s

faccessat_fderr1

Passed

N/A

0.011594s

faccessat_fderr2

Passed

N/A

0.011695s

faccessat_fderr3

Passed

N/A

0.014159s

faccessat_fdlink

Passed

N/A

0.013037s

lib/libc/c063/t_fchmodat

0.095505s

fchmodat_fd

Passed

N/A

0.013471s

fchmodat_fdcwd

Passed

N/A

0.012962s

fchmodat_fdcwderr

Passed

N/A

0.013568s

fchmodat_fderr1

Passed

N/A

0.011712s

fchmodat_fderr2

Passed

N/A

0.011812s

fchmodat_fderr3

Passed

N/A

0.012070s

fchmodat_fdlink

Passed

N/A

0.011729s

lib/libc/c063/t_fchownat

0.102620s

fchownat_fd

Passed

N/A

0.013536s

fchownat_fdcwd

Passed

N/A

0.013195s

fchownat_fdcwderr

Passed

N/A

0.012941s

fchownat_fderr1

Passed

N/A

0.013020s

fchownat_fderr2

Passed

N/A

0.014176s

fchownat_fderr3

Passed

N/A

0.012916s

fchownat_fdlink

Passed

N/A

0.014033s

lib/libc/c063/t_fexecve

0.018184s

fexecve

Expected failure

fexecve not implemented: /usr/src/tests/lib/libc/c063/t_fexecve.c:85: access("test", F_OK) == 0 not met

0.017254s

lib/libc/c063/t_fstatat

0.094363s

fstatat_fd

Passed

N/A

0.012402s

fstatat_fdcwd

Passed

N/A

0.011823s

fstatat_fdcwderr

Passed

N/A

0.012621s

fstatat_fderr1

Passed

N/A

0.011663s

fstatat_fderr2

Passed

N/A

0.011767s

fstatat_fderr3

Passed

N/A

0.012560s

fstatat_fdlink

Passed

N/A

0.013446s

lib/libc/c063/t_linkat

0.088518s

linkat_fd

Passed

N/A

0.013603s

linkat_fdcwd

Passed

N/A

0.013289s

linkat_fdcwderr

Passed

N/A

0.013052s

linkat_fderr

Passed

N/A

0.012841s

linkat_fdlink1

Passed

N/A

0.013057s

linkat_fdlink2

Passed

N/A

0.012131s

lib/libc/c063/t_mkdirat

0.056319s

mkdirat_fd

Passed

N/A

0.013232s

mkdirat_fdcwd

Passed

N/A

0.013251s

mkdirat_fdcwderr

Passed

N/A

0.012634s

mkdirat_fderr

Passed

N/A

0.012745s

lib/libc/c063/t_mkfifoat

0.054651s

mkfifoat_fd

Passed

N/A

0.012825s

mkfifoat_fdcwd

Passed

N/A

0.012890s

mkfifoat_fdcwderr

Passed

N/A

0.012203s

mkfifoat_fderr

Passed

N/A

0.012668s

lib/libc/c063/t_mknodat

0.057116s

mknodat_fd

Passed

N/A

0.013265s

mknodat_fdcwd

Passed

N/A

0.013279s

mknodat_fdcwderr

Passed

N/A

0.012719s

mknodat_fderr

Passed

N/A

0.013268s

lib/libc/c063/t_o_search

0.042095s

o_search_notdir

Passed

N/A

0.011902s

o_search_perm1

Passed

N/A

0.013054s

o_search_perm2

Passed

N/A

0.012881s

lib/libc/c063/t_openat

0.085201s

openat_fd

Passed

N/A

0.012234s

openat_fdcwd

Passed

N/A

0.014734s

openat_fdcwderr

Passed

N/A

0.012993s

openat_fderr1

Passed

N/A

0.012826s

openat_fderr2

Passed

N/A

0.012911s

openat_fderr3

Passed

N/A

0.012955s

lib/libc/c063/t_readlinkat

0.070621s

readlinkat_fd

Passed

N/A

0.013309s

readlinkat_fdcwd

Passed

N/A

0.013267s

readlinkat_fdcwderr

Passed

N/A

0.012727s

readlinkat_fderr1

Passed

N/A

0.012780s

readlinkat_fderr2

Passed

N/A

0.012957s

lib/libc/c063/t_renameat

0.058563s

renameat_fd

Passed

N/A

0.013515s

renameat_fdcwd

Passed

N/A

0.013239s

renameat_fdcwderr

Passed

N/A

0.012979s

renameat_fderr

Passed

N/A

0.013081s

lib/libc/c063/t_symlinkat

0.058506s

symlinkat_fd

Passed

N/A

0.013253s

symlinkat_fdcwd

Passed

N/A

0.013512s

symlinkat_fdcwderr

Passed

N/A

0.012801s

symlinkat_fderr

Passed

N/A

0.012597s

lib/libc/c063/t_unlinkat

0.097453s

unlinkat_dir

Passed

N/A

0.012782s

unlinkat_fd

Passed

N/A

0.012959s

unlinkat_fdcwd

Passed

N/A

0.013244s

unlinkat_fdcwderr

Passed

N/A

0.012784s

unlinkat_fderr1

Passed

N/A

0.012836s

unlinkat_fderr2

Passed

N/A

0.012978s

unlinkat_fderr3

Passed

N/A

0.013021s

lib/libc/c063/t_utimensat

0.096927s

utimensat_fd

Passed

N/A

0.013838s

utimensat_fdcwd

Passed

N/A

0.012994s

utimensat_fdcwderr

Passed

N/A

0.013669s

utimensat_fderr1

Passed

N/A

0.012032s

utimensat_fderr2

Passed

N/A

0.012267s

utimensat_fderr3

Passed

N/A

0.012315s

utimensat_fdlink

Passed

N/A

0.011648s

lib/libc/db/t_db_hash_seq

0.059654s

test_hash_del_all

Passed

N/A

0.014572s

test_hash_del_alt

Passed

N/A

0.013790s

test_hash_del_every_7

Passed

N/A

0.014969s

test_hash_del_none

Passed

N/A

0.013306s

lib/libc/db/t_db

360.505400s

alternate_recno

Passed

N/A

0.262489s

big_btree

Passed

N/A

0.943121s

big_hash

Passed

N/A

0.395429s

big_recno

Passed

N/A

0.848510s

bsize_ffactor

Passed

N/A

40.018575s

bsize_torture

Passed

N/A

278.770040s

btree_byteswap_unaligned_access_bksd

Passed

N/A

0.203751s

btree_byteswap_unaligned_access_skbd

Passed

N/A

0.208706s

btree_known_byte_order

Passed

N/A

0.284685s

btree_recursive_traversal

Passed

N/A

2.382852s

btree_tricky_page_split

Passed

N/A

0.446776s

btree_weird_page_split

Passed

N/A

28.647301s

byte_orders_btree

Passed

N/A

0.333317s

byte_orders_hash

Passed

N/A

0.340753s

cursor_flags_btree

Passed

N/A

0.278704s

cursor_flags_recno

Passed

N/A

0.278914s

delete_btree

Passed

N/A

0.252115s

delete_recno

Passed

N/A

0.237890s

duplicate_btree

Passed

N/A

0.217916s

four_char_hash

Passed

N/A

0.163136s

medium_btree

Passed

N/A

0.199277s

medium_hash

Passed

N/A

0.190094s

medium_recno

Passed

N/A

0.182712s

random_recno

Passed

N/A

0.309962s

repeated_btree

Passed

N/A

0.242904s

repeated_hash

Passed

N/A

0.249715s

reverse_order_recno

Passed

N/A

0.213193s

reverse_recno

Passed

N/A

0.264455s

small_btree

Passed

N/A

0.182305s

small_hash

Passed

N/A

0.187159s

small_page_btree

Passed

N/A

2.510548s

small_recno

Passed

N/A

0.178512s

lib/libc/gen/exect/t_exect

0.012950s

t_exect_null

Skipped

exect(3) misdesigned and hangs - PR port-amd64/51700

0.012023s

lib/libc/gen/execve/t_execve

0.012707s

t_execve_null

Passed

N/A

0.011865s

lib/libc/gen/posix_spawn/t_spawn

0.106650s

t_spawn_child

Passed

N/A

0.027864s

t_spawn_ls

Passed

N/A

0.012464s

t_spawn_missing

Passed

N/A

0.013826s

t_spawn_nonexec

Passed

N/A

0.018046s

t_spawn_zero

Passed

N/A

0.016222s

t_spawnp_ls

Passed

N/A

0.013913s

lib/libc/gen/posix_spawn/t_fileactions

0.115647s

t_spawn_empty_fileactions

Passed

N/A

0.019006s

t_spawn_fileactions

Passed

N/A

0.018652s

t_spawn_open_nonexistent

Passed

N/A

0.012265s

t_spawn_open_nonexistent_diag

Passed

N/A

0.012050s

t_spawn_openmode

Passed

N/A

0.028032s

t_spawn_reopen

Passed

N/A

0.019669s

lib/libc/gen/posix_spawn/t_spawnattr

0.018515s

t_spawnattr

Passed

N/A

0.017609s

lib/libc/gen/t_alarm

1.044619s

alarm_basic

Passed

N/A

1.014817s

alarm_fork

Passed

N/A

0.014659s

alarm_previous

Passed

N/A

0.012709s

lib/libc/gen/t_assert

0.036745s

assert_false

Passed

N/A

0.013748s

assert_true

Passed

N/A

0.020460s

lib/libc/gen/t_basedirname

0.027629s

basename_posix

Passed

N/A

0.013390s

dirname_posix

Passed

N/A

0.012739s

lib/libc/gen/t_closefrom

0.085655s

closefrom_basic

Passed

N/A

0.025232s

closefrom_buffer

Passed

N/A

0.025747s

closefrom_err

Passed

N/A

0.012732s

closefrom_one

Passed

N/A

0.014829s

lib/libc/gen/t_cpuset

0.040445s

cpuset_err

Passed

N/A

0.013250s

cpuset_set

Passed

N/A

0.012680s

cpuset_size

Passed

N/A

0.012778s

lib/libc/gen/t_dir

0.048517s

seekdir_basic

Passed

N/A

0.013382s

telldir_leak

Passed

N/A

0.032983s

lib/libc/gen/t_floatunditf

0.013871s

floatunditf

Passed

N/A

0.013025s

lib/libc/gen/t_fmtcheck

0.013179s

fmtcheck_basic

Passed

N/A

0.012389s

lib/libc/gen/t_fnmatch

0.094460s

fnmatch_backslashes

Passed

N/A

0.012947s

fnmatch_casefold

Passed

N/A

0.012773s

fnmatch_initialbracket

Passed

N/A

0.012881s

fnmatch_leadingdir

Passed

N/A

0.012860s

fnmatch_noescape

Passed

N/A

0.012669s

fnmatch_pathname

Passed

N/A

0.012741s

fnmatch_period

Passed

N/A

0.012815s

lib/libc/gen/t_fpclassify

0.030866s

fpclassify_double

Passed

N/A

0.014822s

fpclassify_float

Passed

N/A

0.014460s

lib/libc/gen/t_fpsetmask

0.089361s

fpsetmask_basic

Passed

N/A

0.012447s

fpsetmask_masked_double

Passed

N/A

0.012243s

fpsetmask_masked_float

Passed

N/A

0.011649s

fpsetmask_masked_long_double

Passed

N/A

0.011707s

fpsetmask_unmasked_double

Passed

N/A

0.012236s

fpsetmask_unmasked_float

Passed

N/A

0.011920s

fpsetmask_unmasked_long_double

Passed

N/A

0.011706s

lib/libc/gen/t_fpsetround

0.013872s

fpsetround_basic

Passed

N/A

0.013087s

lib/libc/gen/t_ftok

0.036163s

ftok_err

Passed

N/A

0.012277s

ftok_link

Passed

N/A

0.022279s

lib/libc/gen/t_getcwd

1.455636s

getcwd_err

Passed

N/A

0.011477s

getcwd_fts

Passed

N/A

1.442531s

lib/libc/gen/t_getgrent

0.153228s

getgrent_loop

Passed

N/A

0.015986s

getgrent_setgid

Passed

N/A

0.135693s

lib/libc/gen/t_glob

0.028212s

glob_star

Passed

N/A

0.013653s

glob_star_not

Passed

N/A

0.012997s

lib/libc/gen/t_humanize_number

0.026981s

humanize_number_basic

Passed

N/A

0.012808s

humanize_number_big

Passed

N/A

0.012688s

lib/libc/gen/t_isnan

0.026918s

isinf_basic

Passed

N/A

0.012755s

isnan_basic

Passed

N/A

0.012634s

lib/libc/gen/t_nice

0.110238s

nice_err

Passed

N/A

0.016307s

nice_priority

Passed

N/A

0.061226s

nice_root

Passed

N/A

0.014583s

nice_thread

Passed

N/A

0.014904s

lib/libc/gen/t_pause

3.048928s

pause_basic

Passed

N/A

1.018021s

pause_kill

Passed

N/A

2.029362s

lib/libc/gen/t_raise

1.267990s

raise_err

Passed

N/A

0.013083s

raise_ret

Passed

N/A

1.022717s

raise_sig

Passed

N/A

0.109287s

raise_stress

Passed

N/A

0.120021s

lib/libc/gen/t_randomid

0.382872s

randomid_basic

Passed

N/A

0.382146s

lib/libc/gen/t_realpath

0.041329s

realpath_basic

Passed

N/A

0.013465s

realpath_huge

Passed

N/A

0.012570s

realpath_symlink

Passed

N/A

0.013137s

lib/libc/gen/t_setdomainname

0.076717s

setdomainname_basic

Passed

N/A

0.024620s

setdomainname_limit

Passed

N/A

0.024232s

setdomainname_perm

Passed

N/A

0.025207s

lib/libc/gen/t_sethostname

0.072728s

sethostname_basic

Passed

N/A

0.022779s

sethostname_limit

Passed

N/A

0.022508s

sethostname_perm

Passed

N/A

0.024873s

lib/libc/gen/t_siginfo

3.157256s

sigalarm

Passed

N/A

1.019297s

sigbus_adraln

Passed

N/A

0.014234s

sigchild_dump

Passed

N/A

1.030247s

sigchild_kill

Passed

N/A

0.016113s

sigchild_normal

Passed

N/A

1.027464s

sigfpe_flt

Passed

N/A

0.014564s

sigfpe_int

Passed

N/A

0.015012s

sigsegv

Passed

N/A

0.014626s

lib/libc/gen/t_sleep

166.030533s

kevent

Passed

N/A

26.598496s

nanosleep

Passed

N/A

36.789719s

poll

Passed

N/A

36.789734s

select

Passed

N/A

36.789607s

sleep

Passed

N/A

29.059089s

lib/libc/gen/t_syslog

0.017989s

syslog_pthread

Passed

N/A

0.017101s

lib/libc/gen/t_time

10.138826s

time_copy

Passed

N/A

0.013673s

time_mono

Passed

N/A

10.110028s

time_timeofday

Passed

N/A

0.012874s

lib/libc/gen/t_ttyname

0.058271s

ttyname_err

Passed

N/A

0.015205s

ttyname_r_err

Passed

N/A

0.015214s

ttyname_r_stdin

Passed

N/A

0.013342s

ttyname_stdin

Passed

N/A

0.011820s

lib/libc/gen/t_vis

0.092235s

strunvis_hex

Passed

N/A

0.011595s

strvis_basic

Passed

N/A

0.014805s

strvis_empty

Passed

N/A

0.011666s

strvis_locale

Passed

N/A

0.039357s

strvis_null

Passed

N/A

0.011716s

lib/libc/hash/t_sha2

0.041099s

t_sha256

Passed

N/A

0.012705s

t_sha384

Passed

N/A

0.013494s

t_sha512

Passed

N/A

0.012878s

lib/libc/hash/t_hmac

3.028295s

t_hmac

Passed

N/A

3.027475s

lib/libc/hash/t_hash

1.422820s

md5

Passed

N/A

0.166481s

sha1

Passed

N/A

1.254944s

lib/libc/inet/t_inet_addr

0.026475s

inet_addr_basic

Passed

N/A

0.012096s

inet_addr_err

Passed

N/A

0.013104s

lib/libc/inet/t_inet_network

0.024507s

inet_network_basic

Passed

N/A

0.011811s

inet_network_err

Passed

N/A

0.011336s

lib/libc/locale/t_mbrtowc

0.133805s

mbrtowc_internal

Passed

N/A

0.111891s

mbrtowc_object

Passed

N/A

0.020693s

lib/libc/locale/t_mbstowcs

0.029532s

mbstowcs_basic

Passed

N/A

0.028893s

lib/libc/locale/t_mbsnrtowcs

0.016122s

mbsnrtowcs

Passed

N/A

0.015497s

lib/libc/locale/t_mbtowc

0.136523s

mbtowc

Passed

N/A

0.135968s

lib/libc/locale/t_wcscspn

0.013402s

wcscspn

Passed

N/A

0.012776s

lib/libc/locale/t_wcspbrk

0.013222s

wcspbrk

Passed

N/A

0.012596s

lib/libc/locale/t_wcsspn

0.013281s

wcsspn

Passed

N/A

0.012663s

lib/libc/locale/t_wcstod

0.213820s

wcstod

Passed

N/A

0.213208s

lib/libc/locale/t_wctomb

0.047058s

wcrtomb

Passed

N/A

0.014961s

wcrtomb_state

Passed

N/A

0.014456s

wctomb

Passed

N/A

0.015533s

lib/libc/locale/t_io

0.082816s

bad_big5_getwc

Passed

N/A

0.014225s

bad_big5_swprintf

Passed

N/A

0.013201s

bad_big5_wprintf

Passed

N/A

0.013402s

good_big5_getwc

Passed

N/A

0.013030s

good_big5_swprintf

Passed

N/A

0.012718s

good_big5_wprintf

Passed

N/A

0.013261s

lib/libc/net/getaddrinfo/t_getaddrinfo

1.145391s

basic

Passed

N/A

0.234501s

empty_hostname

Passed

N/A

0.200329s

empty_servname

Passed

N/A

0.161405s

scopeaddr

Passed

N/A

0.115372s

sock_raw

Passed

N/A

0.160383s

specific

Passed

N/A

0.155026s

unsupported_family

Passed

N/A

0.112890s

lib/libc/net/t_getprotoent

0.104877s

endprotoent_rewind

Passed

N/A

0.012621s

getprotobyname_basic

Passed

N/A

0.015989s

getprotobyname_err

Passed

N/A

0.019777s

getprotobynumber_basic

Passed

N/A

0.013965s

getprotobynumber_err

Passed

N/A

0.014580s

getprotoent_next

Passed

N/A

0.012486s

setprotoent_rewind

Passed

N/A

0.011949s

lib/libc/net/t_ether_aton

0.014195s

tc_ether_aton

Passed

N/A

0.013421s

lib/libc/net/t_nsdispatch

0.141426s

recurse

Passed

N/A

0.140389s

lib/libc/net/t_protoent

0.163814s

protoent

Passed

N/A

0.162652s

lib/libc/net/t_servent

1.413275s

servent

Passed

N/A

1.409728s

lib/libc/net/t_hostent

4.344518s

dnsbyaddrlookup4

Passed

N/A

0.480780s

dnsbyaddrlookup6

Passed

N/A

0.457943s

dnsbynamelookup4

Passed

N/A

0.458216s

dnsbynamelookup6

Passed

N/A

0.480685s

gethostbyaddr4

Passed

N/A

0.479407s

gethostbyaddr6

Passed

N/A

0.469620s

gethostbyname4

Passed

N/A

0.463530s

gethostbyname6

Passed

N/A

0.466897s

hostsbyaddrlookup4

Passed

N/A

0.149071s

hostsbyaddrlookup6

Passed

N/A

0.141222s

hostsbynamelookup4

Passed

N/A

0.137746s

hostsbynamelookup6

Passed

N/A

0.140855s

lib/libc/regex/t_regex_att

0.156118s

basic

Passed

N/A

0.038832s

categorization

Passed

N/A

0.022912s

forcedassoc

Passed

N/A

0.021490s

leftassoc

Expected failure

Reason for breakage unknown: /usr/src/tests/lib/libc/regex/t_regex_att.c:377: res != matches ((0,4)(0,2)(2,3)(3,4) != (0,4)(0,1)(1,4)(4,4)): at line 3

0.014139s

nullsubexpr

Passed

N/A

0.016732s

repetition

Passed

N/A

0.021310s

rightassoc

Passed

N/A

0.015613s

lib/libc/regex/t_exhaust

0.460233s

regcomp_too_big

Passed

N/A

0.459500s

lib/libc/regex/t_regex

4.337114s

anchor

Passed

N/A

0.230514s

backref

Passed

N/A

0.220981s

basic

Passed

N/A

0.214121s

bracket

Passed

N/A

0.253194s

c_comments

Passed

N/A

0.219468s

complex

Passed

N/A

0.223354s

error

Passed

N/A

0.239284s

meta

Passed

N/A

0.225100s

nospec

Passed

N/A

0.223564s

paren

Passed

N/A

0.225520s

regress

Passed

N/A

0.216970s

repet_bounded

Passed

N/A

0.277306s

repet_multi

Passed

N/A

0.228021s

repet_ordinary

Passed

N/A

0.224225s

startend

Passed

N/A

0.214420s

subexp

Passed

N/A

0.226664s

subtle

Passed

N/A

0.220834s

word_bound

Passed

N/A

0.220025s

zero

Passed

N/A

0.220299s

lib/libc/rpc/t_xdr

0.014511s

xdr

Passed

N/A

0.013581s

lib/libc/rpc/t_rpc

4.196302s

get_svc_addr_tcp

Passed

N/A

0.029927s

get_svc_addr_udp

Passed

N/A

0.025315s

raw

Passed

N/A

0.013943s

tcp

Passed

N/A

1.034337s

tcp_poll

Passed

N/A

1.029616s

udp

Passed

N/A

1.028189s

udp_poll

Passed

N/A

1.029051s

lib/libc/setjmp/t_setjmp

0.050551s

_setjmp

Passed

N/A

0.012737s

setjmp

Passed

N/A

0.011616s

sigsetjmp_nosave

Passed

N/A

0.012387s

sigsetjmp_save

Passed

N/A

0.011286s

lib/libc/setjmp/t_threadjmp

0.053715s

_setjmp

Passed

N/A

0.012983s

setjmp

Passed

N/A

0.012799s

sigsetjmp_nosave

Passed

N/A

0.012635s

sigsetjmp_save

Passed

N/A

0.012675s

lib/libc/stdlib/t_abs

0.051670s

abs_basic

Passed

N/A

0.011546s

imaxabs_basic

Passed

N/A

0.011386s

labs_basic

Passed

N/A

0.012491s

llabs_basic

Passed

N/A

0.013137s

lib/libc/stdlib/t_atoi

0.055669s

atof_strtod

Passed

N/A

0.013833s

atoi_strtol

Passed

N/A

0.012837s

atol_strtol

Passed

N/A

0.012807s

atoll_strtoll

Passed

N/A

0.012758s

lib/libc/stdlib/t_div

0.041866s

div_basic

Passed

N/A

0.013448s

ldiv_basic

Passed

N/A

0.012726s

lldiv_basic

Passed

N/A

0.013275s

lib/libc/stdlib/t_getenv

17.921295s

clearenv_basic

Passed

N/A

0.063432s

getenv_basic

Passed

N/A

0.011727s

putenv_basic

Passed

N/A

0.013157s

setenv_basic

Passed

N/A

17.817542s

setenv_mixed

Passed

N/A

0.012035s

lib/libc/stdlib/t_getenv_thread

39.402917s

getenv_r_thread

Passed

N/A

9.402208s

putenv_thread

Passed

N/A

9.999450s

setenv_thread

Passed

N/A

9.999432s

unsetenv_thread

Passed

N/A

9.999217s

lib/libc/stdlib/t_exit

0.094042s

exit_atexit

Passed

N/A

0.016674s

exit_basic

Passed

N/A

0.015601s

exit_status

Passed

N/A

0.040263s

exit_tmpfile

Passed

N/A

0.018421s

lib/libc/stdlib/t_hsearch

0.103528s

hsearch_basic

Passed

N/A

0.011755s

hsearch_duplicate

Passed

N/A

0.013115s

hsearch_nonexistent

Passed

N/A

0.013017s

hsearch_r_basic

Passed

N/A

0.012863s

hsearch_r_duplicate

Passed

N/A

0.012542s

hsearch_r_nonexistent

Passed

N/A

0.012352s

hsearch_r_two

Passed

N/A

0.011665s

hsearch_two

Passed

N/A

0.011350s

lib/libc/stdlib/t_mi_vector_hash

0.012248s

mi_vector_hash_basic

Passed

N/A

0.011181s

lib/libc/stdlib/t_posix_memalign

0.029052s

aligned_alloc_basic

Passed

N/A

0.014299s

posix_memalign_basic

Passed

N/A

0.013438s

lib/libc/stdlib/t_random

0.017558s

random_same

Passed

N/A

0.016839s

lib/libc/stdlib/t_strtod

0.165889s

strtod_basic

Passed

N/A

0.016907s

strtod_gherman_bug

Passed

N/A

0.014171s

strtod_hex

Passed

N/A

0.013983s

strtod_inf

Passed

N/A

0.014068s

strtod_nan

Passed

N/A

0.014164s

strtod_round

Passed

N/A

0.014240s

strtod_underflow

Passed

N/A

0.014171s

strtof_inf

Passed

N/A

0.014154s

strtof_nan

Passed

N/A

0.014115s

strtold_inf

Passed

N/A

0.014051s

strtold_nan

Passed

N/A

0.013997s

lib/libc/stdlib/t_strtol

0.054202s

strtol_base

Passed

N/A

0.013159s

strtol_case

Passed

N/A

0.012730s

strtol_range

Passed

N/A

0.012706s

strtol_signed

Passed

N/A

0.012601s

lib/libc/stdlib/t_strtoi

0.054135s

strtoi_base

Passed

N/A

0.013208s

strtoi_case

Passed

N/A

0.012767s

strtoi_range

Passed

N/A

0.012682s

strtoi_signed

Passed

N/A

0.012533s

lib/libc/stdlib/t_system

0.080583s

system_basic

Passed

N/A

0.079751s

lib/libc/stdlib/t_atexit

0.128354s

atexit

Passed

N/A

0.127030s

lib/libc/stdlib/t_getopt

0.899422s

getopt

Passed

N/A

0.474682s

getopt_long

Passed

N/A

0.422911s

lib/libc/stdio/t_clearerr

0.034699s

clearerr_basic

Passed

N/A

0.021485s

clearerr_err

Passed

N/A

0.011654s

lib/libc/stdio/t_fflush

0.069645s

fflush_err

Passed

N/A

0.022522s

fflush_seek

Passed

N/A

0.022583s

fpurge_err

Passed

N/A

0.022127s

lib/libc/stdio/t_fmemopen

0.431512s

test00

Passed

N/A

0.012515s

test01

Passed

N/A

0.012092s

test02

Passed

N/A

0.015153s

test03

Passed

N/A

0.014432s

test04

Passed

N/A

0.016011s

test05

Passed

N/A

0.013266s

test06

Passed

N/A

0.013238s

test07

Passed

N/A

0.013055s

test08

Passed

N/A

0.013321s

test09

Passed

N/A

0.028693s

test10

Passed

N/A

0.025288s

test11

Passed

N/A

0.022037s

test12

Passed

N/A

0.018089s

test13

Passed

N/A

0.018434s

test14

Passed

N/A

0.017306s

test15

Passed

N/A

0.020930s

test16

Passed

N/A

0.014153s

test17

Passed

N/A

0.016092s

test18

Passed

N/A

0.013628s

test19

Passed

N/A

0.026877s

test20

Passed

N/A

0.013849s

test21

Passed

N/A

0.017262s

test22

Passed

N/A

0.038804s

lib/libc/stdio/t_fopen

0.230250s

fdopen_close

Passed

N/A

0.023820s

fdopen_err

Passed

N/A

0.024651s

fdopen_seek

Passed

N/A

0.023203s

fopen_append

Passed

N/A

0.023413s

fopen_err

Passed

N/A

0.023065s

fopen_mode

Passed

N/A

0.023197s

fopen_perm

Passed

N/A

0.015735s

fopen_regular

Passed

N/A

0.013277s

fopen_seek

Passed

N/A

0.025511s

freopen_std

Passed

N/A

0.026437s

lib/libc/stdio/t_open_memstream

0.014364s

test_open_memstream

Passed

N/A

0.013482s

lib/libc/stdio/t_fputc

0.154653s

fputc_basic

Passed

N/A

0.025754s

fputc_err

Passed

N/A

0.024986s

putc_basic

Passed

N/A

0.024873s

putc_err

Passed

N/A

0.024715s

putc_unlocked_basic

Passed

N/A

0.025043s

putc_unlocked_err

Passed

N/A

0.024773s

lib/libc/stdio/t_mktemp

0.013332s

mktemp_not_exist

Passed

N/A

0.012557s

lib/libc/stdio/t_popen

0.174546s

popen_zeropad

Passed

N/A

0.173754s

lib/libc/stdio/t_printf

0.559891s

snprintf_c99

Passed

N/A

0.012598s

snprintf_dotzero

Passed

N/A

0.012017s

snprintf_float

Passed

N/A

0.482423s

snprintf_posarg

Passed

N/A

0.011883s

snprintf_posarg_error

Passed

N/A

0.011697s

snprintf_posarg_width

Passed

N/A

0.011650s

sprintf_zeropad

Passed

N/A

0.012256s

lib/libc/stdio/t_scanf

0.027296s

sscanf_neghex

Passed

N/A

0.012096s

sscanf_whitespace

Passed

N/A

0.013525s

lib/libc/string/t_bm

0.012568s

bm

Passed

N/A

0.011755s

lib/libc/string/t_memchr

0.039217s

memchr_basic

Passed

N/A

0.013008s

memchr_simple

Passed

N/A

0.012488s

memrchr_simple

Passed

N/A

0.011505s

lib/libc/string/t_memcpy

3.207967s

memccpy_simple

Passed

N/A

0.011773s

memcpy_basic

Passed

N/A

3.181027s

memcpy_return

Passed

N/A

0.013126s

lib/libc/string/t_memmem

0.013915s

memmem_basic

Passed

N/A

0.012867s

lib/libc/string/t_memset

0.099839s

bzero_zero_size

Passed

N/A

0.013473s

memset_array

Passed

N/A

0.012836s

memset_basic

Passed

N/A

0.012926s

memset_nonzero

Passed

N/A

0.016970s

memset_return

Passed

N/A

0.012582s

memset_struct

Passed

N/A

0.012774s

memset_zero_size

Passed

N/A

0.013433s

lib/libc/string/t_popcount

0.027653s

popcount_basic

Skipped

config variable "run_popcount" not set to YES/TRUE

0.013230s

popcountll_basic

Skipped

config variable "run_popcount" not set to YES/TRUE

0.013010s

lib/libc/string/t_strcat

0.059035s

strcat_basic

Passed

N/A

0.045241s

strncat_simple

Passed

N/A

0.012362s

lib/libc/string/t_strchr

0.015178s

strchr_basic

Passed

N/A

0.014400s

lib/libc/string/t_strcmp

0.025526s

strcmp_basic

Passed

N/A

0.012464s

strcmp_simple

Passed

N/A

0.011555s

lib/libc/string/t_strcpy

0.013267s

strcpy_basic

Passed

N/A

0.012496s

lib/libc/string/t_strcspn

0.012591s

strcspn

Passed

N/A

0.011786s

lib/libc/string/t_strerror

0.105208s

strerror_basic

Passed

N/A

0.039068s

strerror_err

Passed

N/A

0.012347s

strerror_r_basic

Passed

N/A

0.038329s

strerror_r_err

Passed

N/A

0.012389s

lib/libc/string/t_stresep

0.012418s

stresep_basic

Passed

N/A

0.011547s

lib/libc/string/t_strlen

0.422609s

strlen_basic

Passed

N/A

0.012275s

strlen_huge

Passed

N/A

0.394295s

strnlen_basic

Passed

N/A

0.013694s

lib/libc/string/t_strpbrk

0.014155s

strpbrk

Passed

N/A

0.013062s

lib/libc/string/t_strrchr

0.014227s

strrchr_basic

Passed

N/A

0.013421s

lib/libc/string/t_strspn

0.013229s

strspn

Passed

N/A

0.012390s

lib/libc/string/t_swab

0.013941s

swab_basic

Passed

N/A

0.013088s

lib/libc/sys/t_access

0.094489s

access_access

Passed

N/A

0.027069s

access_fault

Passed

N/A

0.012848s

access_inval

Passed

N/A

0.012500s

access_notdir

Passed

N/A

0.012747s

access_notexist

Passed

N/A

0.012819s

access_toolong

Passed

N/A

0.011743s

lib/libc/sys/t_bind

0.012510s

bind_foreign_family

Passed

N/A

0.011631s

lib/libc/sys/t_chroot

0.086716s

chroot_basic

Passed

N/A

0.014182s

chroot_err

Passed

N/A

0.011437s

chroot_perm

Passed

N/A

0.015009s

fchroot_basic

Passed

N/A

0.013491s

fchroot_err

Passed

N/A

0.012234s

fchroot_perm

Passed

N/A

0.014757s

lib/libc/sys/t_clock_gettime

17.393833s

clock_gettime_real

Passed

N/A

17.393802s

lib/libc/sys/t_clock_nanosleep

0.013673s

clock_nanosleep_remain

Passed

N/A

0.012852s

lib/libc/sys/t_clone

0.056308s

clone_basic

Passed

N/A

0.012396s

clone_null_func

Passed

N/A

0.013042s

clone_null_stack

Passed

N/A

0.012920s

clone_out_of_proc

Passed

N/A

0.014843s

lib/libc/sys/t_connect

0.028062s

connect_foreign_family

Passed

N/A

0.013221s

connect_low_port

Passed

N/A

0.013338s

lib/libc/sys/t_dup

0.177399s

dup2_basic

Passed

N/A

0.012542s

dup2_err

Passed

N/A

0.011699s

dup2_max

Passed

N/A

0.011645s

dup2_mode

Passed

N/A

0.024015s

dup3_err

Passed

N/A

0.012226s

dup3_max

Passed

N/A

0.011569s

dup3_mode

Passed

N/A

0.024149s

dup_err

Passed

N/A

0.011557s

dup_max

Passed

N/A

0.025202s

dup_mode

Passed

N/A

0.024961s

lib/libc/sys/t_fsync

0.028079s

fsync_err

Passed

N/A

0.012460s

fsync_sync

Passed

N/A

0.014045s

lib/libc/sys/t_getcontext

0.038382s

getcontext_err

Passed

N/A

0.011945s

setcontext_err

Passed

N/A

0.011431s

setcontext_link

Passed

N/A

0.012676s

lib/libc/sys/t_getgroups

0.066441s

getgroups_err

Passed

N/A

0.011691s

getgroups_getgid

Passed

N/A

0.012758s

getgroups_setgid

Passed

N/A

0.026329s

getgroups_zero

Passed

N/A

0.012903s

lib/libc/sys/t_getitimer

0.081378s

getitimer_empty

Passed

N/A

0.013182s

getitimer_err

Passed

N/A

0.013326s

setitimer_basic

Passed

N/A

0.026051s

setitimer_err

Passed

N/A

0.012658s

setitimer_old

Passed

N/A

0.012645s

lib/libc/sys/t_getlogin

0.075643s

getlogin_r_err

Passed

N/A

0.013059s

getlogin_same

Passed

N/A

0.012132s

setlogin_basic

Passed

N/A

0.014922s

setlogin_err

Passed

N/A

0.014921s

setlogin_perm

Passed

N/A

0.016875s

lib/libc/sys/t_getpid

0.052020s

getpid_process

Passed

N/A

0.035091s

getpid_thread

Passed

N/A

0.015459s

lib/libc/sys/t_getrusage

9.237116s

getrusage_err

Passed

N/A

0.013031s

getrusage_sig

Passed

N/A

0.012772s

getrusage_utime_back

Expected failure

PR kern/30115: anticipated error did not occur

9.192844s

getrusage_utime_zero

Expected failure

PR kern/30115: zero user time from getrusage(2)

0.015459s

lib/libc/sys/t_getsid

0.042023s

getsid_current

Passed

N/A

0.012719s

getsid_err

Passed

N/A

0.012436s

getsid_process

Passed

N/A

0.014632s

lib/libc/sys/t_getsockname

0.013933s

getsockname_unix

Passed

N/A

0.013108s

lib/libc/sys/t_gettimeofday

0.027629s

gettimeofday_err

Passed

N/A

0.013096s

gettimeofday_mono

Passed

N/A

0.013014s

lib/libc/sys/t_issetugid

0.068100s

issetugid_egid

Passed

N/A

0.016528s

issetugid_euid

Passed

N/A

0.016255s

issetugid_rgid

Passed

N/A

0.016278s

issetugid_ruid

Passed

N/A

0.016029s

lib/libc/sys/t_kevent

0.101494s

kevent_zerotimer

Passed

N/A

0.015456s

kqueue_desc_passing

Skipped

PR kern/46523

0.015727s

kqueue_unsupported_fd

Passed

N/A

0.067905s

lib/libc/sys/t_kill

1.087866s

kill_basic

Passed

N/A

0.014867s

kill_err

Passed

N/A

0.013634s

kill_perm

Passed

N/A

1.021553s

kill_pgrp_neg

Passed

N/A

0.017327s

kill_pgrp_zero

Passed

N/A

0.016479s

lib/libc/sys/t_link

0.084562s

link_count

Passed

N/A

0.022778s

link_err

Passed

N/A

0.022729s

link_perm

Passed

N/A

0.013235s

link_stat

Passed

N/A

0.022668s

lib/libc/sys/t_listen

0.037720s

listen_err

Passed

N/A

0.024628s

listen_low_port

Passed

N/A

0.011730s

lib/libc/sys/t_lwp_ctl

0.027341s

lwpctl_counter

Passed

N/A

0.026705s

lib/libc/sys/t_lwp_create

0.073048s

lwp_create_generic_fail_no_uc_cpu

Passed

N/A

0.011910s

lwp_create_sparc_fail_npc_null

Passed

N/A

0.011373s

lwp_create_sparc_fail_npc_odd

Passed

N/A

0.011437s

lwp_create_sparc_fail_pc_null

Passed

N/A

0.011533s

lwp_create_sparc_fail_pc_odd

Passed

N/A

0.011475s

lwp_create_works

Passed

N/A

0.012213s

lib/libc/sys/t_minherit

0.069719s

minherit_bad

Passed

N/A

0.011385s

minherit_copy

Passed

N/A

0.014439s

minherit_none

Passed

N/A

0.013243s

minherit_share

Passed

N/A

0.014096s

minherit_zero

Passed

N/A

0.013817s

lib/libc/sys/t_mincore

0.107014s

mincore_err

Passed

N/A

0.011566s

mincore_resid

Passed

N/A

0.073936s

mincore_shmseg

Passed

N/A

0.019533s

lib/libc/sys/t_mkdir

1.086117s

mkdir_err

Passed

N/A

0.011884s

mkdir_mode

Passed

N/A

1.034005s

mkdir_perm

Passed

N/A

0.025161s

mkdir_trail

Passed

N/A

0.011818s

lib/libc/sys/t_mkfifo

2.142907s

mkfifo_block

Passed

N/A

1.030192s

mkfifo_err

Passed

N/A

0.025125s

mkfifo_nonblock

Passed

N/A

1.031477s

mkfifo_perm

Passed

N/A

0.027587s

mkfifo_stat

Passed

N/A

0.024494s

lib/libc/sys/t_mknod

0.104005s

mknod_err

Passed

N/A

0.024555s

mknod_exist

Passed

N/A

0.024771s

mknod_perm

Passed

N/A

0.027715s

mknod_stat

Passed

N/A

0.023512s

lib/libc/sys/t_mlock

0.082832s

mlock_clip

Passed

N/A

0.012280s

mlock_err

Passed

N/A

0.013914s

mlock_limits

Passed

N/A

0.026751s

mlock_mmap

Passed

N/A

0.013266s

mlock_nested

Passed

N/A

0.013125s

lib/libc/sys/t_mmap

0.188336s

mmap_block

Skipped

The test case causes a panic (PR kern/38889, kern/46592)

0.013378s

mmap_err

Passed

N/A

0.012996s

mmap_loan

Passed

N/A

0.028129s

mmap_prot_1

Passed

N/A

0.023809s

mmap_prot_2

Passed

N/A

0.013773s

mmap_prot_3

Passed

N/A

0.025517s

mmap_truncate

Passed

N/A

0.023112s

mmap_truncate_signal

Passed

N/A

0.027329s

mmap_va0

Passed

N/A

0.013487s

lib/libc/sys/t_mprotect

0.084184s

mprotect_access

Passed

N/A

0.025316s

mprotect_err

Passed

N/A

0.013340s

mprotect_exec

Skipped

Execute protection callback check not implemented

0.013386s

mprotect_pax

Failed

non-executable mapping made executable

0.013298s

mprotect_write

Passed

N/A

0.015185s

lib/libc/sys/t_msgctl

2.140552s

msgctl_err

Passed

N/A

0.024434s

msgctl_perm

Passed

N/A

0.025897s

msgctl_pid

Passed

N/A

2.039942s

msgctl_set

Passed

N/A

0.023809s

msgctl_time

Passed

N/A

0.022438s

lib/libc/sys/t_msgget

0.119061s

msgget_excl

Passed

N/A

0.025402s

msgget_exit

Passed

N/A

0.025078s

msgget_init

Passed

N/A

0.022925s

msgget_limit

Passed

N/A

0.015902s

msgget_mode

Passed

N/A

0.025894s

lib/libc/sys/t_msgrcv

4.172930s

msgrcv_basic

Passed

N/A

0.025145s

msgrcv_block

Passed

N/A

2.041175s

msgrcv_err

Passed

N/A

0.024343s

msgrcv_mtype

Passed

N/A

0.024563s

msgrcv_nonblock

Passed

N/A

2.028751s

msgrcv_truncate

Passed

N/A

0.024554s

lib/libc/sys/t_msgsnd

4.141052s

msgsnd_block

Passed

N/A

2.033110s

msgsnd_count

Passed

N/A

0.025116s

msgsnd_err

Passed

N/A

0.024611s

msgsnd_nonblock

Passed

N/A

2.026330s

msgsnd_perm

Passed

N/A

0.028160s

lib/libc/sys/t_msync

0.077789s

msync_async

Passed

N/A

0.018027s

msync_err

Passed

N/A

0.022177s

msync_invalidate

Passed

N/A

0.017541s

msync_sync

Passed

N/A

0.017229s

lib/libc/sys/t_nanosleep

1.217542s

nanosleep_basic

Passed

N/A

0.185910s

nanosleep_err

Passed

N/A

0.013008s

nanosleep_sig

Passed

N/A

1.016449s

lib/libc/sys/t_pipe

2.038541s

pipe_restart

Passed

N/A

2.037837s

lib/libc/sys/t_pipe2

0.080668s

pipe2_basic

Passed

N/A

0.013313s

pipe2_cloexec

Passed

N/A

0.012904s

pipe2_consume

Passed

N/A

0.012868s

pipe2_einval

Passed

N/A

0.012696s

pipe2_nonblock

Passed

N/A

0.012819s

pipe2_nosigpipe

Passed

N/A

0.012616s

lib/libc/sys/t_poll

11.104513s

poll_3way

Passed

N/A

10.020075s

poll_basic

Passed

N/A

0.025584s

poll_err

Passed

N/A

0.013572s

pollts_basic

Passed

N/A

1.015598s

pollts_err

Passed

N/A

0.013155s

pollts_sigmask

Passed

N/A

0.013088s

lib/libc/sys/t_posix_fallocate

0.013817s

ebadf

Passed

N/A

0.013182s

lib/libc/sys/t_recvmmsg

0.017422s

recvmmsg_basic

Passed

N/A

0.016817s

lib/libc/sys/t_revoke

0.071223s

revoke_basic

Passed

N/A

0.026885s

revoke_err

Passed

N/A

0.014354s

revoke_perm

Passed

N/A

0.027905s

lib/libc/sys/t_select

1.033701s

pselect_sigmask

Passed

N/A

1.017861s

pselect_timeout

Passed

N/A

0.014443s

lib/libc/sys/t_setrlimit

0.165168s

setrlimit_basic

Passed

N/A

0.011757s

setrlimit_current

Passed

N/A

0.011550s

setrlimit_err

Passed

N/A

0.011512s

setrlimit_fsize

Passed

N/A

0.024759s

setrlimit_memlock

Passed

N/A

0.013440s

setrlimit_nofile_1

Passed

N/A

0.015050s

setrlimit_nofile_2

Passed

N/A

0.014539s

setrlimit_nproc

Passed

N/A

0.015173s

setrlimit_nthr

Passed

N/A

0.013100s

setrlimit_perm

Passed

N/A

0.012901s

setrlimit_stack

Passed

N/A

0.013223s

lib/libc/sys/t_setuid

0.117919s

setuid_perm

Passed

N/A

0.012912s

setuid_real

Passed

N/A

0.012109s

setuid_root

Passed

N/A

0.090471s

lib/libc/sys/t_sigaction

0.041174s

sigaction_basic

Passed

N/A

0.011630s

sigaction_noflags

Passed

N/A

0.013937s

sigaction_resethand

Passed

N/A

0.013696s

lib/libc/sys/t_sigqueue

1.039269s

sigqueue_basic

Passed

N/A

0.011784s

sigqueue_err

Passed

N/A

0.011370s

sigqueue_rt

Passed

N/A

1.014148s

lib/libc/sys/t_sigtimedwait

10.046914s

sigtimedwait_NULL_timeout

Passed

N/A

5.016155s

sigtimedwait_all0timeout

Passed

N/A

0.012076s

sigtimedwait_small_timeout

Passed

N/A

5.016690s

lib/libc/sys/t_socketpair

0.036572s

socketpair_basic

Passed

N/A

0.011699s

socketpair_cloexec

Passed

N/A

0.011516s

socketpair_nonblock

Passed

N/A

0.011381s

lib/libc/sys/t_swapcontext

0.025114s

swapcontext1

Passed

N/A

0.011945s

swapcontext2

Passed

N/A

0.011871s

lib/libc/sys/t_stat

4.059871s

stat_chflags

Passed

N/A

0.022904s

stat_dir

Passed

N/A

0.887438s

stat_err

Passed

N/A

0.012596s

stat_mtime

Passed

N/A

3.046114s

stat_perm

Passed

N/A

0.022813s

stat_size

Passed

N/A

0.023189s

stat_socket

Passed

N/A

0.014391s

stat_symlink

Passed

N/A

0.024711s

lib/libc/sys/t_timer_create

6.087449s

timer_create_err

Passed

N/A

0.012009s

timer_create_mono

Passed

N/A

1.014356s

timer_create_mono_expire

Passed

N/A

2.018854s

timer_create_real

Passed

N/A

1.020165s

timer_create_real_expire

Passed

N/A

2.018888s

lib/libc/sys/t_truncate

0.082825s

ftruncate_basic

Passed

N/A

0.026847s

ftruncate_err

Passed

N/A

0.015213s

truncate_basic

Passed

N/A

0.024011s

truncate_err

Passed

N/A

0.013074s

lib/libc/sys/t_ucontext

0.013839s

ucontext_basic

Passed

N/A

0.013031s

lib/libc/sys/t_umask

0.092714s

umask_fork

Passed

N/A

0.040132s

umask_open

Passed

N/A

0.026009s

umask_previous

Passed

N/A

0.024395s

lib/libc/sys/t_unlink

0.142293s

unlink_basic

Passed

N/A

0.062344s

unlink_err

Passed

N/A

0.024655s

unlink_fifo

Passed

N/A

0.023869s

unlink_perm

Passed

N/A

0.027675s

lib/libc/sys/t_wait

0.091034s

wait6_coredumped

Passed

N/A

0.018277s

wait6_exited

Passed

N/A

0.014049s

wait6_invalid

Passed

N/A

0.011457s

wait6_stop_and_go

Passed

N/A

0.013093s

wait6_stopgo_loop

Passed

N/A

0.016558s

wait6_terminated

Passed

N/A

0.013559s

lib/libc/sys/t_wait_noproc

0.137190s

wait

Passed

N/A

0.012363s

wait3

Passed

N/A

0.011504s

wait3_options

Passed

N/A

0.011753s

wait4

Passed

N/A

0.011734s

wait4_options

Passed

N/A

0.012286s

wait6

Passed

N/A

0.011629s

wait6_options

Passed

N/A

0.011968s

waitid

Passed

N/A

0.012236s

waitid_options

Passed

N/A

0.012153s

waitpid

Passed

N/A

0.011707s

waitpid_options

Passed

N/A

0.011949s

lib/libc/sys/t_wait_noproc_wnohang

0.136485s

wait3

Passed

N/A

0.011972s

wait3_options

Passed

N/A

0.012002s

wait4

Passed

N/A

0.011762s

wait4_options

Passed

N/A

0.011896s

wait6

Passed

N/A

0.016232s

wait6_options

Passed

N/A

0.014795s

waitid

Passed

N/A

0.011988s

waitid_options

Passed

N/A

0.014427s

waitpid

Passed

N/A

0.012296s

waitpid_options

Passed

N/A

0.013264s

lib/libc/sys/t_write

0.096785s

write_err

Passed

N/A

0.023240s

write_pipe

Passed

N/A

0.011630s

write_pos

Passed

N/A

0.023397s

write_ret

Passed

N/A

0.023057s

writev_iovmax

Passed

N/A

0.011802s

lib/libc/sys/t_posix_fadvise

0.081650s

posix_fadvise

Passed

N/A

0.020909s

posix_fadvise_reg

Passed

N/A

0.059100s

lib/libc/termios/t_tcsetpgrp

0.014257s

tcsetpgrp_err

Passed

N/A

0.013352s

lib/libc/time/t_mktime

0.039825s

localtime_r_gmt

Passed

N/A

0.012951s

mktime_negyear

Passed

N/A

0.012256s

timegm_epoch

Passed

N/A

0.012168s

lib/libc/time/t_strptime

0.120299s

Zone

Passed

N/A

0.030273s

common

Passed

N/A

0.011562s

day

Passed

N/A

0.011376s

hour

Passed

N/A

0.011370s

month

Passed

N/A

0.011580s

seconds

Passed

N/A

0.011396s

year

Passed

N/A

0.012023s

zone

Passed

N/A

0.016284s

lib/libc/tls/t_tls_static

0.008264s

t_tls_static

Passed

N/A

0.007738s

lib/libc/tls/t_tls_dynamic

0.023630s

t_tls_dynamic

Passed

N/A

0.022875s

lib/libc/tls/t_tls_dlopen

0.032948s

t_tls_dlopen

Passed

N/A

0.032376s

lib/libc/ttyio/t_ptm

0.027180s

ptm

Passed

N/A

0.012651s

ptmx

Passed

N/A

0.013406s

lib/libc/ttyio/t_ttyio

2.022806s

ioctl

Passed

N/A

2.021996s

lib/libc/ssp/t_ssp

3.180717s

fgets

Passed

N/A

0.167214s

getcwd

Passed

N/A

0.164046s

gets

Passed

N/A

0.177168s

memcpy

Passed

N/A

0.162166s

memmove

Passed

N/A

0.159945s

memset

Passed

N/A

0.166129s

raw

Passed

N/A

0.165032s

read

Passed

N/A

0.178246s

readlink

Passed

N/A

0.167986s

snprintf

Passed

N/A

0.170242s

sprintf

Passed

N/A

0.164193s

stpcpy

Passed

N/A

0.164836s

stpncpy

Passed

N/A

0.168941s

strcat

Passed

N/A

0.171860s

strcpy

Passed

N/A

0.161175s

strncat

Passed

N/A

0.172095s

strncpy

Passed

N/A

0.156175s

vsnprintf

Passed

N/A

0.156442s

vsprintf

Passed

N/A

0.156753s

lib/libc/t_convfp

0.047209s

cast_ulong

Passed

N/A

0.011342s

cast_ulong2

Passed

N/A

0.011105s

conv_uint

Passed

N/A

0.011255s

conv_ulong

Passed

N/A

0.011358s

lib/libc/t_gdtoa

0.020917s

long_format

Passed

N/A

0.020328s

lib/libc/t_cdb

0.116683s

cdb

Passed

N/A

0.116086s

lib/libcrypt/t_crypt

0.023955s

crypt_salts

Passed

N/A

0.023383s

lib/libcurses/t_curses

14.014048s

addch

Passed

N/A

0.354909s

addchnstr

Passed

N/A

0.197758s

addchstr

Passed

N/A

0.198879s

addnstr

Passed

N/A

0.199442s

addstr

Passed

N/A

0.198966s

assume_default_colors

Passed

N/A

0.339821s

attributes

Passed

N/A

0.419349s

background

Passed

N/A

0.429394s

box

Passed

N/A

0.272734s

can_change_color

Passed

N/A

0.175480s

cbreak

Passed

N/A

0.459387s

clear

Passed

N/A

2.389858s

copywin

Passed

N/A

1.479227s

curs_set

Passed

N/A

0.208707s

getch

Passed

N/A

0.189066s

getstr

Passed

N/A

0.351620s

mvwin

Passed

N/A

0.337307s

startup

Passed

N/A

0.159737s

termattrs

Passed

N/A

0.178519s

timeout

Passed

N/A

4.430635s

wborder

Passed

N/A

0.258742s

window

Passed

N/A

0.198751s

wprintw

Passed

N/A

0.220391s

wscrl

Passed

N/A

0.348842s

lib/libevent/t_event

244.628662s

kqueue

Passed

N/A

82.830257s

poll

Passed

N/A

80.921946s

select

Passed

N/A

80.874460s

lib/libexecinfo/t_backtrace

0.029850s

backtrace_fmt_basic

Passed

N/A

0.029360s

lib/libm/t_acos

0.041725s

acos_inrange

Passed

N/A

0.012909s

acos_is_nan

Passed

N/A

0.013885s

acos_is_plus_zero

Passed

N/A

0.012864s

lib/libm/t_asin

0.205206s

asin_inf_neg

Passed

N/A

0.013118s

asin_inf_pos

Passed

N/A

0.012764s

asin_inrange

Passed

N/A

0.015823s

asin_nan

Passed

N/A

0.013405s

asin_range

Passed

N/A

0.014825s

asin_zero_neg

Passed

N/A

0.014702s

asin_zero_pos

Passed

N/A

0.014654s

asinf_inf_neg

Passed

N/A

0.014726s

asinf_inf_pos

Passed

N/A

0.014740s

asinf_inrange

Passed

N/A

0.014290s

asinf_nan

Passed

N/A

0.012810s

asinf_range

Passed

N/A

0.012823s

asinf_zero_neg

Passed

N/A

0.012851s

asinf_zero_pos

Passed

N/A

0.012701s

lib/libm/t_atan

0.054138s

atan_inrange

Passed

N/A

0.012969s

atan_nan

Passed

N/A

0.012515s

atan_zero_neg

Passed

N/A

0.013567s

atan_zero_pos

Passed

N/A

0.012391s

lib/libm/t_casinh

0.013369s

casinh

Passed

N/A

0.012611s

lib/libm/t_cbrt

0.268018s

cbrt_inf_neg

Passed

N/A

0.013183s

cbrt_inf_pos

Passed

N/A

0.015635s

cbrt_nan

Passed

N/A

0.013065s

cbrt_pow

Passed

N/A

0.014047s

cbrt_zero_neg

Passed

N/A

0.012908s

cbrt_zero_pos

Passed

N/A

0.012880s

cbrtf_inf_neg

Passed

N/A

0.012867s

cbrtf_inf_pos

Passed

N/A

0.012774s

cbrtf_nan

Passed

N/A

0.012833s

cbrtf_powf

Passed

N/A

0.015125s

cbrtf_zero_neg

Passed

N/A

0.014758s

cbrtf_zero_pos

Passed

N/A

0.015014s

cbrtl_inf_neg

Passed

N/A

0.014398s

cbrtl_inf_pos

Passed

N/A

0.014875s

cbrtl_nan

Passed

N/A

0.014923s

cbrtl_powl

Passed

N/A

0.015005s

cbrtl_zero_neg

Passed

N/A

0.015381s

cbrtl_zero_pos

Passed

N/A

0.014948s

lib/libm/t_ceil

0.861294s

ceil_basic

Passed

N/A

0.017347s

ceil_inf_neg

Passed

N/A

0.016580s

ceil_inf_pos

Passed

N/A

0.016371s

ceil_nan

Passed

N/A

0.017011s

ceil_zero_neg

Passed

N/A

0.015511s

ceil_zero_pos

Passed

N/A

0.014781s

ceilf_basic

Passed

N/A

0.017671s

ceilf_inf_neg

Passed

N/A

0.014811s

ceilf_inf_pos

Passed

N/A

0.016644s

ceilf_nan

Passed

N/A

0.014800s

ceilf_zero_neg

Passed

N/A

0.014629s

ceilf_zero_pos

Passed

N/A

0.014803s

ceill_basic

Passed

N/A

0.014573s

ceill_inf_neg

Passed

N/A

0.014343s

ceill_inf_pos

Passed

N/A

0.014538s

ceill_nan

Passed

N/A

0.014344s

ceill_zero_neg

Passed

N/A

0.014347s

ceill_zero_pos

Passed

N/A

0.015285s

floor_basic

Passed

N/A

0.015164s

floor_inf_neg

Passed

N/A

0.014315s

floor_inf_pos

Passed

N/A

0.014631s

floor_nan

Passed

N/A

0.014480s

floor_zero_neg

Passed

N/A

0.014396s

floor_zero_pos

Passed

N/A

0.014214s

floorf_basic

Passed

N/A

0.014540s

floorf_inf_neg

Passed

N/A

0.014389s

floorf_inf_pos

Passed

N/A

0.032092s

floorf_nan

Passed

N/A

0.015762s

floorf_zero_neg

Passed

N/A

0.016500s

floorf_zero_pos

Passed

N/A

0.015339s

floorl_basic

Passed

N/A

0.015630s

floorl_inf_neg

Passed

N/A

0.015245s

floorl_inf_pos

Passed

N/A

0.014709s

floorl_nan

Passed

N/A

0.014800s

floorl_zero_neg

Passed

N/A

0.014520s

floorl_zero_pos

Passed

N/A

0.014962s

trunc_basic

Passed

N/A

0.014602s

trunc_inf_neg

Passed

N/A

0.014983s

trunc_inf_pos

Passed

N/A

0.014833s

trunc_nan

Passed

N/A

0.016416s

trunc_zero_neg

Passed

N/A

0.014212s

trunc_zero_pos

Passed

N/A

0.016295s

truncf_basic

Passed

N/A

0.015066s

truncf_inf_neg

Passed

N/A

0.014268s

truncf_inf_pos

Passed

N/A

0.014443s

truncf_nan

Passed

N/A

0.014242s

truncf_zero_neg

Passed

N/A

0.014422s

truncf_zero_pos

Passed

N/A

0.014204s

truncl_basic

Passed

N/A

0.014553s

truncl_inf_neg

Passed

N/A

0.014808s

truncl_inf_pos

Passed

N/A

0.014724s

truncl_nan

Passed

N/A

0.014272s

truncl_zero_neg

Passed

N/A

0.014477s

truncl_zero_pos

Passed

N/A

0.014325s

lib/libm/t_cos

0.162541s

cos_angles

Passed

N/A

0.013286s

cos_inf_neg

Passed

N/A

0.012735s

cos_inf_pos

Passed

N/A

0.012547s

cos_nan

Passed

N/A

0.013830s

cos_zero_neg

Passed

N/A

0.012594s

cos_zero_pos

Passed

N/A

0.012557s

cosf_angles

Passed

N/A

0.013782s

cosf_inf_neg

Passed

N/A

0.012616s

cosf_inf_pos

Passed

N/A

0.012990s

cosf_nan

Passed

N/A

0.012687s

cosf_zero_neg

Passed

N/A

0.012569s

cosf_zero_pos

Passed

N/A

0.012626s

lib/libm/t_cosh

0.161191s

cosh_inf_neg

Passed

N/A

0.013101s

cosh_inf_pos

Passed

N/A

0.012848s

cosh_inrange

Passed

N/A

0.012927s

cosh_nan

Passed

N/A

0.012609s

cosh_zero_neg

Passed

N/A

0.012993s

cosh_zero_pos

Passed

N/A

0.012583s

coshf_inf_neg

Passed

N/A

0.012670s

coshf_inf_pos

Passed

N/A

0.013092s

coshf_inrange

Passed

N/A

0.012705s

coshf_nan

Passed

N/A

0.012509s

coshf_zero_neg

Passed

N/A

0.012967s

coshf_zero_pos

Passed

N/A

0.012548s

lib/libm/t_erf

0.241179s

erf_inf_neg

Passed

N/A

0.014473s

erf_inf_pos

Passed

N/A

0.015052s

erf_nan

Passed

N/A

0.015286s

erf_zero_neg

Passed

N/A

0.014708s

erf_zero_pos

Passed

N/A

0.014493s

erfc_inf_neg

Passed

N/A

0.014527s

erfc_inf_pos

Passed

N/A

0.014289s

erfc_nan

Passed

N/A

0.014466s

erfcf_inf_neg

Passed

N/A

0.014132s

erfcf_inf_pos

Passed

N/A

0.014445s

erfcf_nan

Passed

N/A

0.014235s

erff_inf_neg

Passed

N/A

0.014578s

erff_inf_pos

Passed

N/A

0.014171s

erff_nan

Passed

N/A

0.014349s

erff_zero_neg

Passed

N/A

0.013342s

erff_zero_pos

Passed

N/A

0.013048s

lib/libm/t_exp

0.382804s

exp2_is_nan

Passed

N/A

0.013844s

exp2_is_plus_zero

Passed

N/A

0.013898s

exp2_powers

Passed

N/A

0.013517s

exp2_values

Passed

N/A

0.013469s

exp_inf_neg

Passed

N/A

0.013592s

exp_inf_pos

Passed

N/A

0.013340s

exp_nan

Passed

N/A

0.014583s

exp_product

Passed

N/A

0.013262s

exp_zero_neg

Passed

N/A

0.014165s

exp_zero_pos

Passed

N/A

0.013438s

expf_inf_neg

Passed

N/A

0.015452s

expf_inf_pos

Passed

N/A

0.013446s

expf_nan

Passed

N/A

0.016154s

expf_product

Passed

N/A

0.015749s

expf_zero_neg

Passed

N/A

0.015080s

expf_zero_pos

Passed

N/A

0.014312s

expm1_inf_neg

Passed

N/A

0.013359s

expm1_inf_pos

Passed

N/A

0.013410s

expm1_nan

Passed

N/A

0.013420s

expm1_zero_neg

Passed

N/A

0.013245s

expm1_zero_pos

Passed

N/A

0.014414s

expm1f_inf_neg

Passed

N/A

0.013167s

expm1f_inf_pos

Passed

N/A

0.013512s

expm1f_nan

Passed

N/A

0.013086s

expm1f_zero_neg

Passed

N/A

0.013375s

expm1f_zero_pos

Passed

N/A

0.014585s

lib/libm/t_fenv

0.053786s

feenableexcept

Passed

N/A

0.012664s

fegetexcept

Passed

N/A

0.012356s

fegetround

Passed

N/A

0.012412s

fesetround

Passed

N/A

0.013574s

lib/libm/t_fmod

0.013680s

fmod

Passed

N/A

0.012813s

lib/libm/t_hypot

0.040821s

hypot_integer

Passed

N/A

0.012695s

hypotf_integer

Passed

N/A

0.012585s

pr50698

Passed

N/A

0.013601s

lib/libm/t_ilogb

0.013539s

ilogb

Passed

N/A

0.012767s

lib/libm/t_infinity

0.040140s

infinity_double

Passed

N/A

0.012672s

infinity_float

Passed

N/A

0.012990s

infinity_long_double

Passed

N/A

0.012424s

lib/libm/t_ldexp

0.262861s

ldexp_basic

Passed

N/A

0.013573s

ldexp_denormal

Passed

N/A

0.013382s

ldexp_denormal_large

Passed

N/A

0.013703s

ldexp_exp2

Passed

N/A

0.013424s

ldexp_inf_neg

Passed

N/A

0.012858s

ldexp_inf_pos

Passed

N/A

0.012918s

ldexp_infinity

Passed

N/A

0.013224s

ldexp_nan

Passed

N/A

0.012823s

ldexp_overflow

Passed

N/A

0.013289s

ldexp_underflow

Passed

N/A

0.013076s

ldexp_zero

Passed

N/A

0.012949s

ldexp_zero_neg

Passed

N/A

0.013553s

ldexp_zero_pos

Passed

N/A

0.012825s

ldexpf_exp2f

Passed

N/A

0.013010s

ldexpf_inf_neg

Passed

N/A

0.013788s

ldexpf_inf_pos

Passed

N/A

0.013106s

ldexpf_nan

Passed

N/A

0.013283s

ldexpf_zero_neg

Passed

N/A

0.012985s

ldexpf_zero_pos

Passed

N/A

0.012802s

lib/libm/t_log

0.854884s

log10_base

Passed

N/A

0.017481s

log10_inf_neg

Passed

N/A

0.016779s

log10_inf_pos

Passed

N/A

0.016556s

log10_nan

Passed

N/A

0.016417s

log10_one_pos

Passed

N/A

0.016621s

log10_zero_neg

Passed

N/A

0.014471s

log10_zero_pos

Passed

N/A

0.016034s

log10f_base

Passed

N/A

0.014222s

log10f_inf_neg

Passed

N/A

0.015796s

log10f_inf_pos

Passed

N/A

0.015277s

log10f_nan

Passed

N/A

0.014460s

log10f_one_pos

Passed

N/A

0.014607s

log10f_zero_neg

Passed

N/A

0.014419s

log10f_zero_pos

Passed

N/A

0.014840s

log1p_inf_neg

Passed

N/A

0.014277s

log1p_inf_pos

Passed

N/A

0.014944s

log1p_nan

Passed

N/A

0.014337s

log1p_one_neg

Passed

N/A

0.015424s

log1p_zero_neg

Passed

N/A

0.016108s

log1p_zero_pos

Passed

N/A

0.014261s

log1pf_inf_neg

Passed

N/A

0.014596s

log1pf_inf_pos

Passed

N/A

0.014545s

log1pf_nan

Passed

N/A

0.015206s

log1pf_one_neg

Passed

N/A

0.014362s

log1pf_zero_neg

Passed

N/A

0.014959s

log1pf_zero_pos

Passed

N/A

0.014290s

log2_base

Passed

N/A

0.014841s

log2_inf_neg

Passed

N/A

0.014507s

log2_inf_pos

Passed

N/A

0.016350s

log2_nan

Passed

N/A

0.014429s

log2_one_pos

Passed

N/A

0.016258s

log2_zero_neg

Passed

N/A

0.015379s

log2_zero_pos

Passed

N/A

0.014446s

log2f_base

Passed

N/A

0.016275s

log2f_inf_neg

Passed

N/A

0.014433s

log2f_inf_pos

Passed

N/A

0.016481s

log2f_nan

Passed

N/A

0.015208s

log2f_one_pos

Passed

N/A

0.014276s

log2f_zero_neg

Passed

N/A

0.015101s

log2f_zero_pos

Passed

N/A

0.014344s

log_base

Passed

N/A

0.015448s

log_inf_neg

Passed

N/A

0.016341s

log_inf_pos

Passed

N/A

0.014428s

log_nan

Passed

N/A

0.014490s

log_one_pos

Passed

N/A

0.015844s

log_zero_neg

Passed

N/A

0.014412s

log_zero_pos

Passed

N/A

0.014519s

logf_base

Passed

N/A

0.015506s

logf_inf_neg

Passed

N/A

0.014481s

logf_inf_pos

Passed

N/A

0.016077s

logf_nan

Passed

N/A

0.015085s

logf_one_pos

Passed

N/A

0.014345s

logf_zero_neg

Passed

N/A

0.014944s

logf_zero_pos

Passed

N/A

0.016587s

lib/libm/t_modf

0.013387s

modf

Passed

N/A

0.012615s

lib/libm/t_pow

0.294852s

pow_inf_neg_x

Passed

N/A

0.013913s

pow_inf_neg_y

Passed

N/A

0.013236s

pow_inf_pos_x

Passed

N/A

0.014306s

pow_inf_pos_y

Passed

N/A

0.013006s

pow_nan_x

Passed

N/A

0.013405s

pow_nan_y

Passed

N/A

0.013073s

pow_one_neg_x

Passed

N/A

0.012953s

pow_one_pos_x

Passed

N/A

0.013587s

pow_zero_x

Passed

N/A

0.014596s

pow_zero_y

Passed

N/A

0.015377s

powf_inf_neg_x

Passed

N/A

0.015089s

powf_inf_neg_y

Passed

N/A

0.015529s

powf_inf_pos_x

Passed

N/A

0.015118s

powf_inf_pos_y

Passed

N/A

0.015063s

powf_nan_x

Passed

N/A

0.014995s

powf_nan_y

Passed

N/A

0.013094s

powf_one_neg_x

Passed

N/A

0.014122s

powf_one_pos_x

Passed

N/A

0.012986s

powf_zero_x

Passed

N/A

0.013489s

powf_zero_y

Passed

N/A

0.012918s

lib/libm/t_precision

0.013053s

t_precision

Passed

N/A

0.012300s

lib/libm/t_round

0.013171s

round_dir

Passed

N/A

0.012416s

lib/libm/t_scalbn

0.276850s

scalbn_inf_neg

Passed

N/A

0.013607s

scalbn_inf_pos

Passed

N/A

0.012925s

scalbn_ldexp

Passed

N/A

0.013522s

scalbn_nan

Passed

N/A

0.013018s

scalbn_val

Passed

N/A

0.012761s

scalbn_zero_neg

Passed

N/A

0.013721s

scalbn_zero_pos

Passed

N/A

0.013937s

scalbnf_inf_neg

Passed

N/A

0.014266s

scalbnf_inf_pos

Passed

N/A

0.012851s

scalbnf_ldexpf

Passed

N/A

0.012874s

scalbnf_nan

Passed

N/A

0.013149s

scalbnf_val

Passed

N/A

0.012843s

scalbnf_zero_neg

Passed

N/A

0.012912s

scalbnf_zero_pos

Passed

N/A

0.012752s

scalbnl_inf_neg

Passed

N/A

0.012827s

scalbnl_inf_pos

Passed

N/A

0.013170s

scalbnl_nan

Passed

N/A

0.012905s

scalbnl_val

Passed

N/A

0.012877s

scalbnl_zero_neg

Passed

N/A

0.014338s

scalbnl_zero_pos

Passed

N/A

0.012901s

lib/libm/t_sin

0.162513s

sin_angles

Passed

N/A

0.013095s

sin_inf_neg

Passed

N/A

0.012994s

sin_inf_pos

Passed

N/A

0.012662s

sin_nan

Passed

N/A

0.012834s

sin_zero_neg

Passed

N/A

0.012844s

sin_zero_pos

Passed

N/A

0.012661s

sinf_angles

Passed

N/A

0.012795s

sinf_inf_neg

Passed

N/A

0.012958s

sinf_inf_pos

Passed

N/A

0.012941s

sinf_nan

Passed

N/A

0.012672s

sinf_zero_neg

Passed

N/A

0.013994s

sinf_zero_pos

Passed

N/A

0.012599s

lib/libm/t_sinh

0.161552s

sinh_inf_neg

Passed

N/A

0.013973s

sinh_inf_pos

Passed

N/A

0.012768s

sinh_inrange

Passed

N/A

0.013205s

sinh_nan

Passed

N/A

0.012699s

sinh_zero_neg

Passed

N/A

0.012580s

sinh_zero_pos

Passed

N/A

0.012658s

sinhf_inf_neg

Passed

N/A

0.012643s

sinhf_inf_pos

Passed

N/A

0.012753s

sinhf_inrange

Passed

N/A

0.012993s

sinhf_nan

Passed

N/A

0.012742s

sinhf_zero_neg

Passed

N/A

0.012628s

sinhf_zero_pos

Passed

N/A

0.012656s

lib/libm/t_sqrt

0.255598s

sqrt_inf_neg

Passed

N/A

0.015171s

sqrt_inf_pos

Passed

N/A

0.013006s

sqrt_nan

Passed

N/A

0.013110s

sqrt_pow

Passed

N/A

0.014447s

sqrt_zero_neg

Passed

N/A

0.012955s

sqrt_zero_pos

Passed

N/A

0.013600s

sqrtf_inf_neg

Passed

N/A

0.013063s

sqrtf_inf_pos

Passed

N/A

0.012862s

sqrtf_nan

Passed

N/A

0.014573s

sqrtf_powf

Passed

N/A

0.012932s

sqrtf_zero_neg

Passed

N/A

0.013289s

sqrtf_zero_pos

Passed

N/A

0.013593s

sqrtl_inf_neg

Passed

N/A

0.013142s

sqrtl_inf_pos

Passed

N/A

0.014371s

sqrtl_nan

Passed

N/A

0.012966s

sqrtl_powl

Passed

N/A

0.015160s

sqrtl_zero_neg

Passed

N/A

0.012922s

sqrtl_zero_pos

Passed

N/A

0.013081s

lib/libm/t_tan

0.162358s

tan_angles

Passed

N/A

0.012891s

tan_inf_neg

Passed

N/A

0.013262s

tan_inf_pos

Passed

N/A

0.012645s

tan_nan

Passed

N/A

0.012615s

tan_zero_neg

Passed

N/A

0.013667s

tan_zero_pos

Passed

N/A

0.012591s

tanf_angles

Passed

N/A

0.012784s

tanf_inf_neg

Passed

N/A

0.013729s

tanf_inf_pos

Passed

N/A

0.012667s

tanf_nan

Passed

N/A

0.012633s

tanf_zero_neg

Passed

N/A

0.012864s

tanf_zero_pos

Passed

N/A

0.012506s

lib/libm/t_tanh

0.149322s

tanh_inf_neg

Passed

N/A

0.012505s

tanh_inf_pos

Passed

N/A

0.015464s

tanh_nan

Passed

N/A

0.013175s

tanh_zero_neg

Passed

N/A

0.014958s

tanh_zero_pos

Passed

N/A

0.014538s

tanhf_inf_neg

Passed

N/A

0.015044s

tanhf_inf_pos

Passed

N/A

0.013967s

tanhf_nan

Passed

N/A

0.014648s

tanhf_zero_neg

Passed

N/A

0.014000s

tanhf_zero_pos

Passed

N/A

0.014669s

lib/libobjc/t_threads

0.017403s

thread_callback

Passed

N/A

0.016625s

lib/libposix/bsd/t_rename

0.013754s

rename

Passed

N/A

0.012966s

lib/libposix/posix1/t_rename

0.014019s

rename

Passed

N/A

0.013039s

lib/libposix/posix2/t_rename

0.013920s

rename

Passed

N/A

0.013012s

lib/libppath/t_ppath

0.410485s

component_at

Passed

N/A

0.016393s

copydel_bool_success

Passed

N/A

0.016722s

copydel_object_twice_success

Passed

N/A

0.016413s

copyset_bool_success

Passed

N/A

0.016419s

copyset_object_twice_success

Passed

N/A

0.016349s

create_bool_eexist

Passed

N/A

0.016001s

create_bool_success

Passed

N/A

0.015796s

delete_bool_eftype

Passed

N/A

0.015816s

delete_bool_enoent

Passed

N/A

0.015894s

delete_bool_success

Passed

N/A

0.015785s

get_bool_eftype

Passed

N/A

0.015794s

get_bool_enoent

Passed

N/A

0.015702s

get_bool_success

Passed

N/A

0.015932s

get_idx_key

Passed

N/A

0.015366s

get_string_eftype

Passed

N/A

0.016038s

get_string_enoent

Passed

N/A

0.015327s

get_string_success

Passed

N/A

0.015720s

length

Passed

N/A

0.015842s

pop_until_empty

Passed

N/A

0.015436s

ppath_copy

Passed

N/A

0.015359s

push_until_full

Passed

N/A

0.015446s

replace

Passed

N/A

0.015393s

set_bool_eftype

Passed

N/A

0.016110s

set_bool_enoent

Passed

N/A

0.015872s

set_bool_success

Passed

N/A

0.015539s

lib/libprop/t_basic

0.030183s

prop_basic

Passed

N/A

0.014557s

prop_dictionary_equals

Passed

N/A

0.014353s

lib/libpthread/t_barrier

10.065128s

barrier

Passed

N/A

10.064522s

lib/libpthread/t_cond

9.018224s

bogus_timedwaits

Passed

N/A

0.016098s

broadcast

Passed

N/A

0.356202s

cond_timedwait_race

Passed

N/A

2.193022s

condattr

Passed

N/A

0.015245s

destroy_after_cancel

Passed

N/A

0.014984s

signal_before_unlock

Passed

N/A

2.025088s

signal_before_unlock_static_init

Passed

N/A

2.019555s

signal_delay_wait

Passed

N/A

2.019461s

signal_wait_race

Passed

N/A

0.353532s

lib/libpthread/t_condwait

4.040221s

cond_wait_mono

Passed

N/A

2.019659s

cond_wait_real

Passed

N/A

2.019515s

lib/libpthread/t_detach

0.013602s

pthread_detach

Passed

N/A

0.013061s

lib/libpthread/t_equal

0.013986s

pthread_equal

Passed

N/A

0.013443s

lib/libpthread/t_fork

5.019405s

fork

Passed

N/A

5.018800s

lib/libpthread/t_fpu

0.018930s

fpu

Passed

N/A

0.018033s

lib/libpthread/t_join

0.020022s

pthread_join

Passed

N/A

0.019137s

lib/libpthread/t_kill

0.199365s

simple

Passed

N/A

0.198542s

lib/libpthread/t_mutex

53.215418s

mutex1

Passed

N/A

4.033121s

mutex2

Passed

N/A

6.894215s

mutex3

Passed

N/A

6.985769s

mutex4

Passed

N/A

4.028445s

mutex5

Passed

N/A

10.019720s

mutex6

Passed

N/A

21.219626s

mutexattr1

Passed

N/A

0.014841s

mutexattr2

Passed

N/A

0.015017s

lib/libpthread/t_name

0.016022s

name

Passed

N/A

0.015326s

lib/libpthread/t_once

0.051206s

once1

Passed

N/A

0.014200s

once2

Passed

N/A

0.019873s

once3

Passed

N/A

0.015158s

lib/libpthread/t_preempt

1.018470s

preempt1

Passed

N/A

1.017828s

lib/libpthread/t_rwlock

1.034297s

rwlock1

Passed

N/A

1.019191s

rwlock_static

Passed

N/A

0.013946s

lib/libpthread/t_sem

20.449525s

before_start_no_threads

Passed

N/A

10.010549s

before_start_one_thread

Passed

N/A

10.009573s

named

Passed

N/A

0.015031s

unnamed

Passed

N/A

0.412069s

lib/libpthread/t_sigmask

4.088024s

before_threads

Passed

N/A

0.013810s

incorrect_mask_bug

Passed

N/A

3.037637s

respected_while_running

Passed

N/A

1.019761s

upcalls_not_started

Passed

N/A

0.014470s

lib/libpthread/t_sigsuspend

1.014680s

sigsuspend

Passed

N/A

1.013893s

lib/libpthread/t_siglongjmp

0.014051s

siglongjmp1

Passed

N/A

0.013297s

lib/libpthread/t_sleep

1.022723s

sleep1

Passed

N/A

1.022082s

lib/libpthread/t_swapcontext

0.014047s

swapcontext1

Passed

N/A

0.013512s

lib/libpthread/t_timedmutex

84.676080s

mutex1

Passed

N/A

4.028986s

mutex2

Passed

N/A

22.667456s

mutex3

Passed

N/A

22.623912s

mutex4

Passed

N/A

4.027119s

mutex5

Passed

N/A

10.019839s

mutex6

Failed

/usr/src/tests/lib/libpthread/t_mutex.c:524: start != 1

21.219799s

mutexattr1

Passed

N/A

0.013549s

mutexattr2

Passed

N/A

0.013460s

timedmutex1

Passed

N/A

0.014112s

timedmutex2

Passed

N/A

0.013359s

timedmutex3

Passed

N/A

0.014353s

timedmutex4

Passed

N/A

0.013660s

lib/libpthread/t_atexit

0.141258s

atexit

Passed

N/A

0.140505s

lib/libpthread/t_cancel

0.126226s

register_while_disabled

Passed

N/A

0.125422s

lib/libpthread/t_exit

0.129030s

main_thread

Passed

N/A

0.128239s

lib/libpthread/t_resolv

4.143262s

resolv

Passed

N/A

4.142628s

lib/libpthread_dbg/t_dummy

0.044503s

dummy1

Passed

N/A

0.013422s

dummy2

Passed

N/A

0.013312s

dummy3

Passed

N/A

0.015632s

lib/libpthread_dbg/t_threads

0.168278s

threads1

Passed

N/A

0.019033s

threads2

Passed

N/A

0.017806s

threads3

Passed

N/A

0.017951s

threads4

Passed

N/A

0.017794s

threads5

Passed

N/A

0.017806s

threads6

Passed

N/A

0.018367s

threads7

Passed

N/A

0.017024s

threads8

Passed

N/A

0.019275s

threads9

Passed

N/A

0.016686s

lib/librefuse/t_refuse_opt

0.149556s

t_fuse_opt_add_arg

Passed

N/A

0.015488s

t_fuse_opt_add_opt

Passed

N/A

0.016085s

t_fuse_opt_add_opt_escaped

Passed

N/A

0.016446s

t_fuse_opt_insert_arg

Passed

N/A

0.014862s

t_fuse_opt_match

Passed

N/A

0.014736s

t_fuse_opt_parse

Passed

N/A

0.017114s

t_fuse_opt_parse_null_args

Passed

N/A

0.014985s

t_fuse_opt_parse_null_opts

Passed

N/A

0.014771s

t_fuse_opt_parse_null_proc

Passed

N/A

0.017067s

lib/librt/t_sched

0.118384s

sched_getparam

Passed

N/A

0.014133s

sched_priority

Passed

N/A

0.014151s

sched_rr_get_interval_1

Passed

N/A

0.013907s

sched_rr_get_interval_2

Passed

N/A

0.014089s

sched_setscheduler_1

Passed

N/A

0.013304s

sched_setscheduler_2

Passed

N/A

0.014268s

sched_setscheduler_3

Passed

N/A

0.013690s

sched_setscheduler_4

Passed

N/A

0.014918s

lib/librt/t_sem

20.222527s

basic

Passed

N/A

0.012534s

child

Passed

N/A

20.208427s

lib/libtre/t_regex_att

0.219980s

basic

Passed

N/A

0.075073s

categorization

Passed

N/A

0.022690s

forcedassoc

Passed

N/A

0.022489s

leftassoc

Passed

N/A

0.017135s

nullsubexpr

Passed

N/A

0.018264s

repetition

Passed

N/A

0.040118s

rightassoc

Expected failure

Reason for breakage unknown: /usr/src/tests/lib/libtre/../libc/regex/t_regex_att.c:377: res != matches ((0,4)(0,1)(1,4)(4,4) != (0,4)(0,2)(2,3)(3,4)): at line 3

0.019863s

lib/libtre/t_exhaust

3.972544s

regcomp_too_big

Passed

N/A

3.971551s

lib/libusbhid/t_usbhid

0.097706s

check_hid_get_data

Expected failure

only the 32-bit opcode works, 8 and 16-bit is broken: 4 checks failed as expected; see output for more details

0.014398s

check_hid_logical_range

Expected failure

only the 32-bit opcode works, 8 and 16-bit is broken: 4 checks failed as expected; see output for more details

0.014429s

check_hid_physical_range

Expected failure

only the 32-bit opcode works, 8 and 16-bit is broken: 4 checks failed as expected; see output for more details

0.014526s

check_hid_set_data

Passed

N/A

0.012796s

check_hid_usage

Passed

N/A

0.022296s

check_parse_just_pop

Passed

N/A

0.014613s

lib/libutil/t_efun

0.057219s

ecalloc

Passed

N/A

0.012994s

efopen

Passed

N/A

0.013918s

emalloc

Passed

N/A

0.014239s

erealloc

Passed

N/A

0.013463s

lib/libutil/t_parsedate

2.673508s

atsecs

Passed

N/A

0.017584s

dates

Passed

N/A

0.014771s

dsttimes

Passed

N/A

0.047069s

gibberish

Passed

N/A

0.013630s

relative

Passed

N/A

2.541770s

times

Passed

N/A

0.016340s

zones

Passed

N/A

0.017287s

lib/libutil/t_pidfile

0.114960s

change_basenames

Passed

N/A

0.019487s

change_mix

Passed

N/A

0.019086s

change_paths

Passed

N/A

0.018070s

custom_basename

Passed

N/A

0.017762s

custom_path

Passed

N/A

0.017471s

default_path

Passed

N/A

0.017580s

lib/libutil/t_snprintb

0.026183s

snprintb

Passed

N/A

0.012801s

snprintb_m

Passed

N/A

0.012226s

lib/libutil/t_sockaddr_snprintf

0.064390s

sockaddr_snprintf_at

Passed

N/A

0.012340s

sockaddr_snprintf_dl

Passed

N/A

0.012247s

sockaddr_snprintf_in

Passed

N/A

0.012070s

sockaddr_snprintf_in6

Passed

N/A

0.012215s

sockaddr_snprintf_un

Passed

N/A

0.012617s

lib/semaphore/pthread/t_sem_pth

0.645259s

blocktimedwait

Passed

N/A

0.119401s

blockwait

Passed

N/A

0.239740s

busydestroy

Passed

N/A

0.059093s

destroy

Passed

N/A

0.043519s

initvalue

Passed

N/A

0.044361s

named

Passed

N/A

0.044170s

postwait

Passed

N/A

0.045473s

unlink

Passed

N/A

0.044962s

lib/librumpclient/t_fd

0.372664s

bigenough

Passed

N/A

0.114997s

sigio

Passed

N/A

0.256123s

lib/librumpclient/t_exec

4.229968s

cloexec

Passed

N/A

0.616089s

exec

Passed

N/A

0.595895s

noexec

Passed

N/A

0.577904s

threxec

Passed

N/A

1.733287s

vfork

Passed

N/A

0.684596s

lib/librumphijack/t_asyncio

1.095715s

invafd

Passed

N/A

0.381423s

select_allunset

Passed

N/A

0.376620s

select_timeout

Passed

N/A

0.334348s

lib/librumphijack/t_config

0.347918s

fdoff

Passed

N/A

0.347149s

lib/librumphijack/t_cwd

2.635450s

basic_chdir

Passed

N/A

0.330970s

basic_fchdir

Passed

N/A

0.335989s

slash_chdir

Passed

N/A

0.323324s

slash_fchdir

Passed

N/A

0.324642s

symlink_chdir

Passed

N/A

0.329799s

symlink_fchdir

Passed

N/A

0.328391s

symlink_slash_chdir

Passed

N/A

0.328039s

symlink_slash_fchdir

Passed

N/A

0.324544s

lib/librumphijack/t_sh

0.928458s

redirect

Passed

N/A

0.498957s

runscript

Passed

N/A

0.427436s

lib/librumphijack/t_tcpip

4.831439s

http

Passed

N/A

0.869124s

nfs

Passed

N/A

1.998174s

nfs_autoload

Skipped

test currently valid only on i386

0.239962s

ssh

Expected failure

PR lib/50174: atf-check failed; see the output of the test for details

1.711987s

lib/librumphijack/t_vfs

5.330750s

blanket

Passed

N/A

0.371353s

cpcopy

Passed

N/A

0.820826s

doubleblanket

Passed

N/A

0.515128s

ln_nox

Passed

N/A

0.726241s

ln_x

Passed

N/A

0.379871s

mv_nox

Passed

N/A

0.709710s

mv_x

Passed

N/A

0.599431s

paxcopy

Passed

N/A

0.803040s

runonprefix

Passed

N/A

0.375548s

lib/libdes/t_des

0.198011s

align

Passed

N/A

0.019192s

cbc

Passed

N/A

0.012374s

cbc_cksum

Passed

N/A

0.013137s

cbcm

Passed

N/A

0.011864s

cfb

Passed

N/A

0.013285s

desx_cbc

Passed

N/A

0.012681s

ecb

Passed

N/A

0.011967s

ede_cbc

Passed

N/A

0.011851s

ede_ecb

Passed

N/A

0.012180s

ede_ofb64

Passed

N/A

0.011948s

fast_crypt

Passed

N/A

0.011933s

ofb

Passed

N/A

0.011874s

ofb64

Passed

N/A

0.011887s

pcbc

Passed

N/A

0.011760s

quad_cksum

Passed

N/A

0.011832s

lib/libskey/t_algorithms

0.093512s

md4

Passed

N/A

0.012462s

md5

Passed

N/A

0.012212s

sha1

Passed

N/A

0.067156s

libexec/ld.elf_so/t_dlerror-cleared

0.013651s

rtld_dlerror_cleared

Passed

N/A

0.013116s

libexec/ld.elf_so/t_dlerror-false

0.013199s

rtld_dlerror_false

Passed

N/A

0.012656s

libexec/ld.elf_so/t_dlinfo

0.048170s

rtld_dlinfo_linkmap_dlopen

Passed

N/A

0.011937s

rtld_dlinfo_linkmap_dlopen_iter

Passed

N/A

0.011943s

rtld_dlinfo_linkmap_inval

Passed

N/A

0.011194s

rtld_dlinfo_linkmap_self

Passed

N/A

0.011038s

libexec/ld.elf_so/t_dlvsym

0.068423s

rtld_dlvsym_symbol_nonexistent

Passed

N/A

0.017806s

rtld_dlvsym_v1

Passed

N/A

0.012057s

rtld_dlvsym_v3

Passed

N/A

0.011948s

rtld_dlvsym_version_nonexistent

Passed

N/A

0.012009s

rtld_dlvsym_version_null

Passed

N/A

0.011842s

libexec/ld.elf_so/t_ifunc

0.048606s

rtld_ifunc

Passed

N/A

0.048015s

libexec/ld.elf_so/t_df_1_noopen

0.263380s

df_1_noopen1

Passed

N/A

0.130641s

df_1_noopen2

Passed

N/A

0.130913s

libexec/ld.elf_so/t_dl_symver

0.620938s

dl_symver

Passed

N/A

0.620165s

net/fdpass/t_fdpass

0.797750s

fdpass_compat

Passed

N/A

0.339857s

fdpass_compat_normal

Passed

N/A

0.166428s

fdpass_normal

Passed

N/A

0.134511s

fdpass_normal_compat

Passed

N/A

0.153404s

net/in_cksum/t_in_cksum

22.366065s

mbufs_aligned

Passed

N/A

7.047781s

mbufs_unaligned

Passed

N/A

7.100623s

sizes_aligned

Passed

N/A

4.321827s

sizes_unaligned

Passed

N/A

3.892833s

net/net/t_unix

0.039675s

sockaddr_un_closed

Passed

N/A

0.012731s

sockaddr_un_len_exceed

Passed

N/A

0.011457s

sockaddr_un_len_max

Passed

N/A

0.013237s

net/net/t_tcp

0.035960s

fcntl_reset_nonblock

Passed

N/A

0.011735s

paccept_nonblock

Passed

N/A

0.011395s

paccept_reset_nonblock

Passed

N/A

0.011255s

net/net/t_udp

0.027420s

udp4_send

Passed

N/A

0.013147s

udp6_send

Passed

N/A

0.013000s

net/net/t_pktinfo

0.012418s

pktinfo

Passed

N/A

0.011845s

net/net/t_raw

0.172513s

PRU_SENSE

Passed

N/A

0.171891s

net/net/t_forwarding

67.500560s

ipforwarding_fastforward_v4

Passed

N/A

7.120558s

ipforwarding_fastforward_v6

Passed

N/A

7.020847s

ipforwarding_misc

Passed

N/A

22.532174s

ipforwarding_v4

Passed

N/A

12.776529s

ipforwarding_v6

Passed

N/A

18.032593s

net/net/t_ipaddress

11.642667s

ipaddr_auto_linklocal

Passed

N/A

1.169641s

ipaddr_same_address

Passed

N/A

6.269960s

ipaddr_same_address6

Passed

N/A

4.195462s

net/net/t_ipv6address

40.176280s

linklocal

Passed

N/A

38.115391s

linklocal_ops

Passed

N/A

2.046701s

net/net/t_ipv6_lifetime

29.699489s

basic

Passed

N/A

29.697057s

net/net/t_mtudisc

12.288739s

mtudisc_basic

Passed

N/A

12.284675s

net/net/t_mtudisc6

13.207160s

mtudisc6_basic

Passed

N/A

13.203173s

net/net/t_ping6_opts

41.967491s

ping6_opts_gateway

Passed

N/A

10.310186s

ping6_opts_hops

Passed

N/A

14.796670s

ping6_opts_interface

Passed

N/A

7.887888s

ping6_opts_sourceaddr

Passed

N/A

8.955483s

net/sys/t_rfc6056

0.049474s

inet4

Passed

N/A

0.024141s

inet6

Passed

N/A

0.023908s

net/arp/t_arp

75.797893s

arp_cache_expiration_10s

Passed

N/A

13.590975s

arp_cache_expiration_5s

Passed

N/A

8.620905s

arp_cache_overwriting

Passed

N/A

1.759466s

arp_command

Passed

N/A

9.445708s

arp_garp

Passed

N/A

6.836513s

arp_link_activation

Passed

N/A

3.831752s

arp_proxy_arp_pub

Passed

N/A

15.246398s

arp_proxy_arp_pubproxy

Passed

N/A

14.905081s

arp_static

Passed

N/A

1.529577s

net/arp/t_dad

17.810859s

dad_basic

Passed

N/A

14.144315s

dad_duplicated

Passed

N/A

3.660886s

net/bpf/t_bpf

0.374888s

bpfwriteleak

Passed

N/A

0.185708s

bpfwritetrunc

Passed

N/A

0.186432s

net/bpf/t_div-by-zero

0.176460s

div_by_zero

Passed

N/A

0.175565s

net/bpf/t_mbuf

3.634264s

bpf_mbuf_ldb_abs

Passed

N/A

0.176076s

bpf_mbuf_ldb_abs_overflow

Passed

N/A

0.174846s

bpf_mbuf_ldb_ind

Passed

N/A

0.177105s

bpf_mbuf_ldb_ind_overflow1

Passed

N/A

0.175647s

bpf_mbuf_ldb_ind_overflow2

Passed

N/A

0.173933s

bpf_mbuf_ldb_ind_overflow3

Passed

N/A

0.178665s

bpf_mbuf_ldh_abs

Passed

N/A

0.178404s

bpf_mbuf_ldh_abs_overflow

Passed

N/A

0.185827s

bpf_mbuf_ldh_ind

Passed

N/A

0.185193s

bpf_mbuf_ldh_ind_overflow1

Passed

N/A

0.186874s

bpf_mbuf_ldh_ind_overflow2

Passed

N/A

0.180222s

bpf_mbuf_ldh_ind_overflow3

Passed

N/A

0.180455s

bpf_mbuf_ldw_abs

Passed

N/A

0.192506s

bpf_mbuf_ldw_abs_overflow

Passed

N/A

0.186795s

bpf_mbuf_ldw_ind

Passed

N/A

0.181432s

bpf_mbuf_ldw_ind_overflow1

Passed

N/A

0.185296s

bpf_mbuf_ldw_ind_overflow2

Passed

N/A

0.184795s

bpf_mbuf_ldw_ind_overflow3

Passed

N/A

0.178946s

bpf_mbuf_msh

Passed

N/A

0.177340s

bpf_mbuf_msh_overflow

Passed

N/A

0.177705s

net/bpfilter/t_bpfilter

1.602040s

bpfilterbadjmp

Passed

N/A

0.190567s

bpfilterbadmem

Passed

N/A

0.190699s

bpfilterbadret

Passed

N/A

0.189492s

bpfiltercontig

Passed

N/A

0.226201s

bpfiltermchain

Passed

N/A

0.227764s

bpfilternegjmp

Passed

N/A

0.190140s

bpfilternoinitA

Passed

N/A

0.183199s

bpfilternoinitX

Passed

N/A

0.187521s

net/carp/t_basic

8.374106s

handover

Passed

N/A

8.371836s

net/icmp/t_forward

1.205831s

returndatabytes

Passed

N/A

1.203953s

net/icmp/t_ping

9.274562s

floodping

Passed

N/A

1.949090s

floodping2

Passed

N/A

3.298712s

ping_of_death

Passed

N/A

0.272250s

pingsize

Passed

N/A

3.026894s

simpleping

Passed

N/A

0.718577s

net/icmp/t_ping2

0.945272s

basic

Passed

N/A

0.940025s

net/icmp/t_icmp_redirect

24.581767s

icmp_redirect

Passed

N/A

9.138286s

icmp_redirect_timeout

Passed

N/A

15.435870s

net/icmp/t_icmp6_redirect

15.563568s

icmp6_redirect_basic

Passed

N/A

15.556836s

net/if/t_compat

0.190163s

OOSIOCGIFBRDADDR

Expected failure

PR kern/51610: rump does not include COMPAT_43: /usr/src/tests/net/if/t_compat.c:72: rump_sys_ioctl(fd, ((((unsigned long)0x80000000|(unsigned long)0x40000000)) | (((sizeof(struct oifreq)) & 0x1fff) << 16) | ((('i')) << 8) | ((18))), &ifreq): Inappropriate ioctl for device

0.188408s

net/if/t_ifconf

1.838440s

basic

Passed

N/A

1.836434s

net/if/t_ifconfig

28.737633s

ifconfig_create_destroy

Passed

N/A

0.976019s

ifconfig_options

Passed

N/A

5.879299s

ifconfig_parameters

Passed

N/A

21.875230s

net/if_bridge/t_bridge

88.846167s

bridge_ipv4

Passed

N/A

14.228425s

bridge_ipv6

Passed

N/A

24.354232s

bridge_member_ipv4

Passed

N/A

20.397761s

bridge_member_ipv6

Passed

N/A

25.817740s

bridge_rtable

Passed

N/A

4.030544s

net/if_gif/t_gif

141.871662s

gif_basic_ipv4overipv4

Passed

N/A

9.605347s

gif_basic_ipv4overipv6

Passed

N/A

9.545641s

gif_basic_ipv6overipv4

Passed

N/A

14.585692s

gif_basic_ipv6overipv6

Passed

N/A

14.587217s

gif_ioctl_ipv4overipv4

Passed

N/A

10.794754s

gif_ioctl_ipv4overipv6

Passed

N/A

10.757560s

gif_ioctl_ipv6overipv4

Passed

N/A

15.796041s

gif_ioctl_ipv6overipv6

Passed

N/A

15.806484s

gif_recursive_ipv4overipv4

Passed

N/A

10.076416s

gif_recursive_ipv4overipv6

Passed

N/A

10.113946s

gif_recursive_ipv6overipv4

Passed

N/A

10.047302s

gif_recursive_ipv6overipv6

Passed

N/A

10.108445s

net/if_loop/t_pr

0.358428s

loopmtu

Passed

N/A

0.178949s

loopmtu_csum

Passed

N/A

0.177772s

net/if_pppoe/t_pppoe

84.511758s

pppoe6_chap

Passed

N/A

20.124672s

pppoe6_pap

Passed

N/A

20.194624s

pppoe_chap

Passed

N/A

22.259423s

pppoe_pap

Passed

N/A

21.922717s

net/if_tap/t_tap

13.264341s

tap_bridged

Passed

N/A

5.320597s

tap_create_destroy

Passed

N/A

0.874869s

tap_stand_alone

Passed

N/A

7.060743s

net/if_tun/t_tun

12.959113s

tun_create_destroy

Passed

N/A

0.601869s

tun_setup

Passed

N/A

12.350807s

net/mcast/t_mcast

22.410337s

mcast_conninet4

Passed

N/A

2.800919s

mcast_conninet6

Passed

N/A

3.076496s

mcast_connmappedbuginet4

Passed

N/A

2.759854s

mcast_connmappedinet4

Passed

N/A

2.918731s

mcast_unconninet4

Passed

N/A

2.345183s

mcast_unconninet6

Passed

N/A

2.751136s

mcast_unconnmappedbuginet4

Passed

N/A

2.982267s

mcast_unconnmappedinet4

Passed

N/A

2.754337s

net/mpls/t_mpls_fw

4.996479s

mplsfw4

Passed

N/A

2.520744s

mplsfw4_expl

Passed

N/A

2.465097s

net/mpls/t_mpls_fw6

5.424544s

mplsfw6

Passed

N/A

2.763206s

mplsfw6_expl

Passed

N/A

2.647701s

net/mpls/t_mpls_fw64

5.560615s

mplsfw64_expl

Passed

N/A

2.759161s

mplsfw64_impl

Passed

N/A

2.790779s

net/mpls/t_rfc4182

2.532683s

rfc4182

Passed

N/A

2.528193s

net/mpls/t_ldp_regen

21.497606s

ldp_regen

Passed

N/A

21.492044s

net/ndp/t_dad

29.226924s

dad_basic

Passed

N/A

5.558082s

dad_count

Passed

N/A

16.341270s

dad_duplicated

Passed

N/A

7.318498s

net/ndp/t_ndp

58.899308s

ndp_cache_expiration

Passed

N/A

33.269396s

ndp_cache_overwriting

Passed

N/A

5.707369s

ndp_commands

Passed

N/A

7.017723s

ndp_link_activation

Passed

N/A

7.449093s

ndp_neighborgcthresh

Passed

N/A

5.443012s

net/ndp/t_ra

24.974753s

ra_basic

Passed

N/A

24.971247s

net/npf/t_npf

2.124092s

npf_bpf

Passed

N/A

0.395940s

npf_nat

Passed

N/A

0.339336s

npf_nbuf

Passed

N/A

0.339208s

npf_rule

Passed

N/A

0.328829s

npf_state

Passed

N/A

0.334892s

npf_table

Failed

atf-check failed; see the output of the test for details

0.372291s

net/route/t_change

3.921061s

route_change_gateway

Passed

N/A

0.715708s

route_change_ifa

Passed

N/A

0.860850s

route_change_ifp

Passed

N/A

0.882968s

route_change_ifp_ifa

Passed

N/A

0.840418s

route_change_reject2blackhole

Passed

N/A

0.608987s

net/route/t_flags

22.365090s

route_flags_announce

Passed

N/A

1.332564s

route_flags_blackhole

Passed

N/A

2.505229s

route_flags_connected

Passed

N/A

1.289644s

route_flags_default_gateway

Passed

N/A

1.330236s

route_flags_icmp_redirect

Passed

N/A

8.358455s

route_flags_lo

Passed

N/A

1.262552s

route_flags_reject

Passed

N/A

4.847434s

route_flags_static

Passed

N/A

1.416941s

net/route/t_flags6

13.376961s

route_flags_announce6

Passed

N/A

1.361723s

route_flags_blackhole6

Passed

N/A

2.536400s

route_flags_connected6

Passed

N/A

1.387268s

route_flags_default_gateway6

Passed

N/A

1.353294s

route_flags_lo6

Passed

N/A

1.380489s

route_flags_reject6

Passed

N/A

3.882472s

route_flags_static6

Passed

N/A

1.457716s

net/route/t_route

7.225337s

route_command_get

Passed

N/A

2.362124s

route_command_get6

Passed

N/A

2.438756s

route_non_subnet_gateway

Passed

N/A

2.413955s

net/if_vlan/t_vlan

12.305660s

vlan_basic

Passed

N/A

11.679061s

vlan_create_destroy

Passed

N/A

0.622556s

sbin/fsck_ffs/t_enable_quotas

11.226664s

corrupt_be_1

Passed

N/A

0.825170s

corrupt_be_2

Passed

N/A

0.585355s

corrupt_le_1

Passed

N/A

0.556385s

corrupt_le_2

Passed

N/A

0.580905s

dir1_be_1

Passed

N/A

0.450284s

dir1_be_2

Passed

N/A

0.478302s

dir1_le_1

Passed

N/A

0.459738s

dir1_le_2

Passed

N/A

0.448569s

disable_be_1

Passed

N/A

0.637311s

disable_be_2

Passed

N/A

0.621771s

disable_le_1

Passed

N/A

0.657975s

disable_le_2

Passed

N/A

0.620882s

notreg_be_1

Passed

N/A

0.555995s

notreg_be_2

Passed

N/A

0.533021s

notreg_le_1

Passed

N/A

0.556703s

notreg_le_2

Passed

N/A

0.549532s

unallocated_be_1

Passed

N/A

0.548815s

unallocated_be_2

Passed

N/A

0.501827s

unallocated_le_1

Passed

N/A

0.533782s

unallocated_le_2

Passed

N/A

0.494335s

sbin/fsck_ffs/t_check_quotas

31.401001s

corrupt_list_be_1

Passed

N/A

0.582450s

corrupt_list_be_2

Passed

N/A

0.587207s

corrupt_list_le_1

Passed

N/A

0.627244s

corrupt_list_le_2

Passed

N/A

0.568872s

expand1_list_be_1

Passed

N/A

0.709013s

expand1_list_be_2

Passed

N/A

0.629154s

expand1_list_le_1

Passed

N/A

0.634027s

expand1_list_le_2

Passed

N/A

0.653378s

expand2_list_be_1

Passed

N/A

6.386223s

expand2_list_be_2

Passed

N/A

6.582664s

expand2_list_le_1

Passed

N/A

6.232469s

expand2_list_le_2

Passed

N/A

6.394508s

sbin/gpt/t_gpt

4.405839s

backup_2part

Passed

N/A

0.477386s

bootable_2part

Skipped

Required file '/usr/mdec/gptmbr.bin' not found

0.000561s

change_attr_2part

Passed

N/A

0.459506s

change_type_2part

Passed

N/A

0.457852s

create_2part

Passed

N/A

0.318687s

create_empty

Passed

N/A

0.204855s

label_2part

Passed

N/A

0.358931s

migrate_disklabel

Failed

atf-check failed; see the output of the test for details

0.244365s

recover_backup

Failed

atf-check failed; see the output of the test for details

0.319537s

recover_primary

Passed

N/A

0.368597s

remove_2part

Passed

N/A

0.321348s

resize_2part

Passed

N/A

0.400873s

restore_2part

Passed

N/A

0.460282s

sbin/ifconfig/t_nonexistent

0.126295s

nonexistent

Passed

N/A

0.125423s

sbin/newfs/t_enable_quotas

2.911855s

enabled_be_1_both

Passed

N/A

0.278574s

enabled_be_1_group

Passed

N/A

0.236988s

enabled_be_1_user

Passed

N/A

0.251537s

enabled_be_2_both

Passed

N/A

0.231550s

enabled_be_2_group

Passed

N/A

0.225538s

enabled_be_2_user

Passed

N/A

0.239854s

enabled_le_1_both

Passed

N/A

0.236836s

enabled_le_1_group

Passed

N/A

0.232284s

enabled_le_1_user

Passed

N/A

0.244340s

enabled_le_2_both

Passed

N/A

0.238660s

enabled_le_2_group

Passed

N/A

0.231545s

enabled_le_2_user

Passed

N/A

0.245406s

sbin/newfs_msdos/t_create

0.238912s

validfat32

Passed

N/A

0.236597s

sbin/resize_ffs/t_check

0.439178s

check_grow

Passed

N/A

0.435242s

sbin/resize_ffs/t_grow

32.775146s

grow_16M_v0_8192

Passed

N/A

10.736164s

grow_16M_v1_16384

Passed

N/A

10.999419s

grow_16M_v2_32768

Passed

N/A

10.578854s

grow_ffsv1_partial_cg

Passed

N/A

0.377720s

sbin/resize_ffs/t_shrink

38.922842s

shrink_24M_16M_v0_32768

Passed

N/A

14.315563s

shrink_24M_16M_v1_65536

Passed

N/A

13.037130s

shrink_24M_16M_v2_4096

Expected failure

PR bin/44205: atf-check failed; see the output of the test for details

11.102713s

shrink_ffsv1_partial_cg

Passed

N/A

0.387348s

sbin/resize_ffs/t_grow_swapped

31.493202s

grow_16M_v0_65536

Passed

N/A

9.834714s

grow_16M_v1_4096

Passed

N/A

10.623522s

grow_16M_v2_8192

Passed

N/A

10.563379s

grow_ffsv1_partial_cg

Passed

N/A

0.389473s

sbin/resize_ffs/t_shrink_swapped

40.491190s

shrink_24M_16M_v0_4096

Passed

N/A

14.140956s

shrink_24M_16M_v1_8192

Passed

N/A

14.471581s

shrink_24M_16M_v2_16384

Expected failure

PR bin/44205: atf-check failed; see the output of the test for details

11.433385s

shrink_ffsv1_partial_cg

Passed

N/A

0.365340s

sbin/route/t_missing

0.132367s

missing

Passed

N/A

0.131501s

sbin/sysctl/t_perm

24.649916s

sysctl_ddb

Passed

N/A

0.655064s

sysctl_hw

Passed

N/A

3.323257s

sysctl_kern

Passed

N/A

6.312352s

sysctl_machdep

Passed

N/A

0.487685s

sysctl_net

Passed

N/A

10.501436s

sysctl_security

Passed

N/A

1.415966s

sysctl_vfs

Passed

N/A

0.917314s

sysctl_vm

Passed

N/A

1.027889s

sbin/sysctl/t_sysctl

0.234802s

basic

Passed

N/A

0.234040s

sys/net/t_print

0.025841s

dl_print

Passed

N/A

0.012112s

sdl_print

Passed

N/A

0.012493s

sys/netatalk/t_print

0.026003s

at_print

Passed

N/A

0.012969s

sat_print

Passed

N/A

0.011851s

sys/netinet/t_print

0.026754s

in_print

Passed

N/A

0.012711s

sin_print

Passed

N/A

0.012860s

sys/netinet6/t_print

0.026657s

in6_print

Passed

N/A

0.013051s

sin6_print

Passed

N/A

0.012388s

sys/rc/t_rc_d_cli

3.797182s

default_restart_no_args

Passed

N/A

0.480639s

default_restart_with_args

Passed

N/A

0.333049s

default_start_no_args

Passed

N/A

0.259376s

default_start_with_args

Passed

N/A

0.266003s

default_stop_no_args

Passed

N/A

0.313053s

default_stop_with_args

Passed

N/A

0.391519s

no_command

Passed

N/A

0.159933s

overriden_custom_no_args

Passed

N/A

0.191506s

overriden_custom_with_args

Passed

N/A

0.201573s

overriden_restart_no_args

Passed

N/A

0.196773s

overriden_restart_with_args

Passed

N/A

0.194758s

overriden_start_no_args

Passed

N/A

0.190388s

overriden_start_with_args

Passed

N/A

0.200440s

overriden_stop_no_args

Passed

N/A

0.198462s

overriden_stop_with_args

Passed

N/A

0.208217s

usr.bin/awk/t_awk

4.002655s

assign_NF

Passed

N/A

0.178829s

big_regexp

Passed

N/A

0.167541s

empty_rs

Passed

N/A

0.140782s

end

Passed

N/A

0.244699s

modify_subsep

Passed

N/A

0.152603s

multibyte

Passed

N/A

0.322531s

newline_rs

Passed

N/A

0.155046s

period

Passed

N/A

0.194589s

regex_caret_1_rs

Passed

N/A

0.146689s

regex_caret_2_rs

Passed

N/A

0.148060s

regex_dollar_1_rs

Passed

N/A

0.147876s

regex_dollar_2_rs

Passed

N/A

0.149915s

regex_or_1_rs

Passed

N/A

0.150640s

regex_or_2_rs

Passed

N/A

0.143873s

regex_or_3_rs

Passed

N/A

0.152544s

regex_reallocation_rs

Passed

N/A

0.187286s

regex_two_star_rs

Passed

N/A

0.150725s

single_char_regex_group_rs

Passed

N/A

0.150654s

single_char_regex_star_rs

Passed

N/A

0.145888s

single_char_rs

Passed

N/A

0.147119s

string1

Passed

N/A

0.151505s

two_char_regex_group_rs

Passed

N/A

0.150483s

two_char_regex_star_rs

Passed

N/A

0.147131s

two_char_rs

Passed

N/A

0.151630s

usr.bin/basename/t_basename

0.554628s

basic

Passed

N/A

0.327488s

suffix

Passed

N/A

0.225456s

usr.bin/bzip2/t_bzip2

1.037596s

basic

Passed

N/A

1.036681s

usr.bin/cc/t_hello

6.842309s

hello

Passed

N/A

3.220232s

hello32

Passed

N/A

2.269818s

hello_pic

Passed

N/A

0.775856s

hello_pie

Passed

N/A

0.570217s

usr.bin/cmp/t_cmp

0.456394s

missing

Passed

N/A

0.252084s

skip

Passed

N/A

0.202252s

usr.bin/config/t_config

2.409566s

deffs_redef

Passed

N/A

0.266658s

devi

Passed

N/A

0.234166s

loop

Passed

N/A

0.171741s

loop2

Passed

N/A

0.161668s

min

Passed

N/A

0.192300s

no_pseudo

Passed

N/A

0.164015s

no_select

Passed

N/A

0.185130s

no_undefined_opt

Passed

N/A

0.159067s

postponed_orphan

Passed

N/A

0.162777s

pseudo_parent

Passed

N/A

0.170334s

select

Passed

N/A

0.179462s

shadow_instance

Passed

N/A

0.157838s

undefined_opt

Passed

N/A

0.164204s

usr.bin/cut/t_cut

1.271100s

basic

Passed

N/A

0.231948s

dflag

Passed

N/A

0.229066s

dsflag

Passed

N/A

0.221539s

latin1

Passed

N/A

0.173221s

sflag

Passed

N/A

0.237751s

utf8

Passed

N/A

0.172645s

usr.bin/diff/t_diff

0.431118s

mallocv

Passed

N/A

0.145034s

nomallocv

Passed

N/A

0.138440s

same

Passed

N/A

0.145104s

usr.bin/dirname/t_dirname

0.356872s

basic

Passed

N/A

0.356026s

usr.bin/find/t_find

0.804096s

emptyperm

Passed

N/A

0.510429s

exit

Passed

N/A

0.143171s

exit_status

Passed

N/A

0.147906s

usr.bin/gdb/t_regress

11.730018s

pie

Passed

N/A

3.385883s

threads

Passed

N/A

8.341714s

usr.bin/grep/t_grep

2.619984s

basic

Passed

N/A

0.193941s

begin_end

Passed

N/A

0.184069s

binary

Passed

N/A

0.152673s

context

Passed

N/A

0.250200s

context2

Passed

N/A

0.196706s

egrep

Passed

N/A

0.139777s

file_exp

Passed

N/A

0.154782s

ignore_case

Passed

N/A

0.139318s

invert

Passed

N/A

0.141055s

negative

Passed

N/A

0.134370s

nonexistent

Passed

N/A

0.137852s

recurse

Passed

N/A

0.150501s

recurse_symlink

Passed

N/A

0.158210s

whole_line

Passed

N/A

0.141630s

word_regexps

Passed

N/A

0.138746s

zgrep

Passed

N/A

0.189827s

usr.bin/gzip/t_gzip

4.291392s

concatenated

Passed

N/A

0.152931s

crcerror

Passed

N/A

0.141011s

good

Passed

N/A

0.137527s

pipe

Passed

N/A

3.707991s

truncated

Passed

N/A

0.146891s

usr.bin/id/t_groups

0.521294s

correct

Passed

N/A

0.330127s

syntax

Passed

N/A

0.188585s

usr.bin/id/t_id

4.799262s

Gflag

Passed

N/A

0.621142s

default

Passed

N/A

0.442524s

gflag

Passed

N/A

1.174478s

pflag

Passed

N/A

0.490264s

primaries

Passed

N/A

0.946103s

uflag

Passed

N/A

1.115150s

usr.bin/id/t_whoami

0.384607s

correct

Passed

N/A

0.187148s

syntax

Passed

N/A

0.194636s

usr.bin/infocmp/t_terminfo

0.664567s

basic

Passed

N/A

0.472438s

missing

Passed

N/A

0.190679s

usr.bin/jot/t_jot

0.322733s

basic

Passed

N/A

0.134692s

format

Passed

N/A

0.186518s

usr.bin/ld/t_script

5.037750s

multisec

Passed

N/A

0.697973s

order_default

Passed

N/A

1.237418s

order_merge

Passed

N/A

1.028042s

order_reorder

Passed

N/A

1.042453s

order_sort

Passed

N/A

1.017517s

usr.bin/ld/t_section

0.864362s

orphan

Passed

N/A

0.440455s

startstop

Passed

N/A

0.421082s

usr.bin/m4/t_m4

0.270612s

eof

Passed

N/A

0.269382s

usr.bin/make/t_make

42.157409s

comment

Passed

N/A

0.966729s

cond1

Passed

N/A

0.795464s

cond2

Passed

N/A

0.799146s

doterror

Passed

N/A

0.941781s

dotwait

Passed

N/A

12.157531s

error

Passed

N/A

0.764720s

escape

Expected failure

see PR toolchain/49085: atf-check failed; see the output of the test for details

0.998007s

export

Passed

N/A

0.827086s

export_all

Passed

N/A

0.818892s

export_env

Passed

N/A

0.792437s

forloop

Passed

N/A

0.949269s

forsubst

Passed

N/A

0.787903s

hash

Passed

N/A

0.825738s

impsrc

Expected failure

see PR toolchain/49085: atf-check failed; see the output of the test for details

0.934856s

misc

Passed

N/A

0.814896s

moderrs

Passed

N/A

0.833700s

modmatch

Passed

N/A

0.998483s

modmisc

Passed

N/A

0.830926s

modorder

Passed

N/A

0.839652s

modts

Passed

N/A

0.948013s

modword

Passed

N/A

1.534511s

order

Passed

N/A

0.804848s

phony_end

Expected failure

see PR toolchain/49085: atf-check failed; see the output of the test for details

0.818400s

posix

Passed

N/A

0.876011s

posix1

Expected failure

see PR toolchain/49085: atf-check failed; see the output of the test for details

1.322865s

qequals

Passed

N/A

0.761448s

suffixes

Expected failure

see PR toolchain/49085: this uses up all memory and then fails

0.508978s

sunshcmd

Passed

N/A

0.810826s

sysv

Passed

N/A

0.828193s

ternary

Passed

N/A

0.869220s

unexport

Passed

N/A

0.822810s

unexport_env

Passed

N/A

0.819778s

varcmd

Passed

N/A

0.940296s

varmisc

Passed

N/A

0.886043s

varshell

Passed

N/A

0.880479s

usr.bin/mkdep/t_mkdep

1.064154s

prefix

Passed

N/A

0.268707s

prefix_and_suffixes

Passed

N/A

0.277137s

suffixes

Passed

N/A

0.515245s

usr.bin/nbperf/t_nbperf

39.556176s

bdz

Passed

N/A

13.271875s

chm

Passed

N/A

15.192740s

chm3

Passed

N/A

11.071935s

usr.bin/netpgpverify/t_netpgpverify

6.051449s

netpgpverify_testset_1_rsa_signatures

Passed

N/A

2.116138s

netpgpverify_testset_2_dsa_signatures

Passed

N/A

3.923178s

usr.bin/pr/t_basic

0.173308s

basic

Passed

N/A

0.172362s

usr.bin/rump_server/t_disk

2.960718s

data

Passed

N/A

0.444693s

notrunc

Passed

N/A

0.355724s

offset

Passed

N/A

0.339219s

size

Passed

N/A

0.359517s

type_blk

Passed

N/A

0.353364s

type_blk_default

Passed

N/A

0.373394s

type_chr

Passed

N/A

0.373974s

type_reg

Passed

N/A

0.352532s

usr.bin/shmif_dumpbus/t_basic

2.978613s

contents

Passed

N/A

0.344571s

header

Passed

N/A

0.232276s

pcap

Passed

N/A

2.387977s

usr.bin/sdiff/t_sdiff

3.234876s

dot

Passed

N/A

0.206671s

flags

Passed

N/A

0.252126s

iflags

Passed

N/A

0.521584s

merge

Passed

N/A

1.142126s

oneline

Passed

N/A

0.200465s

same

Passed

N/A

0.147336s

short

Passed

N/A

0.162702s

stdin

Passed

N/A

0.199198s

tabends

Passed

N/A

0.237373s

tabs

Passed

N/A

0.157084s

usr.bin/sed/t_sed

1.322788s

c2048

Passed

N/A

0.137941s

emptybackref

Expected failure

PR bin/28126: atf-check failed; see the output of the test for details

0.189569s

longlines

Passed

N/A

0.189553s

preserve_leading_ws_ia

Passed

N/A

0.140460s

rangeselection

Passed

N/A

0.661327s

usr.bin/sort/t_sort

8.557964s

any_char

Passed

N/A

0.225999s

basic

Passed

N/A

0.153529s

bflag

Passed

N/A

0.215695s

cflag

Passed

N/A

0.144095s

empty_file

Passed

N/A

0.194322s

end_of_options

Passed

N/A

0.187599s

kflag_alpha

Passed

N/A

0.572056s

kflag_limits

Passed

N/A

0.158018s

kflag_many_fields

Passed

N/A

0.151045s

kflag_no_end

Passed

N/A

0.153240s

kflag_nonmonotone

Passed

N/A

0.146840s

kflag_one_field

Passed

N/A

0.153494s

kflag_outofbounds

Passed

N/A

0.139314s

kflag_two_fields

Passed

N/A

0.147329s

long_file

Passed

N/A

0.547262s

long_records

Passed

N/A

0.194300s

mflag

Passed

N/A

0.164310s

mflag_uflag

Passed

N/A

0.143930s

mflag_uflag_first

Passed

N/A

0.181345s

missing_newline

Passed

N/A

0.136076s

nflag

Passed

N/A

0.149657s

nflag_rflag

Passed

N/A

0.153835s

null_bytes

Passed

N/A

0.140939s

oflag

Passed

N/A

0.182566s

oflag_displaced

Passed

N/A

0.134271s

plus_as_path

Passed

N/A

0.135924s

plus_bad_tempfile

Passed

N/A

0.135265s

plus_no_end

Passed

N/A

0.148437s

plus_nonmonotone

Passed

N/A

0.139330s

plus_one

Passed

N/A

0.155866s

plus_one_minus_two

Passed

N/A

0.149592s

plus_rflag_invalid

Passed

N/A

0.149409s

plus_tflag

Passed

N/A

0.760571s

plus_zero

Passed

N/A

0.142769s

rflag

Passed

N/A

0.154777s

sflag

Passed

N/A

0.151302s

sflag_many_files

Passed

N/A

0.156248s

tflag

Passed

N/A

0.239631s

tflag_alphabetic

Passed

N/A

0.143621s

tflag_char_pos

Passed

N/A

0.236908s

tflag_whitespace

Passed

N/A

0.349487s

uflag

Passed

N/A

0.146920s

uflag_rflag

Passed

N/A

0.147886s

usr.bin/tmux/t_tmux

2.135802s

stdin

Passed

N/A

2.134980s

usr.bin/tr/t_basic

3.716649s

csubst

Passed

N/A

0.224254s

dopt

Passed

N/A

1.474652s

dsopt

Passed

N/A

0.689521s

sopt

Passed

N/A

0.632546s

subst

Passed

N/A

0.692926s

usr.bin/unifdef/t_basic

0.321057s

basic

Passed

N/A

0.162945s

lastline

Passed

N/A

0.156396s

usr.bin/uniq/t_uniq

0.654431s

basic

Passed

N/A

0.139761s

show_duplicates

Passed

N/A

0.128021s

show_duplicates_from_third_character

Passed

N/A

0.125621s

show_uniques

Passed

N/A

0.127668s

test_counts

Passed

N/A

0.129995s

usr.bin/vmstat/t_vmstat

0.280681s

default

Passed

N/A

0.153879s

opt_s

Passed

N/A

0.125431s

usr.bin/xlint/lint1/t_integration

6.060258s

alignof

Passed

N/A

0.255715s

c99_complex_num

Passed

N/A

0.158017s

c99_complex_split

Passed

N/A

0.152925s

c99_decls_after_stmt

Passed

N/A

0.159443s

c99_decls_after_stmt3

Passed

N/A

0.159687s

c99_for_loops

Passed

N/A

0.154156s

c99_func

Passed

N/A

0.156373s

c99_recursive_init

Passed

N/A

0.155827s

c99_struct_init

Passed

N/A

0.156001s

c99_union_init1

Passed

N/A

0.151559s

c99_union_init2

Passed

N/A

0.156374s

c99_union_init3

Passed

N/A

0.161040s

c9x_array_init

Passed

N/A

0.151600s

c9x_recursive_init

Passed

N/A

0.151312s

cast_init

Passed

N/A

0.155317s

cast_init2

Passed

N/A

0.151585s

cast_lhs

Passed

N/A

0.154937s

compound_literals1

Passed

N/A

0.152818s

compound_literals2

Passed

N/A

0.153152s

constant_conv1

Passed

N/A

0.156385s

constant_conv2

Passed

N/A

0.153985s

cvt_in_ternary

Passed

N/A

0.154775s

ellipsis_in_switch

Passed

N/A

0.162827s

gcc_compound_statements1

Passed

N/A

0.157648s

gcc_compound_statements2

Passed

N/A

0.155999s

gcc_compound_statements3

Passed

N/A

0.158090s

gcc_func

Passed

N/A

0.153813s

gcc_variable_array_init

Passed

N/A

0.158743s

incorrect_array_size

Passed

N/A

0.159688s

long_double_int

Passed

N/A

0.155677s

nested_structs

Passed

N/A

0.156975s

nolimit_init

Passed

N/A

0.161016s

packed_structs

Passed

N/A

0.150075s

shift_to_narrower_type

Passed

N/A

0.154418s

type_conv1

Passed

N/A

0.156965s

type_conv2

Passed

N/A

0.155579s

type_conv3

Passed

N/A

0.159957s

zero_sized_arrays

Passed

N/A

0.160405s

usr.sbin/mtree/t_mtree

2.776328s

mtree_check

Passed

N/A

0.203966s

mtree_convert_C

Passed

N/A

0.125333s

mtree_convert_C_S

Passed

N/A

0.127215s

mtree_convert_D

Passed

N/A

0.124392s

mtree_convert_D_S

Passed

N/A

0.125145s

mtree_create

Passed

N/A

0.169636s

mtree_ignore

Passed

N/A

0.216519s

mtree_merge

Passed

N/A

0.156419s

mtree_nonemptydir

Passed

N/A

0.172954s

netbsd6_check

Passed

N/A

0.159270s

netbsd6_convert_C

Passed

N/A

0.118097s

netbsd6_convert_C_S

Passed

N/A

0.120990s

netbsd6_convert_D

Passed

N/A

0.119095s

netbsd6_convert_D_S

Passed

N/A

0.123487s

netbsd6_create

Passed

N/A

0.169107s

netbsd6_ignore

Passed

N/A

0.206600s

netbsd6_merge

Passed

N/A

0.138767s

netbsd6_nonemptydir

Passed

N/A

0.164512s

usr.sbin/tcpdump/t_tcpdump

10.228492s

promiscuous

Passed

N/A

10.227749s

usr.sbin/traceroute/t_traceroute

2.862756s

basic

Passed

N/A

1.434745s

basic_icmp

Passed

N/A

1.421411s

usr.sbin/useradd/t_useradd

0.368450s

longname

Expected failure

PR bin/39546: atf-check failed; see the output of the test for details

0.367547s

fs/ffs/t_fifos

0.189875s

fifos

Passed

N/A

0.188942s

fs/ffs/t_snapshot

5.578522s

snapshot

Passed

N/A

1.009653s

snapshotstress

Passed

N/A

4.567319s

fs/ffs/t_snapshot_log

5.676220s

snapshot

Passed

N/A

1.073657s

snapshotstress

Passed

N/A

4.601022s

fs/ffs/t_snapshot_v2

5.508158s

snapshot

Passed

N/A

0.969000s

snapshotstress

Passed

N/A

4.537752s

fs/ffs/t_mount

0.421551s

48Kimage

Expected failure

PR kern/43573: mount failed: Invalid argument

0.128297s

fsbsizeovermaxbsize

Passed

N/A

0.143059s

fsbsizeovermaxphys

Passed

N/A

0.144541s

fs/ffs/t_quota2_1

7.003236s

quota_1000_O1_be

Passed

N/A

1.273774s

quota_1000_O1_le

Passed

N/A

1.455766s

quota_1000_O2_be

Passed

N/A

1.285584s

quota_1000_O2_le

Passed

N/A

1.461330s

quota_40_O1_be

Passed

N/A

0.241254s

quota_40_O1_le

Passed

N/A

0.244272s

quota_40_O1_log

Passed

N/A

0.238937s

quota_40_O2_be

Passed

N/A

0.280186s

quota_40_O2_le

Passed

N/A

0.256975s

quota_40_O2_log

Passed

N/A

0.244486s

fs/ffs/t_quota2_remount

0.453379s

quota_10_O1_be

Passed

N/A

0.218709s

quota_10_O1_le

Passed

N/A

0.232389s

fs/ffs/t_getquota

9.790802s

get_be_1_both

Passed

N/A

0.810918s

get_be_1_group

Passed

N/A

0.834093s

get_be_1_user

Passed

N/A

0.812892s

get_be_2_both

Passed

N/A

0.785023s

get_be_2_group

Passed

N/A

0.799656s

get_be_2_user

Passed

N/A

0.813672s

get_le_1_both

Passed

N/A

0.813194s

get_le_1_group

Passed

N/A

0.812715s

get_le_1_user

Passed

N/A

0.813562s

get_le_2_both

Passed

N/A

0.820483s

get_le_2_group

Passed

N/A

0.843178s

get_le_2_user

Passed

N/A

0.811425s

fs/ffs/t_setquota

34.891818s

set_be_1_both

Passed

N/A

0.974929s

set_be_1_group

Passed

N/A

0.959064s

set_be_1_user

Passed

N/A

0.966324s

set_be_2_both

Passed

N/A

0.965858s

set_be_2_group

Passed

N/A

1.003509s

set_be_2_user

Passed

N/A

0.939603s

set_default_be_1_both

Passed

N/A

0.830931s

set_default_be_1_group

Passed

N/A

0.829972s

set_default_be_1_user

Passed

N/A

0.834131s

set_default_be_2_both

Passed

N/A

0.838995s

set_default_be_2_group

Passed

N/A

0.818207s

set_default_be_2_user

Passed

N/A

0.784513s

set_default_le_1_both

Passed

N/A

0.819156s

set_default_le_1_group

Passed

N/A

0.798420s

set_default_le_1_user

Passed

N/A

0.812023s

set_default_le_2_both

Passed

N/A

0.810645s

set_default_le_2_group

Passed

N/A

0.832974s

set_default_le_2_user

Passed

N/A

0.833660s

set_le_1_both

Passed

N/A

0.967055s

set_le_1_group

Passed

N/A

0.982249s

set_le_1_user

Passed

N/A

0.953994s

set_le_2_both

Passed

N/A

0.947160s

set_le_2_group

Passed

N/A

0.950539s

set_le_2_user

Passed

N/A

1.007314s

set_new_be_1_both

Passed

N/A

0.830135s

set_new_be_1_both_log

Passed

N/A

0.846610s

set_new_be_1_group

Passed

N/A

0.835776s

set_new_be_1_user

Passed

N/A

0.828800s

set_new_be_2_both

Passed

N/A

0.847184s

set_new_be_2_both_log

Passed

N/A

0.842708s

set_new_be_2_group

Passed

N/A

0.820459s

set_new_be_2_user

Passed

N/A

0.829458s

set_new_le_1_both

Passed

N/A

0.821665s

set_new_le_1_both_log

Passed

N/A

0.858880s

set_new_le_1_group

Passed

N/A

0.814676s

set_new_le_1_user

Passed

N/A

0.834397s

set_new_le_2_both

Passed

N/A

0.847855s

set_new_le_2_both_log

Passed

N/A

0.821022s

set_new_le_2_group

Passed

N/A

0.842549s

set_new_le_2_user

Passed

N/A

0.844673s

fs/ffs/t_quotalimit

25.949394s

herit_defq_le_1_group

Passed

N/A

1.002859s

herit_defq_le_1_group_log

Passed

N/A

1.017004s

herit_defq_le_1_user

Passed

N/A

1.014511s

herit_defq_le_1_user_log

Passed

N/A

1.023848s

herit_idefq_le_1_group_log

Passed

N/A

1.023652s

herit_idefq_le_1_user_log

Passed

N/A

1.050444s

inolimit_le_1_group

Passed

N/A

1.013867s

inolimit_le_1_group_log

Passed

N/A

0.973701s

inolimit_le_1_user

Passed

N/A

0.972746s

inolimit_le_1_user_log

Passed

N/A

0.952774s

limit_le_1_group

Passed

N/A

0.977080s

limit_le_1_group_log

Passed

N/A

0.988274s

limit_le_1_user

Passed

N/A

0.993335s

limit_le_1_user_log

Passed

N/A

1.023310s

sinolimit_le_1_group

Passed

N/A

2.976727s

sinolimit_le_1_user

Passed

N/A

2.986889s

slimit_le_1_group

Passed

N/A

2.992891s

slimit_le_1_user

Passed

N/A

2.936253s

fs/ffs/t_clearquota

14.603262s

clear_be_1_both

Passed

N/A

0.973938s

clear_be_1_both_log

Passed

N/A

0.985495s

clear_be_1_group

Passed

N/A

0.839373s

clear_be_1_user

Passed

N/A

0.823875s

clear_be_2_both

Passed

N/A

0.960534s

clear_be_2_both_log

Passed

N/A

0.982774s

clear_be_2_group

Passed

N/A

0.836535s

clear_be_2_user

Passed

N/A

0.816955s

clear_le_1_both

Passed

N/A

1.001372s

clear_le_1_both_log

Passed

N/A

1.005745s

clear_le_1_group

Passed

N/A

0.844012s

clear_le_1_user

Passed

N/A

0.832733s

clear_le_2_both

Passed

N/A

0.977380s

clear_le_2_both_log

Passed

N/A

1.014734s

clear_le_2_group

Passed

N/A

0.836041s

clear_le_2_user

Passed

N/A

0.844768s

fs/ffs/t_miscquota

22.101401s

default_deny_user

Passed

N/A

0.874836s

default_deny_user_big

Passed

N/A

8.316604s

log_unlink

Passed

N/A

0.825125s

log_unlink_remount

Passed

N/A

0.835268s

npsnapshot_unconf_user

Passed

N/A

1.461498s

npsnapshot_user

Passed

N/A

1.433455s

psnapshot_unconf_user

Passed

N/A

1.462157s

psnapshot_user

Passed

N/A

1.471727s

walk_list_user

Passed

N/A

5.404421s

fs/fifofs/t_fifo

0.598475s

parent_child

Passed

N/A

0.597605s

fs/hfs/t_pathconvert

0.129650s

colonslash

Passed

N/A

0.126282s

fs/kernfs/t_basic

0.126355s

getdents

Passed

N/A

0.059840s

hostname

Passed

N/A

0.064912s

fs/lfs/t_pr

0.295309s

mknod

Passed

N/A

0.283460s

fs/msdosfs/t_snapshot

5.439866s

snapshot

Passed

N/A

0.970797s

snapshotstress

Passed

N/A

4.467601s

fs/nfs/t_mountd

1.041910s

mountdhup

Expected failure

PR kern/5844: op failed with EACCES

1.036534s

fs/nfs/t_rquotad

14.461400s

get_nfs_be_1_both

Passed

N/A

2.619091s

get_nfs_be_1_group

Passed

N/A

2.356124s

get_nfs_be_1_user

Passed

N/A

2.260947s

get_nfs_le_1_both

Passed

N/A

2.612251s

get_nfs_le_1_group

Passed

N/A

2.368609s

get_nfs_le_1_user

Passed

N/A

2.227735s

fs/nullfs/t_basic

0.144435s

basic

Passed

N/A

0.074197s

twistymount

Passed

N/A

0.068421s

fs/psshfs/t_psshfs

7.957010s

inode_nos

Passed

N/A

2.529964s

ls

Passed

N/A

1.878183s

pwd

Passed

N/A

1.772587s

read_empty_file

Passed

N/A

1.759829s

fs/ptyfs/t_ptyfs

0.073467s

basic

Passed

N/A

0.072558s

fs/ptyfs/t_nullpts

0.073133s

nullrevoke

Passed

N/A

0.072188s

fs/puffs/t_basic

1.570722s

inactive_basic

Passed

N/A

0.169443s

inactive_reclaim

Passed

N/A

0.159328s

mount

Passed

N/A

0.159351s

reclaim_hardlink

Passed

N/A

0.159179s

root_chrdev

Passed

N/A

0.159156s

root_fifo

Passed

N/A

0.169593s

root_lnk

Passed

N/A

0.113195s

root_reg

Passed

N/A

0.154859s

signals

Passed

N/A

0.159591s

unlink_accessible

Passed

N/A

0.158936s

fs/puffs/t_fuzz

1.658776s

mountfuzz0

Passed

N/A

0.194174s

mountfuzz1

Passed

N/A

0.169999s

mountfuzz2

Passed

N/A

0.171564s

mountfuzz3

Passed

N/A

0.179247s

mountfuzz4

Passed

N/A

0.173137s

mountfuzz5

Passed

N/A

0.171054s

mountfuzz6

Passed

N/A

0.167480s

mountfuzz7

Passed

N/A

0.174977s

mountfuzz8

Passed

N/A

0.251414s

fs/puffs/t_io

0.181661s

nocache

Passed

N/A

0.180645s

fs/tmpfs/t_renamerace

4.071648s

renamerace2

Passed

N/A

4.070679s

fs/tmpfs/t_create

1.541203s

attrs

Passed

N/A

0.831177s

create

Passed

N/A

0.336074s

kqueue

Passed

N/A

0.371330s

fs/tmpfs/t_devices

0.487900s

basic

Passed

N/A

0.486695s

fs/tmpfs/t_dots

0.698271s

nesteddir

Passed

N/A

0.364688s

topdir

Passed

N/A

0.331979s

fs/tmpfs/t_exec

0.341689s

basic

Passed

N/A

0.340618s

fs/tmpfs/t_link

1.514103s

basic

Passed

N/A

0.497968s

kqueue

Passed

N/A

0.535817s

subdirs

Passed

N/A

0.478000s

fs/tmpfs/t_mkdir

10.509187s

attrs

Passed

N/A

0.691762s

kqueue

Passed

N/A

0.432414s

many

Passed

N/A

8.665938s

nested

Passed

N/A

0.353264s

single

Passed

N/A

0.361378s

fs/tmpfs/t_mknod

2.095269s

block

Passed

N/A

0.305505s

block_kqueue

Passed

N/A

0.443443s

char

Passed

N/A

0.312077s

char_kqueue

Passed

N/A

0.364726s

pipe

Passed

N/A

0.292219s

pipe_kqueue

Passed

N/A

0.372133s

fs/tmpfs/t_mount

1.671139s

attrs

Passed

N/A

0.267795s

large

Passed

N/A

0.353930s

mntpt

Passed

N/A

0.240346s

negative

Passed

N/A

0.255028s

options

Passed

N/A

0.286392s

plain

Passed

N/A

0.261897s

fs/tmpfs/t_pipes

0.298924s

basic

Passed

N/A

0.297745s

fs/tmpfs/t_read_write

0.793758s

basic

Passed

N/A

0.347208s

kqueue

Passed

N/A

0.444731s

fs/tmpfs/t_readdir

4.366710s

caching

Passed

N/A

0.410119s

dots

Passed

N/A

0.333426s

many

Passed

N/A

3.091433s

types

Passed

N/A

0.528103s

fs/tmpfs/t_remove

1.651412s

dot

Passed

N/A

0.364506s

kqueue

Passed

N/A

0.441013s

single

Passed

N/A

0.419279s

uchg

Passed

N/A

0.422944s

fs/tmpfs/t_rename

5.124443s

basic

Passed

N/A

0.414776s

crossdev

Passed

N/A

0.415998s

dir_to_emptydir

Passed

N/A

0.486697s

dir_to_file

Passed

N/A

0.469341s

dir_to_fulldir

Passed

N/A

0.569980s

dotdot

Passed

N/A

0.916521s

dots

Passed

N/A

0.394782s

file_to_dir

Passed

N/A

0.474137s

kqueue

Passed

N/A

0.974057s

fs/tmpfs/t_rmdir

3.459432s

curdir

Passed

N/A

0.378995s

dots

Passed

N/A

0.370067s

kqueue

Passed

N/A

0.433895s

links

Passed

N/A

0.468243s

mntpt

Passed

N/A

0.299414s

nested

Passed

N/A

0.373483s

non_empty

Passed

N/A

0.472580s

non_existent

Passed

N/A

0.300077s

single

Passed

N/A

0.354594s

fs/tmpfs/t_setattr

3.607492s

chgrp

Passed

N/A

0.340946s

chgrp_kqueue

Passed

N/A

0.384198s

chmod

Passed

N/A

0.331705s

chmod_kqueue

Passed

N/A

0.387813s

chown

Passed

N/A

0.344251s

chown_kqueue

Passed

N/A

0.381799s

chowngrp

Passed

N/A

0.326970s

chowngrp_kqueue

Passed

N/A

0.368783s

chtimes

Passed

N/A

0.351545s

chtimes_kqueue

Passed

N/A

0.379970s

fs/tmpfs/t_sizes

1.956852s

big

Passed

N/A

0.445004s

overflow

Passed

N/A

0.533108s

overwrite

Passed

N/A

0.659813s

small

Passed

N/A

0.314879s

fs/tmpfs/t_sockets

0.415797s

basic

Passed

N/A

0.414885s

fs/tmpfs/t_statvfs

0.277158s

values

Passed

N/A

0.276287s

fs/tmpfs/t_symlink

1.607332s

dir

Passed

N/A

0.449660s

exec

Passed

N/A

0.361993s

file

Passed

N/A

0.380763s

kqueue

Passed

N/A

0.411183s

fs/tmpfs/t_times

6.441458s

empty

Passed

N/A

2.378627s

link

Passed

N/A

1.317688s

non_empty

Passed

N/A

1.341554s

rename

Passed

N/A

1.399786s

fs/tmpfs/t_trail_slash

0.390039s

main

Passed

N/A

0.389175s

fs/tmpfs/t_truncate

0.305489s

basic

Passed

N/A

0.304460s

fs/tmpfs/t_vnd

3.442906s

basic

Passed

N/A

3.441564s

fs/tmpfs/t_vnode_leak

21.124066s

main

Passed

N/A

21.123087s

fs/umapfs/t_basic

0.072977s

basic

Passed

N/A

0.072302s

fs/union/t_pr

0.249227s

devnull1

Passed

N/A

0.083251s

devnull2

Passed

N/A

0.084810s

multilayer

Passed

N/A

0.079157s

fs/vfs/t_full

10.271192s

ext2fs_fillfs

Passed

N/A

0.696482s

ffs_fillfs

Passed

N/A

0.437169s

ffslog_fillfs

Passed

N/A

0.424845s

lfs_fillfs

Passed

N/A

0.733724s

msdosfs_fillfs

Passed

N/A

0.441536s

nfs_fillfs

Passed

N/A

1.398440s

p2k_ffs_fillfs

Skipped

fs does not support explicit block allocation (GOP_ALLOC)

0.406640s

puffs_fillfs

Skipped

fs does not support explicit block allocation (GOP_ALLOC)

0.301179s

rumpfs_fillfs

Skipped

fs does not support explicit block allocation (GOP_ALLOC)

0.288451s

sysvbfs_fillfs

Passed

N/A

0.807524s

tmpfs_fillfs

Passed

N/A

0.367992s

udf_fillfs

Passed

N/A

1.119913s

v7fs_fillfs

Passed

N/A

2.734139s

fs/vfs/t_io

51.580418s

ext2fs_extendfile

Passed

N/A

0.322113s

ext2fs_extendfile_append

Passed

N/A

0.316294s

ext2fs_holywrite

Passed

N/A

0.311106s

ext2fs_overwrite512

Passed

N/A

0.341831s

ext2fs_overwrite64k

Passed

N/A

0.341326s

ext2fs_overwrite_trunc

Passed

N/A

0.320745s

ext2fs_read_after_unlink

Passed

N/A

0.321899s

ext2fs_read_fault

Passed

N/A

0.332529s

ext2fs_shrinkfile

Passed

N/A

0.313732s

ext2fs_wrrd_after_unlink

Passed

N/A

0.316572s

ffs_extendfile

Passed

N/A

0.328605s

ffs_extendfile_append

Passed

N/A

0.338854s

ffs_holywrite

Passed

N/A

0.339214s

ffs_overwrite512

Passed

N/A

0.326329s

ffs_overwrite64k

Passed

N/A

0.340566s

ffs_overwrite_trunc

Passed

N/A

0.341728s

ffs_read_after_unlink

Passed

N/A

0.347622s

ffs_read_fault

Passed

N/A

0.339446s

ffs_shrinkfile

Passed

N/A

0.335392s

ffs_wrrd_after_unlink

Passed

N/A

0.351480s

ffslog_extendfile

Passed

N/A

0.334334s

ffslog_extendfile_append

Passed

N/A

0.331436s

ffslog_holywrite

Passed

N/A

0.346047s

ffslog_overwrite512

Passed

N/A

0.355330s

ffslog_overwrite64k

Passed

N/A

0.332550s

ffslog_overwrite_trunc

Passed

N/A

0.354774s

ffslog_read_after_unlink

Passed

N/A

0.325754s

ffslog_read_fault

Passed

N/A

0.327317s

ffslog_shrinkfile

Passed

N/A

0.330437s

ffslog_wrrd_after_unlink

Passed

N/A

0.325839s

lfs_extendfile

Passed

N/A

0.414014s

lfs_extendfile_append

Passed

N/A

0.423180s

lfs_holywrite

Passed

N/A

0.411224s

lfs_overwrite512

Passed

N/A

0.421536s

lfs_overwrite64k

Passed

N/A

0.417128s

lfs_overwrite_trunc

Passed

N/A

0.410537s

lfs_read_after_unlink

Passed

N/A

0.401277s

lfs_read_fault

Passed

N/A

0.402060s

lfs_shrinkfile

Passed

N/A

0.424763s

lfs_wrrd_after_unlink

Passed

N/A

0.413086s

msdosfs_extendfile

Passed

N/A

0.327725s

msdosfs_extendfile_append

Passed

N/A

0.331238s

msdosfs_holywrite

Passed

N/A

0.318053s

msdosfs_overwrite512

Passed

N/A

0.316341s

msdosfs_overwrite64k

Passed

N/A

0.314413s

msdosfs_overwrite_trunc

Passed

N/A

0.321022s

msdosfs_read_after_unlink

Passed

N/A

0.334447s

msdosfs_read_fault

Passed

N/A

0.321317s

msdosfs_shrinkfile

Passed

N/A

0.310876s

msdosfs_wrrd_after_unlink

Passed

N/A

0.349815s

nfs_extendfile

Passed

N/A

0.643607s

nfs_extendfile_append

Passed

N/A

0.633507s

nfs_holywrite

Passed

N/A

0.647180s

nfs_overwrite512

Passed

N/A

0.645598s

nfs_overwrite64k

Passed

N/A

0.678483s

nfs_overwrite_trunc

Passed

N/A

0.654256s

nfs_read_after_unlink

Passed

N/A

0.635000s

nfs_read_fault

Passed

N/A

0.652118s

nfs_shrinkfile

Passed

N/A

0.663830s

nfs_wrrd_after_unlink

Passed

N/A

0.645598s

p2k_ffs_extendfile

Passed

N/A

0.455473s

p2k_ffs_extendfile_append

Passed

N/A

0.468588s

p2k_ffs_holywrite

Passed

N/A

0.467567s

p2k_ffs_overwrite512

Passed

N/A

0.448522s

p2k_ffs_overwrite64k

Passed

N/A

0.498018s

p2k_ffs_overwrite_trunc

Passed

N/A

0.467941s

p2k_ffs_read_after_unlink

Passed

N/A

0.477837s

p2k_ffs_read_fault

Passed

N/A

0.468100s

p2k_ffs_shrinkfile

Passed

N/A

0.458119s

p2k_ffs_wrrd_after_unlink

Passed

N/A

0.448031s

puffs_extendfile

Passed

N/A

0.348265s

puffs_extendfile_append

Passed

N/A

0.398190s

puffs_holywrite

Passed

N/A

0.369543s

puffs_overwrite512

Passed

N/A

0.349519s

puffs_overwrite64k

Passed

N/A

0.380059s

puffs_overwrite_trunc

Passed

N/A

0.398868s

puffs_read_after_unlink

Passed

N/A

0.369193s

puffs_read_fault

Passed

N/A

0.378951s

puffs_shrinkfile

Passed

N/A

0.389590s

puffs_wrrd_after_unlink

Passed

N/A

0.379777s

rumpfs_extendfile

Passed

N/A

0.286270s

rumpfs_extendfile_append

Passed

N/A

0.306640s

rumpfs_holywrite

Passed

N/A

0.290817s

rumpfs_overwrite512

Passed

N/A

0.299810s

rumpfs_overwrite64k

Passed

N/A

0.300944s

rumpfs_overwrite_trunc

Passed

N/A

0.294523s

rumpfs_read_after_unlink

Passed

N/A

0.287976s

rumpfs_read_fault

Passed

N/A

0.286491s

rumpfs_shrinkfile

Passed

N/A

0.290622s

rumpfs_wrrd_after_unlink

Passed

N/A

0.311038s

sysvbfs_extendfile

Passed

N/A

0.325582s

sysvbfs_extendfile_append

Passed

N/A

0.305298s

sysvbfs_holywrite

Passed

N/A

0.306803s

sysvbfs_overwrite512

Passed

N/A

0.297856s

sysvbfs_overwrite64k

Passed

N/A

0.316531s

sysvbfs_overwrite_trunc

Passed

N/A

0.326528s

sysvbfs_read_after_unlink

Passed

N/A

0.302054s

sysvbfs_read_fault

Passed

N/A

0.311683s

sysvbfs_shrinkfile

Passed

N/A

0.311220s

sysvbfs_wrrd_after_unlink

Passed

N/A

0.325081s

tmpfs_extendfile

Passed

N/A

0.311215s

tmpfs_extendfile_append

Passed

N/A

0.312616s

tmpfs_holywrite

Passed

N/A

0.306115s

tmpfs_overwrite512

Passed

N/A

0.294040s

tmpfs_overwrite64k

Passed

N/A

0.306767s

tmpfs_overwrite_trunc

Passed

N/A

0.287140s

tmpfs_read_after_unlink

Passed

N/A

0.301598s

tmpfs_read_fault

Passed

N/A

0.290088s

tmpfs_shrinkfile

Passed

N/A

0.290303s

tmpfs_wrrd_after_unlink

Passed

N/A

0.306041s

udf_extendfile

Passed

N/A

0.585143s

udf_extendfile_append

Passed

N/A

0.588473s

udf_holywrite

Passed

N/A

0.597988s

udf_overwrite512

Passed

N/A

0.598149s

udf_overwrite64k

Passed

N/A

0.578679s

udf_overwrite_trunc

Passed

N/A

0.578112s

udf_read_after_unlink

Passed

N/A

0.856628s

udf_read_fault

Passed

N/A

0.588588s

udf_shrinkfile

Passed

N/A

0.568183s

udf_wrrd_after_unlink

Passed

N/A

0.577903s

v7fs_extendfile

Passed

N/A

0.323199s

v7fs_extendfile_append

Passed

N/A

0.318265s

v7fs_holywrite

Passed

N/A

0.341220s

v7fs_overwrite512

Passed

N/A

0.332733s

v7fs_overwrite64k

Passed

N/A

0.380120s

v7fs_overwrite_trunc

Passed

N/A

0.400035s

v7fs_read_after_unlink

Passed

N/A

0.339523s

v7fs_read_fault

Passed

N/A

0.348075s

v7fs_shrinkfile

Passed

N/A

0.327251s

v7fs_wrrd_after_unlink

Passed

N/A

0.638897s

fs/vfs/t_renamerace

116.436940s

ext2fs_renamerace

Passed

N/A

5.330817s

ext2fs_renamerace_dirs

Passed

N/A

5.345095s

ffs_renamerace

Passed

N/A

5.338695s

ffs_renamerace_dirs

Passed

N/A

5.358166s

ffslog_renamerace

Passed

N/A

5.367429s

ffslog_renamerace_dirs

Passed

N/A

5.370059s

lfs_renamerace

Passed

N/A

5.777427s

lfs_renamerace_dirs

Passed

N/A

5.808595s

msdosfs_renamerace

Expected failure

PR kern/43626: unmount failed: Device busy

5.309992s

msdosfs_renamerace_dirs

Expected signal

PR kern/43626

0.595976s

nfs_renamerace

Passed

N/A

5.763780s

nfs_renamerace_dirs

Passed

N/A

5.652514s

p2k_ffs_renamerace

Passed

N/A

5.488608s

p2k_ffs_renamerace_dirs

Passed

N/A

5.456417s

puffs_renamerace

Passed

N/A

5.367122s

puffs_renamerace_dirs

Passed

N/A

5.539761s

rumpfs_renamerace

Skipped

rename not supported by file system

0.291213s

rumpfs_renamerace_dirs

Skipped

rename not supported by file system

0.271364s

sysvbfs_renamerace

Skipped

filesystem has not enough inodes

0.289628s

sysvbfs_renamerace_dirs

Skipped

directories not supported by file system

0.295008s

tmpfs_renamerace

Passed

N/A

5.281467s

tmpfs_renamerace_dirs

Passed

N/A

5.306920s

udf_renamerace

Expected failure

PR kern/49046: race did not trigger this time

5.342360s

udf_renamerace_dirs

Passed

N/A

5.606028s

v7fs_renamerace

Passed

N/A

5.383668s

v7fs_renamerace_dirs

Passed

N/A

5.356163s

fs/vfs/t_ro

29.259131s

ext2fs_attrs

Passed

N/A

0.329981s

ext2fs_create

Passed

N/A

0.319342s

ext2fs_createdir

Passed

N/A

0.315346s

ext2fs_createfifo

Passed

N/A

0.329448s

ext2fs_createlink

Passed

N/A

0.333526s

ext2fs_createsymlink

Passed

N/A

0.301920s

ext2fs_fileio

Passed

N/A

0.312928s

ext2fs_rmfile

Passed

N/A

0.311286s

ffs_attrs

Passed

N/A

0.337680s

ffs_create

Passed

N/A

0.309880s

ffs_createdir

Passed

N/A

0.318110s

ffs_createfifo

Passed

N/A

0.310292s

ffs_createlink

Passed

N/A

0.311670s

ffs_createsymlink

Passed

N/A

0.310761s

ffs_fileio

Passed

N/A

0.317459s

ffs_rmfile

Passed

N/A

0.332756s

ffslog_attrs

Passed

N/A

0.325378s

ffslog_create

Passed

N/A

0.334435s

ffslog_createdir

Passed

N/A

0.319012s

ffslog_createfifo

Passed

N/A

0.335878s

ffslog_createlink

Passed

N/A

0.350514s

ffslog_createsymlink

Passed

N/A

0.318109s

ffslog_fileio

Passed

N/A

0.323767s

ffslog_rmfile

Passed

N/A

0.332559s

msdosfs_attrs

Passed

N/A

0.315752s

msdosfs_create

Passed

N/A

0.313441s

msdosfs_createdir

Passed

N/A

0.308438s

msdosfs_createfifo

Passed

N/A

0.322654s

msdosfs_createlink

Passed

N/A

0.326281s

msdosfs_createsymlink

Passed

N/A

0.300914s

msdosfs_fileio

Passed

N/A

0.304277s

msdosfs_rmfile

Passed

N/A

0.301406s

nfs_attrs

Passed

N/A

0.639099s

nfs_create

Passed

N/A

0.635467s

nfs_createdir

Passed

N/A

0.641709s

nfs_createfifo

Passed

N/A

0.630102s

nfs_createlink

Passed

N/A

0.629224s

nfs_createsymlink

Passed

N/A

0.618063s

nfs_fileio

Passed

N/A

0.638850s

nfs_rmfile

Passed

N/A

0.643469s

nfsro_attrs

Passed

N/A

0.675985s

nfsro_create

Passed

N/A

0.627023s

nfsro_createdir

Passed

N/A

0.637822s

nfsro_createfifo

Passed

N/A

0.633294s

nfsro_createlink

Passed

N/A

0.640952s

nfsro_createsymlink

Passed

N/A

0.625414s

nfsro_fileio

Passed

N/A

0.657492s

nfsro_rmfile

Passed

N/A

0.653098s

sysvbfs_attrs

Passed

N/A

0.311628s

sysvbfs_create

Passed

N/A

0.297578s

sysvbfs_createdir

Passed

N/A

0.294180s

sysvbfs_createfifo

Passed

N/A

0.297371s

sysvbfs_createlink

Passed

N/A

0.316771s

sysvbfs_createsymlink

Passed

N/A

0.315191s

sysvbfs_fileio

Passed

N/A

0.307618s

sysvbfs_rmfile

Passed

N/A

0.311886s

udf_attrs

Passed

N/A

0.594511s

udf_create

Passed

N/A

0.328920s

udf_createdir

Passed

N/A

0.312691s

udf_createfifo

Passed

N/A

0.303527s

udf_createlink

Passed

N/A

0.586778s

udf_createsymlink

Passed

N/A

0.337826s

udf_fileio

Passed

N/A

0.588997s

udf_rmfile

Passed

N/A

0.577978s

v7fs_attrs

Passed

N/A

0.319377s

v7fs_create

Passed

N/A

0.318961s

v7fs_createdir

Passed

N/A

0.315211s

v7fs_createfifo

Passed

N/A

0.309033s

v7fs_createlink

Passed

N/A

0.313321s

v7fs_createsymlink

Passed

N/A

0.321177s

v7fs_fileio

Passed

N/A

0.327109s

v7fs_rmfile

Passed

N/A

0.320009s

fs/vfs/t_rmdirrace

125.176000s

ext2fs_race

Passed

N/A

10.310372s

ffs_race

Passed

N/A

10.326727s

ffslog_race

Passed

N/A

10.358971s

lfs_race

Passed

N/A

10.505532s

msdosfs_race

Passed

N/A

10.301823s

nfs_race

Passed

N/A

10.682254s

p2k_ffs_race

Passed

N/A

10.446422s

puffs_race

Passed

N/A

10.358187s

rumpfs_race

Passed

N/A

10.279181s

sysvbfs_race

Skipped

directories not supported by file system

0.287801s

tmpfs_race

Passed

N/A

10.301385s

udf_race

Passed

N/A

10.649625s

v7fs_race

Passed

N/A

10.329247s

fs/vfs/t_union

9.552043s

ext2fs_basic

Skipped

fs does not support VOP_WHITEOUT

0.325252s

ext2fs_whiteout

Skipped

fs does not support VOP_WHITEOUT

0.356795s

ffs_basic

Passed

N/A

0.327168s

ffs_whiteout

Passed

N/A

0.363597s

ffslog_basic

Passed

N/A

0.321260s

ffslog_whiteout

Passed

N/A

0.360108s

lfs_basic

Passed

N/A

0.399754s

lfs_whiteout

Passed

N/A

0.439307s

msdosfs_basic

Skipped

fs does not support VOP_WHITEOUT

0.312522s

msdosfs_whiteout

Skipped

fs does not support VOP_WHITEOUT

0.362882s

nfs_basic

Skipped

fs does not support VOP_WHITEOUT

0.622989s

nfs_whiteout

Skipped

fs does not support VOP_WHITEOUT

0.684925s

p2k_ffs_basic

Skipped

fs does not support VOP_WHITEOUT

0.403651s

p2k_ffs_whiteout

Skipped

fs does not support VOP_WHITEOUT

0.444634s

puffs_basic

Skipped

fs does not support VOP_WHITEOUT

0.299055s

puffs_whiteout

Skipped

fs does not support VOP_WHITEOUT

0.330938s

rumpfs_basic

Passed

N/A

0.272636s

rumpfs_whiteout

Passed

N/A

0.314880s

sysvbfs_basic

Skipped

fs does not support VOP_WHITEOUT

0.295628s

sysvbfs_whiteout

Skipped

fs does not support VOP_WHITEOUT

0.327137s

tmpfs_basic

Passed

N/A

0.281751s

tmpfs_whiteout

Passed

N/A

0.324759s

udf_basic

Skipped

fs does not support VOP_WHITEOUT

0.303425s

udf_whiteout

Skipped

fs does not support VOP_WHITEOUT

0.335300s

v7fs_basic

Skipped

fs does not support VOP_WHITEOUT

0.305434s

v7fs_whiteout

Skipped

fs does not support VOP_WHITEOUT

0.353553s

fs/vfs/t_unpriv

19.225107s

ext2fs_dirperms

Passed

N/A

0.306290s

ext2fs_flags

Passed

N/A

0.330218s

ext2fs_owner

Passed

N/A

0.320747s

ext2fs_times

Passed

N/A

0.300603s

ffs_dirperms

Passed

N/A

0.317469s

ffs_flags

Passed

N/A

0.308122s

ffs_owner

Passed

N/A

0.316425s

ffs_times

Passed

N/A

0.311390s

ffslog_dirperms

Passed

N/A

0.314942s

ffslog_flags

Passed

N/A

0.322400s

ffslog_owner

Passed

N/A

0.313444s

ffslog_times

Passed

N/A

0.317438s

lfs_dirperms

Passed

N/A

0.400967s

lfs_flags

Passed

N/A

0.407022s

lfs_owner

Passed

N/A

0.416269s

lfs_times

Passed

N/A

0.421074s

msdosfs_dirperms

Passed

N/A

0.324839s

msdosfs_flags

Passed

N/A

0.324186s

msdosfs_owner

Skipped

owner not supported by file system

0.309752s

msdosfs_times

Passed

N/A

0.302477s

nfs_dirperms

Passed

N/A

0.649509s

nfs_flags

Skipped

file flags not supported by file system

0.631158s

nfs_owner

Passed

N/A

0.636800s

nfs_times

Passed

N/A

0.643535s

p2k_ffs_dirperms

Passed

N/A

0.454787s

p2k_ffs_flags

Passed

N/A

0.498284s

p2k_ffs_owner

Passed

N/A

0.447859s

p2k_ffs_times

Passed

N/A

0.497920s

puffs_dirperms

Passed

N/A

0.358237s

puffs_flags

Skipped

file flags not supported by file system

0.295983s

puffs_owner

Passed

N/A

0.342475s

puffs_times

Passed

N/A

0.348898s

rumpfs_dirperms

Passed

N/A

0.272396s

rumpfs_flags

Passed

N/A

0.292156s

rumpfs_owner

Passed

N/A

0.284618s

rumpfs_times

Passed

N/A

0.283791s

sysvbfs_dirperms

Skipped

directories not supported by file system

0.292857s

sysvbfs_flags

Skipped

file flags not supported by file system

0.307966s

sysvbfs_owner

Passed

N/A

0.292018s

sysvbfs_times

Passed

N/A

0.322818s

tmpfs_dirperms

Passed

N/A

0.286805s

tmpfs_flags

Passed

N/A

0.280474s

tmpfs_owner

Passed

N/A

0.282966s

tmpfs_times

Passed

N/A

0.280383s

udf_dirperms

Passed

N/A

0.560286s

udf_flags

Skipped

file flags not supported by file system

0.333339s

udf_owner

Passed

N/A

0.321765s

udf_times

Passed

N/A

0.591116s

v7fs_dirperms

Passed

N/A

0.325316s

v7fs_flags

Passed

N/A

0.316155s

v7fs_owner

Passed

N/A

0.333521s

v7fs_times

Passed

N/A

0.343535s

fs/vfs/t_vfsops

28.176801s

ext2fs_tfhinval

Passed

N/A

0.325506s

ext2fs_tfhremove

Passed

N/A

0.319531s

ext2fs_tfilehandle

Passed

N/A

0.315674s

ext2fs_tmount

Passed

N/A

0.305653s

ext2fs_tstatvfs

Passed

N/A

0.332109s

ext2fs_tsync

Passed

N/A

0.305446s

ffs_tfhinval

Passed

N/A

0.335728s

ffs_tfhremove

Passed

N/A

0.344792s

ffs_tfilehandle

Passed

N/A

0.314305s

ffs_tmount

Passed

N/A

0.330854s

ffs_tstatvfs

Passed

N/A

0.330384s

ffs_tsync

Passed

N/A

0.305758s

ffslog_tfhinval

Passed

N/A

0.331488s

ffslog_tfhremove

Passed

N/A

0.345907s

ffslog_tfilehandle

Passed

N/A

0.334771s

ffslog_tmount

Passed

N/A

0.344460s

ffslog_tstatvfs

Passed

N/A

0.322349s

ffslog_tsync

Passed

N/A

0.332289s

lfs_tfhinval

Passed

N/A

0.408526s

lfs_tfhremove

Expected failure

fhopen() for removed file succeeds (PR kern/43745): /usr/src/tests/fs/vfs/t_vfsops.c:152: Expected true value in rump_sys_fhopen(fhp, fhsize, O_RDONLY) == -1

0.417455s

lfs_tfilehandle

Passed

N/A

0.420745s

lfs_tmount

Passed

N/A

0.419451s

lfs_tstatvfs

Passed

N/A

0.395774s

lfs_tsync

Passed

N/A

0.396906s

msdosfs_tfhinval

Passed

N/A

0.298266s

msdosfs_tfhremove

Passed

N/A

0.298445s

msdosfs_tfilehandle

Passed

N/A

0.311523s

msdosfs_tmount

Passed

N/A

0.296732s

msdosfs_tstatvfs

Passed

N/A

0.304201s

msdosfs_tsync

Passed

N/A

0.303309s

nfs_tfhinval

Passed

N/A

0.633037s

nfs_tfhremove

Passed

N/A

0.631935s

nfs_tfilehandle

Passed

N/A

0.638848s

nfs_tmount

Passed

N/A

0.629057s

nfs_tstatvfs

Passed

N/A

0.632614s

nfs_tsync

Passed

N/A

0.627985s

p2k_ffs_tfhinval

Passed

N/A

0.482482s

p2k_ffs_tfhremove

Passed

N/A

0.467824s

p2k_ffs_tfilehandle

Passed

N/A

0.447855s

p2k_ffs_tmount

Passed

N/A

0.468487s

p2k_ffs_tstatvfs

Passed

N/A

0.448248s

p2k_ffs_tsync

Passed

N/A

0.457772s

puffs_tfhinval

Passed

N/A

0.357361s

puffs_tfhremove

Passed

N/A

0.349828s

puffs_tfilehandle

Passed

N/A

0.369638s

puffs_tmount

Passed

N/A

0.369614s

puffs_tstatvfs

Passed

N/A

0.358380s

puffs_tsync

Passed

N/A

0.359840s

rumpfs_tfhinval

Skipped

file handles not supported

0.293683s

rumpfs_tfhremove

Skipped

file handles not supported

0.284015s

rumpfs_tfilehandle

Skipped

file handles not supported

0.294823s

rumpfs_tmount

Passed

N/A

0.285432s

rumpfs_tstatvfs

Passed

N/A

0.301227s

rumpfs_tsync

Passed

N/A

0.289039s

sysvbfs_tfhinval

Skipped

file handles not supported

0.303481s

sysvbfs_tfhremove

Skipped

file handles not supported

0.302976s

sysvbfs_tfilehandle

Skipped

file handles not supported

0.321264s

sysvbfs_tmount

Passed

N/A

0.314368s

sysvbfs_tstatvfs

Passed

N/A

0.311010s

sysvbfs_tsync

Passed

N/A

0.317397s

tmpfs_tfhinval

Passed

N/A

0.277069s

tmpfs_tfhremove

Passed

N/A

0.285143s

tmpfs_tfilehandle

Passed

N/A

0.276430s

tmpfs_tmount

Passed

N/A

0.273803s

tmpfs_tstatvfs

Passed

N/A

0.279392s

tmpfs_tsync

Passed

N/A

0.276351s

udf_tfhinval

Skipped

file handles not supported

0.305573s

udf_tfhremove

Skipped

file handles not supported

0.303402s

udf_tfilehandle

Skipped

file handles not supported

0.304560s

udf_tmount

Passed

N/A

0.329613s

udf_tstatvfs

Passed

N/A

0.329208s

udf_tsync

Passed

N/A

0.326127s

v7fs_tfhinval

Skipped

file handles not supported

0.337738s

v7fs_tfhremove

Skipped

file handles not supported

0.329768s

v7fs_tfilehandle

Skipped

file handles not supported

0.324856s

v7fs_tmount

Passed

N/A

0.310174s

v7fs_tstatvfs

Passed

N/A

0.307316s

v7fs_tsync

Passed

N/A

0.313888s

fs/vfs/t_vnops

458.633132s

ext2fs_access_simple

Passed

N/A

0.338298s

ext2fs_attrs

Passed

N/A

0.344068s

ext2fs_create_exist

Passed

N/A

0.351008s

ext2fs_create_many

Passed

N/A

2.711295s

ext2fs_create_nametoolong

Passed

N/A

0.325647s

ext2fs_create_nonalphanum

Passed

N/A

0.479089s

ext2fs_dir_notempty

Passed

N/A

0.338241s

ext2fs_dir_rmdirdotdot

Passed

N/A

0.352649s

ext2fs_dir_simple

Passed

N/A

0.327119s

ext2fs_fcntl_getlock_pids

Passed

N/A

0.334975s

ext2fs_fcntl_lock

Passed

N/A

0.327532s

ext2fs_lookup_complex

Passed

N/A

0.324937s

ext2fs_lookup_simple

Passed

N/A

0.332011s

ext2fs_lstat_symlink

Passed

N/A

0.343761s

ext2fs_read_directory

Passed

N/A

0.356233s

ext2fs_rename_dir

Passed

N/A

0.357234s

ext2fs_rename_dotdot

Passed

N/A

0.348408s

ext2fs_rename_nametoolong

Passed

N/A

0.324606s

ext2fs_rename_reg_nodir

Passed

N/A

0.335329s

ext2fs_symlink_long

Passed

N/A

0.346211s

ext2fs_symlink_root

Passed

N/A

0.336597s

ext2fs_symlink_zerolen

Passed

N/A

0.343434s

ffs_access_simple

Passed

N/A

0.334524s

ffs_attrs

Passed

N/A

0.351830s

ffs_create_exist

Passed

N/A

0.360966s

ffs_create_many

Passed

N/A

1.542814s

ffs_create_nametoolong

Passed

N/A

0.349906s

ffs_create_nonalphanum

Passed

N/A

0.507194s

ffs_dir_notempty

Passed

N/A

0.359543s

ffs_dir_rmdirdotdot

Passed

N/A

0.363845s

ffs_dir_simple

Passed

N/A

0.340587s

ffs_fcntl_getlock_pids

Passed

N/A

0.350843s

ffs_fcntl_lock

Passed

N/A

0.369475s

ffs_lookup_complex

Passed

N/A

0.363286s

ffs_lookup_simple

Passed

N/A

0.359628s

ffs_lstat_symlink

Passed

N/A

0.343799s

ffs_read_directory

Passed

N/A

0.337607s

ffs_rename_dir

Passed

N/A

0.350845s

ffs_rename_dotdot

Passed

N/A

0.342713s

ffs_rename_nametoolong

Passed

N/A

0.339231s

ffs_rename_reg_nodir

Passed

N/A

0.340669s

ffs_symlink_long

Passed

N/A

0.371493s

ffs_symlink_root

Passed

N/A

0.337003s

ffs_symlink_zerolen

Passed

N/A

0.365517s

ffslog_access_simple

Passed

N/A

0.374478s

ffslog_attrs

Passed

N/A

0.370959s

ffslog_create_exist

Passed

N/A

0.371688s

ffslog_create_many

Passed

N/A

1.286808s

ffslog_create_nametoolong

Passed

N/A

0.344946s

ffslog_create_nonalphanum

Passed

N/A

0.478080s

ffslog_dir_notempty

Passed

N/A

0.349412s

ffslog_dir_rmdirdotdot

Passed

N/A

0.345901s

ffslog_dir_simple

Passed

N/A

0.363257s

ffslog_fcntl_getlock_pids

Passed

N/A

0.361411s

ffslog_fcntl_lock

Passed

N/A

0.360646s

ffslog_lookup_complex

Passed

N/A

0.371728s

ffslog_lookup_simple

Passed

N/A

0.348501s

ffslog_lstat_symlink

Passed

N/A

0.341889s

ffslog_read_directory

Passed

N/A

0.342783s

ffslog_rename_dir

Passed

N/A

0.353936s

ffslog_rename_dotdot

Passed

N/A

0.352564s

ffslog_rename_nametoolong

Passed

N/A

0.368786s

ffslog_rename_reg_nodir

Passed

N/A

0.345010s

ffslog_symlink_long

Passed

N/A

0.354668s

ffslog_symlink_root

Passed

N/A

0.369352s

ffslog_symlink_zerolen

Passed

N/A

0.358689s

lfs_access_simple

Passed

N/A

0.429924s

lfs_attrs

Passed

N/A

0.426057s

lfs_create_exist

Passed

N/A

0.444279s

lfs_create_many

Failed

Test case timed out after 300 seconds

300.019188s

lfs_create_nametoolong

Passed

N/A

0.427858s

lfs_create_nonalphanum

Passed

N/A

1.495625s

lfs_dir_notempty

Passed

N/A

0.424730s

lfs_dir_rmdirdotdot

Passed

N/A

0.436950s

lfs_dir_simple

Passed

N/A

0.430410s

lfs_fcntl_getlock_pids

Passed

N/A

0.415306s

lfs_fcntl_lock

Passed

N/A

0.427706s

lfs_lookup_complex

Passed

N/A

0.428351s

lfs_lookup_simple

Passed

N/A

0.437482s

lfs_lstat_symlink

Passed

N/A

0.427253s

lfs_read_directory

Passed

N/A

0.424549s

lfs_rename_dir

Passed

N/A

0.439617s

lfs_rename_dotdot

Passed

N/A

0.442435s

lfs_rename_nametoolong

Passed

N/A

0.445146s

lfs_rename_reg_nodir

Passed

N/A

0.419622s

lfs_symlink_long

Passed

N/A

0.439579s

lfs_symlink_root

Passed

N/A

0.447714s

lfs_symlink_zerolen

Passed

N/A

0.443264s

msdosfs_access_simple

Passed

N/A

0.345759s

msdosfs_attrs

Passed

N/A

0.322033s

msdosfs_create_exist

Passed

N/A

0.323966s

msdosfs_create_many

Passed

N/A

7.916664s

msdosfs_create_nametoolong

Passed

N/A

0.340237s

msdosfs_create_nonalphanum

Passed

N/A

0.427194s

msdosfs_dir_notempty

Passed

N/A

0.350592s

msdosfs_dir_rmdirdotdot

Passed

N/A

0.350049s

msdosfs_dir_simple

Passed

N/A

0.338623s

msdosfs_fcntl_getlock_pids

Passed

N/A

0.354388s

msdosfs_fcntl_lock

Passed

N/A

0.352159s

msdosfs_lookup_complex

Passed

N/A

0.325056s

msdosfs_lookup_simple

Passed

N/A

0.350741s

msdosfs_lstat_symlink

Skipped

symlinks not supported by file system

0.321942s

msdosfs_read_directory

Passed

N/A

0.342849s

msdosfs_rename_dir

Passed

N/A

0.354630s

msdosfs_rename_dotdot

Passed

N/A

0.347451s

msdosfs_rename_nametoolong

Passed

N/A

0.337285s

msdosfs_rename_reg_nodir

Passed

N/A

0.349599s

msdosfs_symlink_long

Skipped

symlinks not supported by file system

0.325644s

msdosfs_symlink_root

Skipped

symlinks not supported by file system

0.328804s

msdosfs_symlink_zerolen

Skipped

symlinks not supported by file system

0.345461s

nfs_access_simple

Passed

N/A

0.651067s

nfs_attrs

Passed

N/A

0.646678s

nfs_create_exist

Passed

N/A

0.656502s

nfs_create_many

Passed

N/A

7.323322s

nfs_create_nametoolong

Passed

N/A

0.653898s

nfs_create_nonalphanum

Passed

N/A

1.367830s

nfs_dir_notempty

Passed

N/A

0.656559s

nfs_dir_rmdirdotdot

Passed

N/A

0.661051s

nfs_dir_simple

Passed

N/A

0.670347s

nfs_fcntl_getlock_pids

Passed

N/A

0.650682s

nfs_fcntl_lock

Passed

N/A

0.667505s

nfs_lookup_complex

Passed

N/A

0.652832s

nfs_lookup_simple

Passed

N/A

0.658700s

nfs_lstat_symlink

Passed

N/A

0.662093s

nfs_read_directory

Passed

N/A

0.644648s

nfs_rename_dir

Passed

N/A

0.689782s

nfs_rename_dotdot

Passed

N/A

0.651237s

nfs_rename_nametoolong

Passed

N/A

0.667421s

nfs_rename_reg_nodir

Passed

N/A

0.670867s

nfs_symlink_long

Passed

N/A

0.727663s

nfs_symlink_root

Passed

N/A

0.664660s

nfs_symlink_zerolen

Passed

N/A

0.665706s

p2k_ffs_access_simple

Passed

N/A

0.493328s

p2k_ffs_attrs

Passed

N/A

0.468323s

p2k_ffs_create_exist

Passed

N/A

0.487852s

p2k_ffs_create_many

Passed

N/A

5.959452s

p2k_ffs_create_nametoolong

Passed

N/A

0.483278s

p2k_ffs_create_nonalphanum

Passed

N/A

1.058011s

p2k_ffs_dir_notempty

Passed

N/A

0.514510s

p2k_ffs_dir_rmdirdotdot

Passed

N/A

0.478046s

p2k_ffs_dir_simple

Passed

N/A

0.478237s

p2k_ffs_fcntl_getlock_pids

Passed

N/A

0.487914s

p2k_ffs_fcntl_lock

Passed

N/A

0.488159s

p2k_ffs_lookup_complex

Passed

N/A

0.467900s

p2k_ffs_lookup_simple

Passed

N/A

0.498072s

p2k_ffs_lstat_symlink

Passed

N/A

0.488578s

p2k_ffs_read_directory

Passed

N/A

0.488216s

p2k_ffs_rename_dir

Passed

N/A

0.517776s

p2k_ffs_rename_dotdot

Passed

N/A

0.477819s

p2k_ffs_rename_nametoolong

Passed

N/A

0.488699s

p2k_ffs_rename_reg_nodir

Passed

N/A

0.518183s

p2k_ffs_symlink_long

Passed

N/A

0.548234s

p2k_ffs_symlink_root

Passed

N/A

0.467921s

p2k_ffs_symlink_zerolen

Passed

N/A

0.478065s

puffs_access_simple

Passed

N/A

0.387698s

puffs_attrs

Passed

N/A

0.389151s

puffs_create_exist

Passed

N/A

0.379576s

puffs_create_many

Passed

N/A

4.300803s

puffs_create_nametoolong

Passed

N/A

0.367504s

puffs_create_nonalphanum

Passed

N/A

0.709797s

puffs_dir_notempty

Passed

N/A

0.369269s

puffs_dir_rmdirdotdot

Passed

N/A

0.379308s

puffs_dir_simple

Passed

N/A

0.359090s

puffs_fcntl_getlock_pids

Passed

N/A

0.390105s

puffs_fcntl_lock

Passed

N/A

0.378777s

puffs_lookup_complex

Passed

N/A

0.369253s

puffs_lookup_simple

Passed

N/A

0.369622s

puffs_lstat_symlink

Passed

N/A

0.368004s

puffs_read_directory

Passed

N/A

0.380784s

puffs_rename_dir

Passed

N/A

0.419273s

puffs_rename_dotdot

Passed

N/A

0.389615s

puffs_rename_nametoolong

Passed

N/A

0.389096s

puffs_rename_reg_nodir

Passed

N/A

0.389631s

puffs_symlink_long

Passed

N/A

0.439223s

puffs_symlink_root

Passed

N/A

0.389631s

puffs_symlink_zerolen

Passed

N/A

0.379417s

rumpfs_access_simple

Passed

N/A

0.321846s

rumpfs_attrs

Passed

N/A

0.320164s

rumpfs_create_exist

Passed

N/A

0.304616s

rumpfs_create_many

Passed

N/A

1.407931s

rumpfs_create_nametoolong

Passed

N/A

0.320627s

rumpfs_create_nonalphanum

Passed

N/A

0.342026s

rumpfs_dir_notempty

Passed

N/A

0.308022s

rumpfs_dir_rmdirdotdot

Passed

N/A

0.295652s

rumpfs_dir_simple

Passed

N/A

0.299280s

rumpfs_fcntl_getlock_pids

Passed

N/A

0.302611s

rumpfs_fcntl_lock

Passed

N/A

0.321486s

rumpfs_lookup_complex

Passed

N/A

0.299702s

rumpfs_lookup_simple

Passed

N/A

0.309626s

rumpfs_lstat_symlink

Passed

N/A

0.297450s

rumpfs_read_directory

Passed

N/A

0.299726s

rumpfs_rename_dir

Skipped

rename not supported by file system

0.294739s

rumpfs_rename_dotdot

Skipped

rename not supported by file system

0.298175s

rumpfs_rename_nametoolong

Skipped

rename not supported by file system

0.299523s

rumpfs_rename_reg_nodir

Skipped

rename not supported by file system

0.305283s

rumpfs_symlink_long

Passed

N/A

0.305527s

rumpfs_symlink_root

Passed

N/A

0.306755s

rumpfs_symlink_zerolen

Passed

N/A

0.303084s

sysvbfs_access_simple

Passed

N/A

0.321629s

sysvbfs_attrs

Passed

N/A

0.318310s

sysvbfs_create_exist

Passed

N/A

0.318632s

sysvbfs_create_many

Passed

N/A

0.322573s

sysvbfs_create_nametoolong

Passed

N/A

0.336310s

sysvbfs_create_nonalphanum

Passed

N/A

0.333974s

sysvbfs_dir_notempty

Skipped

directories not supported by file system

0.315706s

sysvbfs_dir_rmdirdotdot

Skipped

directories not supported by file system

0.318222s

sysvbfs_dir_simple

Skipped

directories not supported by file system

0.312584s

sysvbfs_fcntl_getlock_pids

Passed

N/A

0.327430s

sysvbfs_fcntl_lock

Passed

N/A

0.334255s

sysvbfs_lookup_complex

Skipped

directories not supported by file system

0.319790s

sysvbfs_lookup_simple

Passed

N/A

0.316868s

sysvbfs_lstat_symlink

Skipped

symlinks not supported by file system

0.326803s

sysvbfs_read_directory

Passed

N/A

0.347617s

sysvbfs_rename_dir

Skipped

directories not supported by file system

0.330918s

sysvbfs_rename_dotdot

Skipped

directories not supported by file system

0.327441s

sysvbfs_rename_nametoolong

Passed

N/A

0.335620s

sysvbfs_rename_reg_nodir

Passed

N/A

0.349165s

sysvbfs_symlink_long

Skipped

symlinks not supported by file system

0.336671s

sysvbfs_symlink_root

Skipped

symlinks not supported by file system

0.329167s

sysvbfs_symlink_zerolen

Skipped

symlinks not supported by file system

0.321130s

tmpfs_access_simple

Passed

N/A

0.322702s

tmpfs_attrs

Passed

N/A

0.307697s

tmpfs_create_exist

Passed

N/A

0.300616s

tmpfs_create_many

Passed

N/A

1.069046s

tmpfs_create_nametoolong

Passed

N/A

0.328895s

tmpfs_create_nonalphanum

Passed

N/A

0.363023s

tmpfs_dir_notempty

Passed

N/A

0.305099s

tmpfs_dir_rmdirdotdot

Passed

N/A

0.329710s

tmpfs_dir_simple

Passed

N/A

0.327333s

tmpfs_fcntl_getlock_pids

Passed

N/A

0.330960s

tmpfs_fcntl_lock

Passed

N/A

0.330398s

tmpfs_lookup_complex

Passed

N/A

0.322699s

tmpfs_lookup_simple

Passed

N/A

0.307658s

tmpfs_lstat_symlink

Passed

N/A

0.310208s

tmpfs_read_directory

Passed

N/A

0.314049s

tmpfs_rename_dir

Passed

N/A

0.331314s

tmpfs_rename_dotdot

Passed

N/A

0.326149s

tmpfs_rename_nametoolong

Passed

N/A

0.309020s

tmpfs_rename_reg_nodir

Passed

N/A

0.331933s

tmpfs_symlink_long

Passed

N/A

0.337970s

tmpfs_symlink_root

Passed

N/A

0.301109s

tmpfs_symlink_zerolen

Passed

N/A

0.313361s

udf_access_simple

Passed

N/A

0.616893s

udf_attrs

Passed

N/A

0.577210s

udf_create_exist

Passed

N/A

0.588088s

udf_create_many

Passed

N/A

1.843176s

udf_create_nametoolong

Passed

N/A

0.335962s

udf_create_nonalphanum

Passed

N/A

0.705991s

udf_dir_notempty

Passed

N/A

0.607481s

udf_dir_rmdirdotdot

Passed

N/A

0.598572s

udf_dir_simple

Passed

N/A

0.588691s

udf_fcntl_getlock_pids

Passed

N/A

0.618963s

udf_fcntl_lock

Passed

N/A

0.349024s

udf_lookup_complex

Passed

N/A

0.607664s

udf_lookup_simple

Passed

N/A

0.351625s

udf_lstat_symlink

Passed

N/A

0.605248s

udf_read_directory

Passed

N/A

0.351077s

udf_rename_dir

Passed

N/A

0.615773s

udf_rename_dotdot

Passed

N/A

0.608363s

udf_rename_nametoolong

Passed

N/A

0.588134s

udf_rename_reg_nodir

Passed

N/A

0.350560s

udf_symlink_long

Passed

N/A

0.605957s

udf_symlink_root

Passed

N/A

0.589455s

udf_symlink_zerolen

Passed

N/A

0.587512s

v7fs_access_simple

Passed

N/A

0.335013s

v7fs_attrs

Passed

N/A

0.331897s

v7fs_create_exist

Passed

N/A

0.334648s

v7fs_create_many

Passed

N/A

9.218381s

v7fs_create_nametoolong

Passed

N/A

0.340098s

v7fs_create_nonalphanum

Passed

N/A

0.659448s

v7fs_dir_notempty

Passed

N/A

0.360314s

v7fs_dir_rmdirdotdot

Passed

N/A

0.353858s

v7fs_dir_simple

Passed

N/A

0.349672s

v7fs_fcntl_getlock_pids

Passed

N/A

0.337807s

v7fs_fcntl_lock

Passed

N/A

0.337771s

v7fs_lookup_complex

Passed

N/A

0.346075s

v7fs_lookup_simple

Passed

N/A

0.331416s

v7fs_lstat_symlink

Passed

N/A

0.334187s

v7fs_read_directory

Passed

N/A

0.338471s

v7fs_rename_dir

Passed

N/A

0.358883s

v7fs_rename_dotdot

Passed

N/A

0.338672s

v7fs_rename_nametoolong

Passed

N/A

0.335568s

v7fs_rename_reg_nodir

Passed

N/A

0.344863s

v7fs_symlink_long

Passed

N/A

0.371567s

v7fs_symlink_root

Passed

N/A

0.368197s

v7fs_symlink_zerolen

Passed

N/A

0.355231s

fs/cd9660/t_high_ino_big_file

0.307879s

pr_kern_48787

Skipped

not enough free disk space, have 1048344 Kbytes, need ~ 4500000 Kbytes

0.306963s

rump/rumpkern/t_copy

0.196709s

copy_efault

Passed

N/A

0.019008s

copyinstr

Passed

N/A

0.059936s

copyoutstr

Passed

N/A

0.057256s

copystr

Passed

N/A

0.057176s

rump/rumpkern/t_kern

0.549380s

lockme_DESTROYHELD

Passed

N/A

0.090502s

lockme_DOUBLEFREE

Passed

N/A

0.093058s

lockme_DOUBLEINIT

Skipped

test requires LOCKDEBUG kernel

0.020603s

lockme_MEMFREE

Skipped

test requires LOCKDEBUG kernel

0.020593s

lockme_MTX

Passed

N/A

0.088458s

lockme_RWDOUBLEX

Passed

N/A

0.084908s

lockme_RWRX

Skipped

test requires LOCKDEBUG kernel

0.021859s

lockme_RWXR

Passed

N/A

0.098039s

rump/rumpkern/t_lwproc

0.543024s

inherit

Passed

N/A

0.064347s

lwps

Passed

N/A

0.069079s

makelwp

Passed

N/A

0.064175s

nolwp

Passed

N/A

0.059455s

nolwprelease

Passed

N/A

0.089658s

nullswitch

Passed

N/A

0.063551s

proccreds

Passed

N/A

0.060083s

rfork

Passed

N/A

0.061435s

rump/rumpkern/t_modcmd

0.064845s

cmsg_modcmd

Passed

N/A

0.064160s

rump/rumpkern/t_modlinkset

0.069070s

modlinkset

Passed

N/A

0.068280s

rump/rumpkern/t_signals

0.221002s

sigignore

Passed

N/A

0.065088s

sigpanic

Passed

N/A

0.088054s

sigraise

Passed

N/A

0.060638s

rump/rumpkern/t_threads

0.162865s

kthread

Passed

N/A

0.082106s

threadjoin

Passed

N/A

0.079055s

rump/rumpkern/t_tsleep

0.206956s

tsleep

Passed

N/A

0.206002s

rump/rumpkern/t_vm

10.224282s

busypage

Passed

N/A

0.063692s

uvmwait

Passed

N/A

10.159114s

rump/rumpkern/t_sp

26.606146s

basic

Passed

N/A

0.314202s

fork_fakeauth

Passed

N/A

0.325097s

fork_pipecomm

Passed

N/A

0.332521s

fork_simple

Passed

N/A

0.333376s

reconnect

Passed

N/A

2.332830s

signal

Passed

N/A

0.343469s

sigsafe

Passed

N/A

6.306519s

stress_killer

Passed

N/A

6.225138s

stress_long

Passed

N/A

6.194293s

stress_short

Passed

N/A

3.890731s

rump/rumpnet/t_shmif

9.595326s

crossping

Passed

N/A

9.594204s

rump/rumpvfs/t_basic

0.061487s

lseekrv

Passed

N/A

0.060521s

rump/rumpvfs/t_etfs

0.574060s

key

Passed

N/A

0.064592s

large_blk

Passed

N/A

0.209921s

range_blk

Passed

N/A

0.117376s

reregister_blk

Passed

N/A

0.115291s

reregister_reg

Passed

N/A

0.061543s

rump/rumpvfs/t_p2kifs

0.063375s

makecn

Passed

N/A

0.062781s

rump/modautoload/t_modautoload

0.025520s

modautoload

Skipped

host kernel modules not supported

0.024990s

modules/t_modctl

0.675395s

cmd_load

Passed

N/A

0.048725s

cmd_load_props

Passed

N/A

0.100588s

cmd_load_recurse

Passed

N/A

0.156617s

cmd_stat

Passed

N/A

0.101937s

cmd_unload

Passed

N/A

0.264321s

modules/t_builtin

0.335572s

busydisable

Passed

N/A

0.063342s

disable

Passed

N/A

0.067577s

disabledstat

Passed

N/A

0.066411s

forcereload

Passed

N/A

0.067490s

noauto

Passed

N/A

0.066773s

modules/t_abi_uvm

0.421126s

PAGE_SIZE

Passed

N/A

0.420185s

modules/t_modload

2.411132s

bflag

Passed

N/A

0.610654s

iflag

Passed

N/A

0.756067s

plain

Passed

N/A

0.464757s

sflag

Passed

N/A

0.574215s

crypto/libcrypto/t_certs

0.145049s

x509v3

Passed

N/A

0.144139s

crypto/libcrypto/t_ciphers

4.229245s

bf

Passed

N/A

0.152602s

cast

Passed

N/A

3.081513s

des

Passed

N/A

0.146624s

evp

Passed

N/A

0.303218s

idea

Passed

N/A

0.133294s

rc2

Passed

N/A

0.135786s

rc4

Passed

N/A

0.170440s

rc5

Skipped

RC5 support not available; system built with MKCRYPTO_RC5=no

0.098732s

crypto/libcrypto/t_hashes

1.004479s

hmac

Passed

N/A

0.169113s

md2

Passed

N/A

0.142036s

md4

Passed

N/A

0.134944s

md5

Passed

N/A

0.131945s

mdc2

Passed

N/A

0.131171s

ripemd

Passed

N/A

0.135621s

sha

Passed

N/A

0.153694s

crypto/libcrypto/t_libcrypto

8.679827s

bn

Passed

N/A

7.752121s

conf

Passed

N/A

0.154810s

engine

Passed

N/A

0.247445s

lhash

Passed

N/A

0.153885s

rand

Passed

N/A

0.141857s

threads

Passed

N/A

0.225217s

crypto/libcrypto/t_pubkey

25.298827s

dh

Passed

N/A

0.419597s

dsa

Passed

N/A

0.486668s

ec

Passed

N/A

8.670238s

ecdh

Passed

N/A

1.350837s

ecdsa

Passed

N/A

8.958216s

rsa

Passed

N/A

5.122217s

srp

Passed

N/A

0.285824s

crypto/opencrypto/t_opencrypto

5.386930s

aesctr1

Passed

N/A

0.403248s

aesctr2

Passed

N/A

0.377580s

arc4

Skipped

ARC4 not implemented by swcrypto

0.270146s

camellia

Passed

N/A

0.394193s

cbcdes

Passed

N/A

0.377792s

comp

Passed

N/A

0.427662s

comp_deflate

Passed

N/A

0.382505s

comp_zlib_rnd

Passed

N/A

0.392061s

gcm

Passed

N/A

0.378743s

md5

Passed

N/A

0.387003s

md5_hmac

Passed

N/A

0.399660s

null

Passed

N/A

0.380879s

sha1_hmac

Passed

N/A

0.391345s

xcbcmac

Passed

N/A

0.405454s

ipf/t_filter_exec

16.264072s

f1

Passed

N/A

0.489788s

f10

Passed

N/A

1.034965s

f11

Passed

N/A

0.478410s

f12

Passed

N/A

0.446570s

f13

Passed

N/A

0.577984s

f14

Passed

N/A

0.540542s

f15

Passed

N/A

0.174579s

f16

Passed

N/A

0.176343s

f17

Passed

N/A

0.172024s

f18

Passed

N/A

0.177446s

f19

Passed

N/A

0.244440s

f2

Passed

N/A

0.452077s

f20

Passed

N/A

0.173098s

f24

Passed

N/A

0.167147s

f25

Passed

N/A

0.175733s

f26

Expected failure

Known to be broken: results differ

0.437717s

f27

Expected failure

Known to be broken: results differ

0.442638s

f3

Passed

N/A

0.515265s

f30

Passed

N/A

0.330268s

f4

Passed

N/A

0.543795s

f5

Passed

N/A

2.581693s

f6

Passed

N/A

2.516682s

f7

Passed

N/A

0.572582s

f8

Passed

N/A

0.457642s

f9

Passed

N/A

1.032458s

ipv6_1

Passed

N/A

0.228337s

ipv6_2

Passed

N/A

0.317376s

ipv6_3

Passed

N/A

0.217740s

ipv6_5

Passed

N/A

0.277528s

ipv6_6

Passed

N/A

0.268424s

ipf/t_filter_parse

3.894222s

i1

Passed

N/A

0.230063s

i10

Passed

N/A

0.157913s

i11

Passed

N/A

0.153370s

i12

Passed

N/A

0.147084s

i13

Passed

N/A

0.147915s

i14

Passed

N/A

0.155566s

i15

Passed

N/A

0.151729s

i16

Passed

N/A

0.150657s

i17

Expected failure

Known to be broken: atf-check failed; see the output of the test for details

0.173422s

i18

Passed

N/A

0.152145s

i19

Passed

N/A

0.262387s

i2

Passed

N/A

0.152683s

i20

Passed

N/A

0.269535s

i21

Passed

N/A

0.151535s

i22

Passed

N/A

0.155173s

i23

Passed

N/A

0.149911s

i3

Passed

N/A

0.155677s

i4

Passed

N/A

0.155688s

i5

Passed

N/A

0.151573s

i6

Passed

N/A

0.156805s

i7

Passed

N/A

0.151575s

i8

Passed

N/A

0.176796s

i9

Passed

N/A

0.161035s

ipf/t_logging

1.455354s

l1

Passed

N/A

1.453072s

ipf/t_nat_exec

10.801423s

n1

Passed

N/A

0.354101s

n10

Passed

N/A

0.338014s

n100

Passed

N/A

0.225621s

n101

Passed

N/A

0.222054s

n102

Passed

N/A

0.229474s

n103

Passed

N/A

0.224979s

n104

Passed

N/A

0.227327s

n105

Passed

N/A

0.216122s

n106

Passed

N/A

0.216268s

n11

Passed

N/A

0.330082s

n11_6

Passed

N/A

0.331931s

n12

Passed

N/A

0.219855s

n12_6

Passed

N/A

0.220295s

n13

Passed

N/A

0.227101s

n14

Passed

N/A

0.209781s

n15_6

Passed

N/A

0.269003s

n16

Passed

N/A

0.218909s

n17

Passed

N/A

0.203844s

n1_6

Passed

N/A

0.340384s

n2

Passed

N/A

0.397773s

n200

Passed

N/A

0.226942s

n2_6

Passed

N/A

0.569818s

n3

Passed

N/A

0.274464s

n4

Passed

N/A

0.511014s

n4_6

Passed

N/A

0.494379s

n5

Passed

N/A

0.509075s

n5_6

Passed

N/A

0.524636s

n6

Passed

N/A

0.453988s

n6_6

Passed

N/A

0.428354s

n7

Passed

N/A

0.332940s

n7_6

Passed

N/A

0.325268s

n8

Passed

N/A

0.210996s

n8_6

Expected failure

See PR kern/47665: results differ

0.219046s

n9

Passed

N/A

0.217857s

n9_6

Expected failure

See PR kern/47665: results differ

0.221940s

ipf/t_nat_ipf_exec

4.471861s

ni1

Passed

N/A

0.189014s

ni10

Passed

N/A

0.206618s

ni11

Passed

N/A

0.198588s

ni12

Passed

N/A

0.204821s

ni13

Passed

N/A

0.208394s

ni14

Passed

N/A

0.205188s

ni15

Passed

N/A

0.203615s

ni16

Passed

N/A

0.217694s

ni17

Passed

N/A

0.185327s

ni18

Passed

N/A

0.180279s

ni19

Passed

N/A

0.207281s

ni2

Passed

N/A

0.206456s

ni20

Passed

N/A

0.215127s

ni21

Passed

N/A

0.187583s

ni23

Passed

N/A

0.182929s

ni3

Passed

N/A

0.196921s

ni4

Passed

N/A

0.197260s

ni5

Passed

N/A

0.203823s

ni6

Passed

N/A

0.189791s

ni7

Passed

N/A

0.199205s

ni8

Passed

N/A

0.203695s

ni9

Passed

N/A

0.245802s

ipf/t_nat_parse

3.150533s

in1

Passed

N/A

0.223257s

in100

Passed

N/A

0.164706s

in100_6

Passed

N/A

0.145603s

in101

Passed

N/A

0.143475s

in101_6

Passed

N/A

0.147002s

in102

Passed

N/A

0.151367s

in102_6

Passed

N/A

0.155740s

in1_6

Passed

N/A

0.159587s

in2

Passed

N/A

0.163614s

in2_6

Passed

N/A

0.160349s

in3

Passed

N/A

0.146308s

in3_6

Passed

N/A

0.142773s

in4

Passed

N/A

0.146824s

in4_6

Passed

N/A

0.156628s

in5

Passed

N/A

0.156629s

in5_6

Passed

N/A

0.156479s

in6

Passed

N/A

0.151184s

in6_6

Passed

N/A

0.154510s

in7

Passed

N/A

0.148868s

in8_6

Passed

N/A

0.154509s

ipf/t_pools

3.097498s

f28

Passed

N/A

0.192436s

f29

Passed

N/A

0.174179s

ip1

Passed

N/A

0.228664s

ip2

Passed

N/A

0.175286s

ip3

Passed

N/A

0.171548s

p1

Passed

N/A

0.186104s

p10

Passed

N/A

0.177430s

p11

Passed

N/A

0.200245s

p12

Passed

N/A

0.185725s

p13

Passed

N/A

0.174819s

p2

Passed

N/A

0.171691s

p3

Passed

N/A

0.178319s

p4

Passed

N/A

0.169996s

p5

Passed

N/A

0.171731s

p6

Passed

N/A

0.170324s

p7

Passed

N/A

0.166742s

p9

Passed

N/A

0.175681s

share/examples/t_asm

0.371004s

hello

Skipped

Example program not implemented on this platform

0.370088s

share/mk/t_lib

2.691510s

defaults__build_and_install

Passed

N/A

2.684887s

share/mk/t_own

0.614959s

makeconf__missing

Passed

N/A

0.240585s

makeconf__ok

Passed

N/A

0.371538s

share/mk/t_prog

2.303490s

defaults__build_and_install

Passed

N/A

1.350009s

without_man__build_and_install

Passed

N/A

0.944323s

share/mk/t_test

8.355761s

one_c

Passed

N/A

1.209256s

one_cxx

Passed

N/A

6.370585s

one_sh

Passed

N/A

0.765186s

atf/atf-c/detail/dynstr_test

5.493223s

append_ap

Passed

N/A

1.151564s

append_fmt

Passed

N/A

1.142936s

clear

Passed

N/A

0.014560s

copy

Passed

N/A

0.013673s

cstring

Passed

N/A

0.013300s

equal_cstring

Passed

N/A

0.013460s

equal_dynstr

Passed

N/A

0.013687s

fini_disown

Passed

N/A

0.013319s

init

Passed

N/A

0.013440s

init_ap

Passed

N/A

0.013268s

init_fmt

Passed

N/A

0.013438s

init_raw

Passed

N/A

0.013500s

init_rep

Passed

N/A

0.404769s

init_substr

Passed

N/A

0.013503s

length

Passed

N/A

0.034132s

prepend_ap

Passed

N/A

1.294248s

prepend_fmt

Passed

N/A

1.291734s

rfind_ch

Passed

N/A

0.014082s

atf/atf-c/detail/env_test

0.051771s

get

Passed

N/A

0.012465s

has

Passed

N/A

0.011996s

set

Passed

N/A

0.011684s

unset

Passed

N/A

0.012930s

atf/atf-c/detail/fs_test

0.364502s

eaccess

Passed

N/A

0.017425s

exists

Passed

N/A

0.018098s

getcwd

Passed

N/A

0.013313s

mkdtemp_err

Passed

N/A

0.016383s

mkdtemp_ok

Passed

N/A

0.014141s

mkdtemp_umask

Passed

N/A

0.014739s

mkstemp_err

Passed

N/A

0.016463s

mkstemp_ok

Passed

N/A

0.013835s

mkstemp_umask

Passed

N/A

0.013680s

path_append

Passed

N/A

0.014868s

path_branch_path

Passed

N/A

0.013270s

path_copy

Passed

N/A

0.012718s

path_equal

Passed

N/A

0.014220s

path_is_absolute

Passed

N/A

0.014544s

path_is_root

Passed

N/A

0.014228s

path_leaf_name

Passed

N/A

0.013143s

path_normalize

Passed

N/A

0.015462s

path_to_absolute

Passed

N/A

0.013531s

rmdir_empty

Passed

N/A

0.012830s

rmdir_enotempty

Passed

N/A

0.013528s

rmdir_eperm

Passed

N/A

0.014501s

stat_mode

Passed

N/A

0.014250s

stat_perms

Passed

N/A

0.013951s

stat_type

Passed

N/A

0.013606s

atf/atf-c/detail/list_test

0.122689s

list_append

Passed

N/A

0.014335s

list_append_list

Passed

N/A

0.012608s

list_for_each

Passed

N/A

0.013306s

list_for_each_c

Passed

N/A

0.013902s

list_index

Passed

N/A

0.013055s

list_index_c

Passed

N/A

0.012355s

list_init

Passed

N/A

0.012820s

list_to_charpp_empty

Passed

N/A

0.013172s

list_to_charpp_some

Passed

N/A

0.012148s

atf/atf-c/detail/map_test

0.178535s

find

Passed

N/A

0.013307s

find_c

Passed

N/A

0.013474s

map_for_each

Passed

N/A

0.013703s

map_for_each_c

Passed

N/A

0.013648s

map_init

Passed

N/A

0.013128s

map_init_charpp_empty

Passed

N/A

0.013144s

map_init_charpp_null

Passed

N/A

0.012931s

map_init_charpp_short

Passed

N/A

0.013053s

map_init_charpp_some

Passed

N/A

0.013092s

map_insert

Passed

N/A

0.013116s

stable_keys

Passed

N/A

0.013431s

to_charpp_empty

Passed

N/A

0.012976s

to_charpp_some

Passed

N/A

0.012504s

atf/atf-c/detail/process_test

2.067650s

child_pid

Passed

N/A

0.019070s

child_wait_eintr

Passed

N/A

1.023494s

exec_failure

Passed

N/A

0.033699s

exec_list

Passed

N/A

0.023599s

exec_prehook

Passed

N/A

0.018916s

exec_success

Passed

N/A

0.022956s

fork_cookie

Passed

N/A

0.019948s

fork_out_capture_err_capture

Passed

N/A

0.020606s

fork_out_capture_err_connect

Passed

N/A

0.020404s

fork_out_capture_err_default

Passed

N/A

0.020214s

fork_out_capture_err_inherit

Passed

N/A

0.019942s

fork_out_capture_err_redirect_fd

Passed

N/A

0.020149s

fork_out_capture_err_redirect_path

Passed

N/A

0.019907s

fork_out_connect_err_capture

Passed

N/A

0.020247s

fork_out_connect_err_connect

Passed

N/A

0.020269s

fork_out_connect_err_default

Passed

N/A

0.020296s

fork_out_connect_err_inherit

Passed

N/A

0.020234s

fork_out_connect_err_redirect_fd

Passed

N/A

0.020372s

fork_out_connect_err_redirect_path

Passed

N/A

0.020538s

fork_out_default_err_capture

Passed

N/A

0.020189s

fork_out_default_err_connect

Passed

N/A

0.020628s

fork_out_default_err_default

Passed

N/A

0.020766s

fork_out_default_err_inherit

Passed

N/A

0.020234s

fork_out_default_err_redirect_fd

Passed

N/A

0.020191s

fork_out_default_err_redirect_path

Passed

N/A

0.020360s

fork_out_inherit_err_capture

Passed

N/A

0.020476s

fork_out_inherit_err_connect

Passed

N/A

0.020616s

fork_out_inherit_err_default

Passed

N/A

0.019864s

fork_out_inherit_err_inherit

Passed

N/A

0.020168s

fork_out_inherit_err_redirect_fd

Passed

N/A

0.021370s

fork_out_inherit_err_redirect_path

Passed

N/A

0.020958s

fork_out_redirect_fd_err_capture

Passed

N/A

0.020142s

fork_out_redirect_fd_err_connect

Passed

N/A

0.019557s

fork_out_redirect_fd_err_default

Passed

N/A

0.019824s

fork_out_redirect_fd_err_inherit

Passed

N/A

0.020951s

fork_out_redirect_fd_err_redirect_fd

Passed

N/A

0.018619s

fork_out_redirect_fd_err_redirect_path

Passed

N/A

0.019520s

fork_out_redirect_path_err_capture

Passed

N/A

0.018439s

fork_out_redirect_path_err_connect

Passed

N/A

0.019288s

fork_out_redirect_path_err_default

Passed

N/A

0.020534s

fork_out_redirect_path_err_inherit

Passed

N/A

0.021600s

fork_out_redirect_path_err_redirect_fd

Passed

N/A

0.020459s

fork_out_redirect_path_err_redirect_path

Passed

N/A

0.021104s

status_coredump

Passed

N/A

0.022800s

status_exited

Passed

N/A

0.020703s

status_signaled

Passed

N/A

0.019075s

stream_init_capture

Passed

N/A

0.014213s

stream_init_connect

Passed

N/A

0.014806s

stream_init_inherit

Passed

N/A

0.015359s

stream_init_redirect_fd

Passed

N/A

0.014569s

stream_init_redirect_path

Passed

N/A

0.014264s

atf/atf-c/detail/sanity_test

0.112295s

inv

Passed

N/A

0.029262s

post

Passed

N/A

0.024980s

pre

Passed

N/A

0.026004s

unreachable

Passed

N/A

0.025466s

atf/atf-c/detail/text_test

0.089243s

for_each_word

Passed

N/A

0.012341s

format

Passed

N/A

0.011788s

format_ap

Passed

N/A

0.011653s

split

Passed

N/A

0.012031s

split_delims

Passed

N/A

0.013110s

to_bool

Passed

N/A

0.012692s

to_long

Passed

N/A

0.011911s

atf/atf-c/detail/user_test

0.056983s

euid

Passed

N/A

0.013796s

is_member_of_group

Passed

N/A

0.014159s

is_root

Passed

N/A

0.012759s

is_unprivileged

Passed

N/A

0.013225s

atf/atf-c/atf_c_test

0.234701s

include

Passed

N/A

0.233495s

atf/atf-c/build_test

0.224582s

c_o

Passed

N/A

0.015486s

cpp

Passed

N/A

0.013321s

cxx_o

Passed

N/A

0.013427s

equal_arrays

Passed

N/A

0.012318s

include

Passed

N/A

0.162990s

atf/atf-c/check_test

2.533033s

build_c_o

Passed

N/A

0.297807s

build_cpp

Passed

N/A

0.352656s

build_cxx_o

Passed

N/A

1.558184s

exec_array

Passed

N/A

0.023351s

exec_cleanup

Passed

N/A

0.021586s

exec_exitstatus

Passed

N/A

0.036316s

exec_stdout_stderr

Passed

N/A

0.032290s

exec_umask

Passed

N/A

0.012409s

exec_unknown

Passed

N/A

0.019106s

include

Passed

N/A

0.171211s

atf/atf-c/config_test

0.181042s

get

Passed

N/A

0.015430s

include

Passed

N/A

0.163857s

atf/atf-c/error_test

0.475661s

error_new

Passed

N/A

0.014039s

error_new_wo_memory

Passed

N/A

0.013626s

format

Passed

N/A

0.013253s

include

Passed

N/A

0.170005s

include_fwd

Passed

N/A

0.161484s

is_error

Passed

N/A

0.013939s

libc_format

Passed

N/A

0.015226s

libc_new

Passed

N/A

0.013284s

no_error

Passed

N/A

0.013331s

no_memory_format

Passed

N/A

0.013288s

no_memory_new

Passed

N/A

0.013279s

no_memory_twice

Passed

N/A

0.013301s

atf/atf-c/macros_test

1.359858s

check

Passed

N/A

0.031914s

check_eq

Passed

N/A

0.051007s

check_errno

Passed

N/A

0.030781s

check_match

Passed

N/A

0.037499s

check_streq

Passed

N/A

0.056848s

detect_unused_tests

Expected failure

PR 49187: Build of unused_test.c passed; unused test cases are not properly detected

0.388263s

include

Passed

N/A

0.232818s

msg_embedded_fmt

Passed

N/A

0.034057s

require

Passed

N/A

0.031264s

require_eq

Passed

N/A

0.047774s

require_errno

Passed

N/A

0.029612s

require_match

Passed

N/A

0.036216s

require_streq

Passed

N/A

0.051551s

use

Passed

N/A

0.285726s

atf/atf-c/tc_test

0.212263s

config

Passed

N/A

0.012884s

include

Passed

N/A

0.158139s

init

Passed

N/A

0.013074s

init_pack

Passed

N/A

0.012495s

vars

Passed

N/A

0.012286s

atf/atf-c/tp_test

0.167209s

getopt

Passed

N/A

0.011866s

include

Passed

N/A

0.153708s

atf/atf-c/utils_test

0.670893s

cat_file__empty

Passed

N/A

0.012910s

cat_file__no_newline_eof

Passed

N/A

0.013246s

cat_file__one_line

Passed

N/A

0.014953s

cat_file__several_lines

Passed

N/A

0.019059s

compare_file__empty__match

Passed

N/A

0.012650s

compare_file__empty__not_match

Passed

N/A

0.012257s

compare_file__long__match

Passed

N/A

0.014658s

compare_file__long__not_match

Passed

N/A

0.013076s

compare_file__short__match

Passed

N/A

0.012487s

compare_file__short__not_match

Passed

N/A

0.014604s

copy_file__empty

Passed

N/A

0.012568s

copy_file__some_contents

Passed

N/A

0.013506s

create_file

Passed

N/A

0.014063s

file_exists

Passed

N/A

0.013093s

fork

Passed

N/A

0.015974s

free_charpp__empty

Passed

N/A

0.012873s

free_charpp__some

Passed

N/A

0.012092s

grep_file

Passed

N/A

0.014485s

grep_string

Passed

N/A

0.012850s

include

Passed

N/A

0.201079s

readline__none

Passed

N/A

0.012704s

readline__some

Passed

N/A

0.013871s

redirect__other

Passed

N/A

0.012431s

redirect__stderr

Passed

N/A

0.012567s

redirect__stdout

Passed

N/A

0.013439s

wait__invalid_exitstatus

Passed

N/A

0.019746s

wait__invalid_stderr

Passed

N/A

0.020071s

wait__invalid_stdout

Passed

N/A

0.020327s

wait__ok

Passed

N/A

0.020021s

wait__save_stderr

Passed

N/A

0.020638s

wait__save_stdout

Passed

N/A

0.020014s

atf/atf-c/pkg_config_test

0.003499s

build

Skipped

Required program 'pkg-config' not found in the PATH

0.001673s

version

Skipped

Required program 'pkg-config' not found in the PATH

0.001737s

atf/atf-c++/detail/application_test

0.025130s

getopt

Passed

N/A

0.024292s

atf/atf-c++/detail/auto_array_test

0.237632s

auto_array_access

Passed

N/A

0.025452s

auto_array_assign

Passed

N/A

0.027081s

auto_array_assign_ref

Passed

N/A

0.025880s

auto_array_copy

Passed

N/A

0.026680s

auto_array_copy_ref

Passed

N/A

0.024341s

auto_array_get

Passed

N/A

0.024627s

auto_array_release

Passed

N/A

0.026915s

auto_array_reset

Passed

N/A

0.025855s

auto_array_scope

Passed

N/A

0.025222s

atf/atf-c++/detail/env_test

0.077196s

has_get

Passed

N/A

0.024743s

set

Passed

N/A

0.025408s

unset

Passed

N/A

0.024462s

atf/atf-c++/detail/exceptions_test

0.118943s

throw_atf_error_libc

Passed

N/A

0.038772s

throw_atf_error_no_memory

Passed

N/A

0.039678s

throw_atf_error_unknown

Passed

N/A

0.038385s

atf/atf-c++/detail/fs_test

0.503402s

directory_file_info

Passed

N/A

0.026192s

directory_names

Passed

N/A

0.026552s

directory_read

Passed

N/A

0.025884s

exists

Passed

N/A

0.025260s

file_info_perms

Passed

N/A

0.032683s

file_info_stat

Passed

N/A

0.027692s

is_executable

Passed

N/A

0.026450s

path_branch_path

Passed

N/A

0.025228s

path_compare_different

Passed

N/A

0.024819s

path_compare_equal

Passed

N/A

0.026870s

path_concat

Passed

N/A

0.024936s

path_is_absolute

Passed

N/A

0.026319s

path_is_root

Passed

N/A

0.026575s

path_leaf_name

Passed

N/A

0.024385s

path_normalize

Passed

N/A

0.025679s

path_op_less

Passed

N/A

0.024024s

path_to_absolute

Passed

N/A

0.024274s

remove

Passed

N/A

0.040123s

atf/atf-c++/detail/process_test

0.283367s

argv_array_assign

Passed

N/A

0.025539s

argv_array_copy

Passed

N/A

0.025904s

argv_array_exec_argv

Passed

N/A

0.025582s

argv_array_init_carray

Passed

N/A

0.026153s

argv_array_init_col

Passed

N/A

0.026023s

argv_array_init_empty

Passed

N/A

0.025945s

argv_array_init_varargs

Passed

N/A

0.026163s

argv_array_iter

Passed

N/A

0.025854s

exec_failure

Passed

N/A

0.034602s

exec_success

Passed

N/A

0.035859s

atf/atf-c++/detail/sanity_test

0.026586s

nothing

Passed

N/A

0.025952s

atf/atf-c++/detail/text_test

0.313933s

duplicate

Passed

N/A

0.026503s

join

Passed

N/A

0.026747s

match

Passed

N/A

0.040979s

split

Passed

N/A

0.026271s

split_delims

Passed

N/A

0.025261s

to_bool

Passed

N/A

0.038214s

to_bytes

Passed

N/A

0.037984s

to_string

Passed

N/A

0.025041s

to_type

Passed

N/A

0.037277s

trim

Passed

N/A

0.023332s

atf/atf-c++/atf_c++_test

1.779101s

include

Passed

N/A

1.777815s

atf/atf-c++/build_test

0.945098s

c_o

Passed

N/A

0.028725s

cpp

Passed

N/A

0.026946s

cxx_o

Passed

N/A

0.026868s

equal_argvs

Passed

N/A

0.025730s

include

Passed

N/A

0.833694s

atf/atf-c++/check_test

3.249839s

build_c_o

Passed

N/A

0.289043s

build_cpp

Passed

N/A

0.180795s

build_cxx_o

Passed

N/A

1.516613s

exec_cleanup

Passed

N/A

0.036039s

exec_exitstatus

Passed

N/A

0.052142s

exec_stdout_stderr

Passed

N/A

0.046895s

exec_unknown

Passed

N/A

0.034551s

include

Passed

N/A

1.085731s

atf/atf-c++/config_test

1.131202s

get

Passed

N/A

0.029893s

get_all

Passed

N/A

0.025783s

has

Passed

N/A

0.023913s

include

Passed

N/A

1.048586s

atf/atf-c++/macros_test

7.144972s

check_errno

Passed

N/A

0.056561s

detect_unused_tests

Expected failure

PR 49187: Build of unused_test.cpp passed; unused test cases are not properly detected

2.521254s

fail

Passed

N/A

0.035020s

include

Passed

N/A

1.781132s

pass

Passed

N/A

0.033225s

require

Passed

N/A

0.050693s

require_eq

Passed

N/A

0.055685s

require_errno

Passed

N/A

0.047878s

require_in

Passed

N/A

0.068036s

require_match

Passed

N/A

0.039536s

require_not_in

Passed

N/A

0.071798s

require_throw

Passed

N/A

0.079022s

require_throw_re

Passed

N/A

0.105247s

skip

Passed

N/A

0.035107s

use

Passed

N/A

2.147801s

atf/atf-c++/tests_test

1.064619s

atf_tp_writer

Passed

N/A

0.026218s

include

Passed

N/A

1.036221s

atf/atf-c++/utils_test

1.704335s

cat_file__empty

Passed

N/A

0.026099s

cat_file__no_newline_eof

Passed

N/A

0.029092s

cat_file__one_line

Passed

N/A

0.028807s

cat_file__several_lines

Passed

N/A

0.025245s

compare_file__empty__match

Passed

N/A

0.027397s

compare_file__empty__not_match

Passed

N/A

0.026851s

compare_file__long__match

Passed

N/A

0.026663s

compare_file__long__not_match

Passed

N/A

0.027374s

compare_file__short__match

Passed

N/A

0.024288s

compare_file__short__not_match

Passed

N/A

0.024094s

copy_file__empty

Passed

N/A

0.026893s

copy_file__some_contents

Passed

N/A

0.025169s

create_file

Passed

N/A

0.027299s

file_exists

Passed

N/A

0.026522s

fork

Passed

N/A

0.033154s

grep_collection__set

Passed

N/A

0.026737s

grep_collection__vector

Passed

N/A

0.025025s

grep_file

Passed

N/A

0.026937s

grep_string

Passed

N/A

0.024187s

include

Passed

N/A

0.855487s

redirect__other

Passed

N/A

0.028054s

redirect__stderr

Passed

N/A

0.026445s

redirect__stdout

Passed

N/A

0.029415s

wait__invalid_exitstatus

Passed

N/A

0.040267s

wait__invalid_stderr

Passed

N/A

0.036834s

wait__invalid_stdout

Passed

N/A

0.040716s

wait__ok

Passed

N/A

0.037977s

wait__save_stderr

Passed

N/A

0.037935s

wait__save_stdout

Passed

N/A

0.037995s

atf/atf-c++/pkg_config_test

0.003607s

build

Skipped

Required program 'pkg-config' not found in the PATH

0.001608s

version

Skipped

Required program 'pkg-config' not found in the PATH

0.001703s

atf/atf-sh/atf-check_test

6.602373s

eflag_empty

Passed

N/A

0.207557s

eflag_file

Passed

N/A

0.326703s

eflag_ignore

Passed

N/A

0.201248s

eflag_inline

Passed

N/A

0.485110s

eflag_match

Passed

N/A

0.337225s

eflag_multiple

Passed

N/A

0.271786s

eflag_negated

Passed

N/A

0.296822s

eflag_save

Passed

N/A

0.152252s

invalid_umask

Passed

N/A

0.144339s

oflag_empty

Passed

N/A

0.197047s

oflag_file

Passed

N/A

0.308168s

oflag_ignore

Passed

N/A

0.192670s

oflag_inline

Passed

N/A

0.477954s

oflag_match

Passed

N/A

0.330235s

oflag_multiple

Passed

N/A

0.287893s

oflag_negated

Passed

N/A

0.281075s

oflag_save

Passed

N/A

0.147013s

sflag_eq_ne

Passed

N/A

0.444509s

sflag_exit

Passed

N/A

0.571580s

sflag_ignore

Passed

N/A

0.226769s

sflag_signal

Passed

N/A

0.362652s

stdin

Passed

N/A

0.137462s

xflag

Passed

N/A

0.191683s

atf/atf-sh/atf_check_test

12.450268s

equal

Passed

N/A

0.669356s

experr_mismatch

Passed

N/A

0.307102s

expout_mismatch

Passed

N/A

0.308511s

flush_stdout_on_timeout

Passed

N/A

10.136383s

info_ok

Passed

N/A

0.420165s

null_stderr

Passed

N/A

0.300544s

null_stdout

Passed

N/A

0.299879s

atf/atf-sh/config_test

0.964379s

get

Passed

N/A

0.459594s

has

Passed

N/A

0.502880s

atf/atf-sh/integration_test

0.545009s

arguments

Passed

N/A

0.250158s

missing_script

Passed

N/A

0.149149s

no_args

Passed

N/A

0.142682s

atf/atf-sh/normalize_test

0.265419s

main

Passed

N/A

0.264464s

atf/atf-sh/tc_test

0.764955s

default_status

Passed

N/A

0.546628s

missing_body

Passed

N/A

0.216622s

atf/atf-sh/tp_test

0.252711s

srcdir

Passed

N/A

0.251058s

atf/test-programs/config_test

1.382769s

vflag

Passed

N/A

1.381767s

atf/test-programs/expect_test

4.671975s

expect_death

Passed

N/A

0.905562s

expect_exit

Passed

N/A

0.927067s

expect_fail

Passed

N/A

0.802057s

expect_pass

Passed

N/A

0.773445s

expect_signal

Passed

N/A

0.879567s

expect_timeout

Passed

N/A

0.380214s

atf/test-programs/meta_data_test

3.611528s

no_descr

Passed

N/A

1.808525s

no_head

Passed

N/A

1.801587s

atf/test-programs/result_test

2.296270s

atf_run_warnings

Passed

N/A

0.284931s

result_exception

Passed

N/A

0.170329s

result_on_stdout

Passed

N/A

0.623294s

result_to_file

Passed

N/A

0.896310s

result_to_file_fail

Passed

N/A

0.314261s

atf/test-programs/srcdir_test

4.106176s

default

Passed

N/A

0.612768s

libtool

Passed

N/A

0.628929s

relative

Passed

N/A

2.015858s

sflag

Passed

N/A

0.837952s

atf/tools/application_test

0.026271s

getopt

Passed

N/A

0.025635s

atf/tools/atffile_test

0.534378s

atffile_1

Passed

N/A

0.029833s

atffile_2

Passed

N/A

0.027323s

atffile_3

Passed

N/A

0.025097s

atffile_4

Passed

N/A

0.024939s

atffile_5

Passed

N/A

0.026229s

atffile_50

Passed

N/A

0.038980s

atffile_51

Passed

N/A

0.039043s

atffile_52

Passed

N/A

0.040569s

atffile_53

Passed

N/A

0.039262s

atffile_54

Passed

N/A

0.039354s

atffile_6

Passed

N/A

0.024882s

atffile_getters

Passed

N/A

0.026745s

read_missing_test_program

Passed

N/A

0.043159s

read_missing_test_suite

Passed

N/A

0.039863s

read_ok_simple

Passed

N/A

0.027987s

read_ok_some_globs

Passed

N/A

0.029601s

atf/tools/auto_array_test

0.234424s

auto_array_access

Passed

N/A

0.024329s

auto_array_assign

Passed

N/A

0.025381s

auto_array_assign_ref

Passed

N/A

0.025012s

auto_array_copy

Passed

N/A

0.024692s

auto_array_copy_ref

Passed

N/A

0.026039s

auto_array_get

Passed

N/A

0.025429s

auto_array_release

Passed

N/A

0.026382s

auto_array_reset

Passed

N/A

0.024881s

auto_array_scope

Passed

N/A

0.027005s

atf/tools/config_file_test

0.457040s

config_1

Passed

N/A

0.030714s

config_2

Passed

N/A

0.024569s

config_3

Passed

N/A

0.027760s

config_4

Passed

N/A

0.027076s

config_50

Passed

N/A

0.040536s

config_51

Passed

N/A

0.041679s

config_52

Passed

N/A

0.041560s

config_53

Passed

N/A

0.039864s

config_54

Passed

N/A

0.040444s

merge_configs_both_empty

Passed

N/A

0.026723s

merge_configs_lower_empty

Passed

N/A

0.026526s

merge_configs_mixed

Passed

N/A

0.026913s

merge_configs_upper_empty

Passed

N/A

0.026447s

read_config_files_none

Passed

N/A

0.026176s

atf/tools/config_test

0.077296s

get

Passed

N/A

0.028267s

get_all

Passed

N/A

0.023808s

has

Passed

N/A

0.023404s

atf/tools/env_test

0.072271s

has_get

Passed

N/A

0.022717s

set

Passed

N/A

0.022853s

unset

Passed

N/A

0.024977s

atf/tools/expand_test

0.153388s

expand_glob_base

Passed

N/A

0.027231s

expand_glob_tps

Passed

N/A

0.025104s

is_glob

Passed

N/A

0.023200s

matches_glob_plain

Passed

N/A

0.023307s

matches_glob_question

Passed

N/A

0.026776s

matches_glob_star

Passed

N/A

0.024339s

atf/tools/fs_test

0.754106s

change_directory

Passed

N/A

0.044824s

cleanup

Passed

N/A

0.043000s

cleanup_eacces_on_root

Passed

N/A

0.025363s

cleanup_eacces_on_subdir

Passed

N/A

0.042518s

directory_file_info

Passed

N/A

0.027603s

directory_names

Passed

N/A

0.025258s

directory_read

Passed

N/A

0.026917s

exists

Passed

N/A

0.039071s

file_info_perms

Passed

N/A

0.028134s

file_info_stat

Passed

N/A

0.024608s

get_current_dir

Passed

N/A

0.027012s

is_executable

Passed

N/A

0.041879s

path_branch_path

Passed

N/A

0.024578s

path_compare_different

Passed

N/A

0.026279s

path_compare_equal

Passed

N/A

0.024399s

path_concat

Passed

N/A

0.024534s

path_is_absolute

Passed

N/A

0.024018s

path_is_root

Passed

N/A

0.023977s

path_leaf_name

Passed

N/A

0.025134s

path_normalize

Passed

N/A

0.026915s

path_op_less

Passed

N/A

0.027622s

path_to_absolute

Passed

N/A

0.026101s

remove

Passed

N/A

0.038858s

temp_dir_raii

Passed

N/A

0.040099s

atf/tools/io_test

4.163913s

file_handle_copy

Passed

N/A

0.025916s

file_handle_ctor

Passed

N/A

0.024077s

file_handle_get

Passed

N/A

0.025232s

file_handle_posix_remap

Passed

N/A

0.023956s

muxer_large_buffer

Passed

N/A

2.649940s

muxer_small_buffer

Passed

N/A

1.221949s

pistream

Passed

N/A

0.027275s

systembuf_long_read

Passed

N/A

0.053901s

systembuf_long_write

Passed

N/A

0.049688s

systembuf_short_read

Passed

N/A

0.026865s

systembuf_short_write

Passed

N/A

0.026880s

atf/tools/parser_test

0.823941s

headers_1

Passed

N/A

0.042632s

headers_10

Passed

N/A

0.042190s

headers_11

Passed

N/A

0.041629s

headers_12

Passed

N/A

0.043262s

headers_2

Passed

N/A

0.041356s

headers_3

Passed

N/A

0.041244s

headers_4

Passed

N/A

0.041154s

headers_5

Passed

N/A

0.041035s

headers_6

Passed

N/A

0.041420s

headers_7

Passed

N/A

0.040018s

headers_8

Passed

N/A

0.041987s

headers_9

Passed

N/A

0.041780s

parse_error_to_string

Passed

N/A

0.024418s

parse_errors_what

Passed

N/A

0.024381s

token_getters

Passed

N/A

0.027154s

tokenizer_delims_nows

Passed

N/A

0.027278s

tokenizer_delims_ws

Passed

N/A

0.026882s

tokenizer_keywords_nows

Passed

N/A

0.041807s

tokenizer_keywords_ws

Passed

N/A

0.025704s

tokenizer_minimal_nows

Passed

N/A

0.027587s

tokenizer_minimal_ws

Passed

N/A

0.027330s

tokenizer_quotes_nows

Passed

N/A

0.026810s

tokenizer_quotes_ws

Passed

N/A

0.028121s

atf/tools/process_test

0.284121s

argv_array_assign

Passed

N/A

0.026620s

argv_array_copy

Passed

N/A

0.026431s

argv_array_exec_argv

Passed

N/A

0.026073s

argv_array_init_carray

Passed

N/A

0.026115s

argv_array_init_col

Passed

N/A

0.026094s

argv_array_init_empty

Passed

N/A

0.023855s

argv_array_init_varargs

Passed

N/A

0.023469s

argv_array_iter

Passed

N/A

0.025078s

exec_failure

Passed

N/A

0.038694s

exec_success

Passed

N/A

0.033822s

atf/tools/reader_test

0.892088s

tps_1

Passed

N/A

0.028854s

tps_2

Passed

N/A

0.026667s

tps_3

Passed

N/A

0.025571s

tps_4

Passed

N/A

0.026928s

tps_5

Passed

N/A

0.028379s

tps_50

Passed

N/A

0.041911s

tps_51

Passed

N/A

0.042273s

tps_52

Passed

N/A

0.040356s

tps_53

Passed

N/A

0.041430s

tps_54

Passed

N/A

0.044824s

tps_55

Passed

N/A

0.045479s

tps_56

Passed

N/A

0.043702s

tps_57

Passed

N/A

0.041084s

tps_58

Passed

N/A

0.039782s

tps_59

Passed

N/A

0.041852s

tps_6

Passed

N/A

0.028469s

tps_60

Passed

N/A

0.040697s

tps_61

Passed

N/A

0.038871s

tps_62

Passed

N/A

0.041392s

tps_63

Passed

N/A

0.042334s

tps_64

Passed

N/A

0.041755s

tps_65

Passed

N/A

0.041603s

tps_66

Passed

N/A

0.041210s

atf/tools/requirements_test

0.979980s

require_arch_many_fail

Passed

N/A

0.031309s

require_arch_many_ok

Passed

N/A

0.025116s

require_arch_one_fail

Passed

N/A

0.024859s

require_arch_one_ok

Passed

N/A

0.024056s

require_config_many_fail

Passed

N/A

0.025672s

require_config_many_ok

Passed

N/A

0.027320s

require_config_one_fail

Passed

N/A

0.026568s

require_config_one_ok

Passed

N/A

0.024425s

require_files_many_fail

Passed

N/A

0.038831s

require_files_many_missing

Passed

N/A

0.039033s

require_files_many_ok

Passed

N/A

0.024618s

require_files_one_fail

Passed

N/A

0.040580s

require_files_one_missing

Passed

N/A

0.039644s

require_files_one_ok

Passed

N/A

0.024816s

require_machine_many_fail

Passed

N/A

0.029171s

require_machine_many_ok

Passed

N/A

0.026660s

require_machine_one_fail

Passed

N/A

0.028141s

require_machine_one_ok

Passed

N/A

0.025928s

require_memory_fail

Passed

N/A

0.041648s

require_memory_not_enough

Passed

N/A

0.028223s

require_memory_ok

Passed

N/A

0.027575s

require_progs_many_fail

Passed

N/A

0.041599s

require_progs_many_missing

Passed

N/A

0.042847s

require_progs_many_ok

Passed

N/A

0.040541s

require_progs_one_fail

Passed

N/A

0.038547s

require_progs_one_missing

Passed

N/A

0.040695s

require_progs_one_ok

Passed

N/A

0.038660s

require_user_fail

Passed

N/A

0.037958s

require_user_root

Passed

N/A

0.026516s

require_user_unprivileged

Passed

N/A

0.027739s

atf/tools/signals_test

0.162522s

reset

Passed

N/A

0.033998s

signal_holder_destructor

Passed

N/A

0.025956s

signal_holder_preserve

Passed

N/A

0.024187s

signal_holder_process

Passed

N/A

0.026017s

signal_programmer_preserve

Passed

N/A

0.024457s

signal_programmer_program

Passed

N/A

0.023824s

atf/tools/test_program_test

1.404101s

atf_tps_writer

Passed

N/A

0.096201s

get_metadata_bad

Passed

N/A

0.061205s

get_metadata_several_tcs

Passed

N/A

0.042936s

get_metadata_zero_tcs

Passed

N/A

0.053237s

parse_test_case_result_expected_death

Passed

N/A

0.040718s

parse_test_case_result_expected_exit

Passed

N/A

0.041754s

parse_test_case_result_expected_failure

Passed

N/A

0.041508s

parse_test_case_result_expected_signal

Passed

N/A

0.041435s

parse_test_case_result_expected_timeout

Passed

N/A

0.039972s

parse_test_case_result_failed

Passed

N/A

0.040494s

parse_test_case_result_passed

Passed

N/A

0.041423s

parse_test_case_result_skipped

Passed

N/A

0.042388s

parse_test_case_result_unknown

Passed

N/A

0.040812s

read_test_case_result_empty_file

Passed

N/A

0.042181s

read_test_case_result_failed

Passed

N/A

0.026691s

read_test_case_result_invalid

Passed

N/A

0.039816s

read_test_case_result_multiline

Passed

N/A

0.026433s

read_test_case_result_no_file

Passed

N/A

0.043161s

read_test_case_result_skipped

Passed

N/A

0.026846s

tp_1

Passed

N/A

0.026093s

tp_2

Passed

N/A

0.026201s

tp_3

Passed

N/A

0.027992s

tp_4

Passed

N/A

0.028364s

tp_50

Passed

N/A

0.042198s

tp_51

Passed

N/A

0.041940s

tp_52

Passed

N/A

0.028932s

tp_53

Passed

N/A

0.041613s

tp_54

Passed

N/A

0.039879s

tp_55

Passed

N/A

0.041153s

tp_56

Passed

N/A

0.040560s

tp_57

Passed

N/A

0.041180s

tp_58

Passed

N/A

0.042835s

tp_59

Passed

N/A

0.043027s

tp_60

Passed

N/A

0.040797s

atf/tools/text_test

0.313353s

duplicate

Passed

N/A

0.023736s

join

Passed

N/A

0.025649s

match

Passed

N/A

0.038555s

split

Passed

N/A

0.026967s

split_delims

Passed

N/A

0.024300s

to_bool

Passed

N/A

0.038423s

to_bytes

Passed

N/A

0.039341s

to_string

Passed

N/A

0.025163s

to_type

Passed

N/A

0.038581s

trim

Passed

N/A

0.026783s

atf/tools/ui_test

0.162001s

paragraphs

Passed

N/A

0.024018s

w_tag_col

Passed

N/A

0.028377s

w_tag_no_repeat

Passed

N/A

0.029518s

w_tag_repeat

Passed

N/A

0.025205s

wo_tag

Passed

N/A

0.027389s

wo_tag_col

Passed

N/A

0.023811s

atf/tools/user_test

0.099772s

euid

Passed

N/A

0.023901s

is_member_of_group

Passed

N/A

0.025164s

is_root

Passed

N/A

0.022758s

is_unprivileged

Passed

N/A

0.025877s

atf/tools/atf-config_test

12.061463s

list_all

Passed

N/A

0.639335s

override_env

Passed

N/A

5.365892s

query_mixture

Passed

N/A

1.672222s

query_multiple

Passed

N/A

0.181807s

query_one

Passed

N/A

1.318115s

query_one_terse

Passed

N/A

2.730855s

query_unknown

Passed

N/A

0.147287s

atf/tools/atf-report_test

6.676986s

default

Passed

N/A

0.611427s

expect

Passed

N/A

2.670662s

oflag

Passed

N/A

1.159794s

output_csv

Passed

N/A

0.558410s

output_ticker

Passed

N/A

0.571541s

output_xml

Passed

N/A

0.568557s

output_xml_space

Passed

N/A

0.375239s

too_many_args

Passed

N/A

0.142447s

atf/tools/atf-run_test

64.263599s

atffile

Passed

N/A

2.729290s

atffile_recursive

Passed

N/A

1.473851s

broken_results

Passed

N/A

0.829567s

broken_tp_list

Passed

N/A

0.736451s

cleanup_curdir

Passed

N/A

0.797308s

cleanup_fail

Passed

N/A

0.807924s

cleanup_mount

Passed

N/A

1.120248s

cleanup_pass

Passed

N/A

0.797117s

cleanup_signal

Passed

N/A

0.108377s

cleanup_skip

Passed

N/A

0.814606s

cleanup_symlink

Passed

N/A

1.169667s

config

Passed

N/A

2.778430s

exit_codes

Passed

N/A

0.811818s

expect

Passed

N/A

2.948010s

fds

Passed

N/A

0.770925s

hooks

Passed

N/A

2.386331s

ignore_deprecated_use_fs

Passed

N/A

0.772411s

isolation_env

Passed

N/A

1.302431s

isolation_home

Passed

N/A

0.788162s

isolation_stdin

Passed

N/A

0.789507s

isolation_umask

Passed

N/A

0.784010s

missing_results

Passed

N/A

0.832704s

mux_streams

Passed

N/A

6.501066s

no_warnings

Passed

N/A

0.765647s

require_arch

Passed

N/A

5.870708s

require_config

Passed

N/A

1.959421s

require_files

Passed

N/A

3.337321s

require_machine

Passed

N/A

5.868694s

require_progs

Passed

N/A

3.291522s

require_user_bad

Passed

N/A

0.758904s

require_user_root

Passed

N/A

0.782621s

require_user_unprivileged

Passed

N/A

0.762674s

signaled

Passed

N/A

0.904630s

timeout

Passed

N/A

2.767266s

timeout_forkexit

Passed

N/A

0.786321s

vflag

Passed

N/A

2.760722s

zero_tcs

Passed

N/A

0.744835s

Failed test cases summary

Test case

Result

Reason

Duration

dev/audio/t_pad

0.433048s

pad_output

Failed

atf-check failed; see the output of the test for details

0.431950s

kernel/t_ptrace_wait

0.997934s

fpregs2

Failed

/usr/src/tests/kernel/t_ptrace_wait.c:3894: ptrace(PT_SETFPREGS, child, &r, 0) != -1 not met

0.019820s

kernel/t_ptrace_wait3

0.982605s

fpregs2

Failed

/usr/src/tests/kernel/t_ptrace_wait.c:3894: ptrace(PT_SETFPREGS, child, &r, 0) != -1 not met

0.020287s

kernel/t_ptrace_wait4

1.272009s

fork1

Failed

/usr/src/tests/kernel/t_ptrace_wait.h:295: Reported exited process

0.022131s

fpregs2

Failed

/usr/src/tests/kernel/t_ptrace_wait.c:3894: ptrace(PT_SETFPREGS, child, &r, 0) != -1 not met

0.020404s

kernel/t_ptrace_wait6

1.244545s

fork1

Failed

/usr/src/tests/kernel/t_ptrace_wait.h:295: Reported exited process

0.021699s

fpregs2

Failed

/usr/src/tests/kernel/t_ptrace_wait.c:3894: ptrace(PT_SETFPREGS, child, &r, 0) != -1 not met

0.020305s

kernel/t_ptrace_waitid

301.221627s

fork1

Failed

/usr/src/tests/kernel/t_ptrace_wait.c:1152: ptrace(PT_GET_PROCESS_STATE, child2, &state, slen) != -1 not met

0.022713s

fpregs2

Failed

/usr/src/tests/kernel/t_ptrace_wait.c:3894: ptrace(PT_SETFPREGS, child, &r, 0) != -1 not met

0.021153s

vfork1

Failed

Test case timed out after 300 seconds

300.010029s

kernel/t_ptrace_waitpid

1.301963s

fork1

Failed

/usr/src/tests/kernel/t_ptrace_wait.h:295: Reported exited process

0.025768s

fpregs2

Failed

/usr/src/tests/kernel/t_ptrace_wait.c:3894: ptrace(PT_SETFPREGS, child, &r, 0) != -1 not met

0.018589s

lib/libc/sys/t_mprotect

0.084184s

mprotect_pax

Failed

non-executable mapping made executable

0.013298s

lib/libpthread/t_timedmutex

84.676080s

mutex6

Failed

/usr/src/tests/lib/libpthread/t_mutex.c:524: start != 1

21.219799s

net/npf/t_npf

2.124092s

npf_table

Failed

atf-check failed; see the output of the test for details

0.372291s

sbin/gpt/t_gpt

4.405839s

migrate_disklabel

Failed

atf-check failed; see the output of the test for details

0.244365s

recover_backup

Failed

atf-check failed; see the output of the test for details

0.319537s

fs/vfs/t_vnops

458.633132s

lfs_create_many

Failed

Test case timed out after 300 seconds

300.019188s

Expected failures summary

Test case

Result

Reason

Duration

include/t_errno

0.012597s

errno_constants

Expected failure

PR standards/44921: 2 checks failed as expected; see output for more details

0.012072s

include/t_netdb

0.012835s

netdb_constants

Expected failure

PR standards/44777: 2 checks failed as expected; see output for more details

0.012186s

kernel/t_ptrace_wait4

1.272009s

vfork1

Expected failure

PR kern/51630: /usr/src/tests/kernel/t_ptrace_wait.h:305: WSTOPSIG(status) != expected: Unexpected stop signal received [Child exited] != [Trace/BPT trap]

0.022607s

kernel/t_ptrace_wait6

1.244545s

vfork1

Expected failure

PR kern/51630: /usr/src/tests/kernel/t_ptrace_wait.h:305: WSTOPSIG(status) != expected: Unexpected stop signal received [Child exited] != [Trace/BPT trap]

0.021044s

kernel/t_ptrace_waitpid

1.301963s

vfork1

Expected failure

PR kern/51630: /usr/src/tests/kernel/t_ptrace_wait.h:305: WSTOPSIG(status) != expected: Unexpected stop signal received [Child exited] != [Trace/BPT trap]

0.021590s

lib/libc/c063/t_fexecve

0.018184s

fexecve

Expected failure

fexecve not implemented: /usr/src/tests/lib/libc/c063/t_fexecve.c:85: access("test", F_OK) == 0 not met

0.017254s

lib/libc/regex/t_regex_att

0.156118s

leftassoc

Expected failure

Reason for breakage unknown: /usr/src/tests/lib/libc/regex/t_regex_att.c:377: res != matches ((0,4)(0,2)(2,3)(3,4) != (0,4)(0,1)(1,4)(4,4)): at line 3

0.014139s

lib/libc/sys/t_getrusage

9.237116s

getrusage_utime_back

Expected failure

PR kern/30115: anticipated error did not occur

9.192844s

getrusage_utime_zero

Expected failure

PR kern/30115: zero user time from getrusage(2)

0.015459s

lib/libtre/t_regex_att

0.219980s

rightassoc

Expected failure

Reason for breakage unknown: /usr/src/tests/lib/libtre/../libc/regex/t_regex_att.c:377: res != matches ((0,4)(0,1)(1,4)(4,4) != (0,4)(0,2)(2,3)(3,4)): at line 3

0.019863s

lib/libusbhid/t_usbhid

0.097706s

check_hid_get_data

Expected failure

only the 32-bit opcode works, 8 and 16-bit is broken: 4 checks failed as expected; see output for more details

0.014398s

check_hid_logical_range

Expected failure

only the 32-bit opcode works, 8 and 16-bit is broken: 4 checks failed as expected; see output for more details

0.014429s

check_hid_physical_range

Expected failure

only the 32-bit opcode works, 8 and 16-bit is broken: 4 checks failed as expected; see output for more details

0.014526s

lib/librumphijack/t_tcpip

4.831439s

ssh

Expected failure

PR lib/50174: atf-check failed; see the output of the test for details

1.711987s

net/if/t_compat

0.190163s

OOSIOCGIFBRDADDR

Expected failure

PR kern/51610: rump does not include COMPAT_43: /usr/src/tests/net/if/t_compat.c:72: rump_sys_ioctl(fd, ((((unsigned long)0x80000000|(unsigned long)0x40000000)) | (((sizeof(struct oifreq)) & 0x1fff) << 16) | ((('i')) << 8) | ((18))), &ifreq): Inappropriate ioctl for device

0.188408s

sbin/resize_ffs/t_shrink

38.922842s

shrink_24M_16M_v2_4096

Expected failure

PR bin/44205: atf-check failed; see the output of the test for details

11.102713s

sbin/resize_ffs/t_shrink_swapped

40.491190s

shrink_24M_16M_v2_16384

Expected failure

PR bin/44205: atf-check failed; see the output of the test for details

11.433385s

usr.bin/make/t_make

42.157409s

escape

Expected failure

see PR toolchain/49085: atf-check failed; see the output of the test for details

0.998007s

impsrc

Expected failure

see PR toolchain/49085: atf-check failed; see the output of the test for details

0.934856s

phony_end

Expected failure

see PR toolchain/49085: atf-check failed; see the output of the test for details

0.818400s

posix1

Expected failure

see PR toolchain/49085: atf-check failed; see the output of the test for details

1.322865s

suffixes

Expected failure

see PR toolchain/49085: this uses up all memory and then fails

0.508978s

usr.bin/sed/t_sed

1.322788s

emptybackref

Expected failure

PR bin/28126: atf-check failed; see the output of the test for details

0.189569s

usr.sbin/useradd/t_useradd

0.368450s

longname

Expected failure

PR bin/39546: atf-check failed; see the output of the test for details

0.367547s

fs/ffs/t_mount

0.421551s

48Kimage

Expected failure

PR kern/43573: mount failed: Invalid argument

0.128297s

fs/nfs/t_mountd

1.041910s

mountdhup

Expected failure

PR kern/5844: op failed with EACCES

1.036534s

fs/vfs/t_renamerace

116.436940s

msdosfs_renamerace

Expected failure

PR kern/43626: unmount failed: Device busy

5.309992s

msdosfs_renamerace_dirs

Expected signal

PR kern/43626

0.595976s

udf_renamerace

Expected failure

PR kern/49046: race did not trigger this time

5.342360s

fs/vfs/t_vfsops

28.176801s

lfs_tfhremove

Expected failure

fhopen() for removed file succeeds (PR kern/43745): /usr/src/tests/fs/vfs/t_vfsops.c:152: Expected true value in rump_sys_fhopen(fhp, fhsize, O_RDONLY) == -1

0.417455s

ipf/t_filter_exec

16.264072s

f26

Expected failure

Known to be broken: results differ

0.437717s

f27

Expected failure

Known to be broken: results differ

0.442638s

ipf/t_filter_parse

3.894222s

i17

Expected failure

Known to be broken: atf-check failed; see the output of the test for details

0.173422s

ipf/t_nat_exec

10.801423s

n8_6

Expected failure

See PR kern/47665: results differ

0.219046s

n9_6

Expected failure

See PR kern/47665: results differ

0.221940s

atf/atf-c/macros_test

1.359858s

detect_unused_tests

Expected failure

PR 49187: Build of unused_test.c passed; unused test cases are not properly detected

0.388263s

atf/atf-c++/macros_test

7.144972s

detect_unused_tests

Expected failure

PR 49187: Build of unused_test.cpp passed; unused test cases are not properly detected

2.521254s

Skipped test cases summary

Test case

Result

Reason

Duration

include/t_paths

0.012255s

paths

Skipped

PR port-sparc/45580

0.011546s

kernel/t_ptrace

0.068592s

attach_pid1_securelevel

Skipped

Test must be run with securelevel >= 1

0.011802s

lib/libc/gen/exect/t_exect

0.012950s

t_exect_null

Skipped

exect(3) misdesigned and hangs - PR port-amd64/51700

0.012023s

lib/libc/string/t_popcount

0.027653s

popcount_basic

Skipped

config variable "run_popcount" not set to YES/TRUE

0.013230s

popcountll_basic

Skipped

config variable "run_popcount" not set to YES/TRUE

0.013010s

lib/libc/sys/t_kevent

0.101494s

kqueue_desc_passing

Skipped

PR kern/46523

0.015727s

lib/libc/sys/t_mmap

0.188336s

mmap_block

Skipped

The test case causes a panic (PR kern/38889, kern/46592)

0.013378s

lib/libc/sys/t_mprotect

0.084184s

mprotect_exec

Skipped

Execute protection callback check not implemented

0.013386s

lib/librumphijack/t_tcpip

4.831439s

nfs_autoload

Skipped

test currently valid only on i386

0.239962s

sbin/gpt/t_gpt

4.405839s

bootable_2part

Skipped

Required file '/usr/mdec/gptmbr.bin' not found

0.000561s

fs/vfs/t_full

10.271192s

p2k_ffs_fillfs

Skipped

fs does not support explicit block allocation (GOP_ALLOC)

0.406640s

puffs_fillfs

Skipped

fs does not support explicit block allocation (GOP_ALLOC)

0.301179s

rumpfs_fillfs

Skipped

fs does not support explicit block allocation (GOP_ALLOC)

0.288451s

fs/vfs/t_renamerace

116.436940s

rumpfs_renamerace

Skipped

rename not supported by file system

0.291213s

rumpfs_renamerace_dirs

Skipped

rename not supported by file system

0.271364s

sysvbfs_renamerace

Skipped

filesystem has not enough inodes

0.289628s

sysvbfs_renamerace_dirs

Skipped

directories not supported by file system

0.295008s

fs/vfs/t_rmdirrace

125.176000s

sysvbfs_race

Skipped

directories not supported by file system

0.287801s

fs/vfs/t_union

9.552043s

ext2fs_basic

Skipped

fs does not support VOP_WHITEOUT

0.325252s

ext2fs_whiteout

Skipped

fs does not support VOP_WHITEOUT

0.356795s

msdosfs_basic

Skipped

fs does not support VOP_WHITEOUT

0.312522s

msdosfs_whiteout

Skipped

fs does not support VOP_WHITEOUT

0.362882s

nfs_basic

Skipped

fs does not support VOP_WHITEOUT

0.622989s

nfs_whiteout

Skipped

fs does not support VOP_WHITEOUT

0.684925s

p2k_ffs_basic

Skipped

fs does not support VOP_WHITEOUT

0.403651s

p2k_ffs_whiteout

Skipped

fs does not support VOP_WHITEOUT

0.444634s

puffs_basic

Skipped

fs does not support VOP_WHITEOUT

0.299055s

puffs_whiteout

Skipped

fs does not support VOP_WHITEOUT

0.330938s

sysvbfs_basic

Skipped

fs does not support VOP_WHITEOUT

0.295628s

sysvbfs_whiteout

Skipped

fs does not support VOP_WHITEOUT

0.327137s

udf_basic

Skipped

fs does not support VOP_WHITEOUT

0.303425s

udf_whiteout

Skipped

fs does not support VOP_WHITEOUT

0.335300s

v7fs_basic

Skipped

fs does not support VOP_WHITEOUT

0.305434s

v7fs_whiteout

Skipped

fs does not support VOP_WHITEOUT

0.353553s

fs/vfs/t_unpriv

19.225107s

msdosfs_owner

Skipped

owner not supported by file system

0.309752s

nfs_flags

Skipped

file flags not supported by file system

0.631158s

puffs_flags

Skipped

file flags not supported by file system

0.295983s

sysvbfs_dirperms

Skipped

directories not supported by file system

0.292857s

sysvbfs_flags

Skipped

file flags not supported by file system

0.307966s

udf_flags

Skipped

file flags not supported by file system

0.333339s

fs/vfs/t_vfsops

28.176801s

rumpfs_tfhinval

Skipped

file handles not supported

0.293683s

rumpfs_tfhremove

Skipped

file handles not supported

0.284015s

rumpfs_tfilehandle

Skipped

file handles not supported

0.294823s

sysvbfs_tfhinval

Skipped

file handles not supported

0.303481s

sysvbfs_tfhremove

Skipped

file handles not supported

0.302976s

sysvbfs_tfilehandle

Skipped

file handles not supported

0.321264s

udf_tfhinval

Skipped

file handles not supported

0.305573s

udf_tfhremove

Skipped

file handles not supported

0.303402s

udf_tfilehandle

Skipped

file handles not supported

0.304560s

v7fs_tfhinval

Skipped

file handles not supported

0.337738s

v7fs_tfhremove

Skipped

file handles not supported

0.329768s

v7fs_tfilehandle

Skipped

file handles not supported

0.324856s

fs/vfs/t_vnops

458.633132s

msdosfs_lstat_symlink

Skipped

symlinks not supported by file system

0.321942s

msdosfs_symlink_long

Skipped

symlinks not supported by file system

0.325644s

msdosfs_symlink_root

Skipped

symlinks not supported by file system

0.328804s

msdosfs_symlink_zerolen

Skipped

symlinks not supported by file system

0.345461s

rumpfs_rename_dir

Skipped

rename not supported by file system

0.294739s

rumpfs_rename_dotdot

Skipped

rename not supported by file system

0.298175s

rumpfs_rename_nametoolong

Skipped

rename not supported by file system

0.299523s

rumpfs_rename_reg_nodir

Skipped

rename not supported by file system

0.305283s

sysvbfs_dir_notempty

Skipped

directories not supported by file system

0.315706s

sysvbfs_dir_rmdirdotdot

Skipped

directories not supported by file system

0.318222s

sysvbfs_dir_simple

Skipped

directories not supported by file system

0.312584s

sysvbfs_lookup_complex

Skipped

directories not supported by file system

0.319790s

sysvbfs_lstat_symlink

Skipped

symlinks not supported by file system

0.326803s

sysvbfs_rename_dir

Skipped

directories not supported by file system

0.330918s

sysvbfs_rename_dotdot

Skipped

directories not supported by file system

0.327441s

sysvbfs_symlink_long

Skipped

symlinks not supported by file system

0.336671s

sysvbfs_symlink_root

Skipped

symlinks not supported by file system

0.329167s

sysvbfs_symlink_zerolen

Skipped

symlinks not supported by file system

0.321130s

fs/cd9660/t_high_ino_big_file

0.307879s

pr_kern_48787

Skipped

not enough free disk space, have 1048344 Kbytes, need ~ 4500000 Kbytes

0.306963s

rump/rumpkern/t_kern

0.549380s

lockme_DOUBLEINIT

Skipped

test requires LOCKDEBUG kernel

0.020603s

lockme_MEMFREE

Skipped

test requires LOCKDEBUG kernel

0.020593s

lockme_RWRX

Skipped

test requires LOCKDEBUG kernel

0.021859s

rump/modautoload/t_modautoload

0.025520s

modautoload

Skipped

host kernel modules not supported

0.024990s

crypto/libcrypto/t_ciphers

4.229245s

rc5

Skipped

RC5 support not available; system built with MKCRYPTO_RC5=no

0.098732s

crypto/opencrypto/t_opencrypto

5.386930s

arc4

Skipped

ARC4 not implemented by swcrypto

0.270146s

share/examples/t_asm

0.371004s

hello

Skipped

Example program not implemented on this platform

0.370088s

atf/atf-c/pkg_config_test

0.003499s

build

Skipped

Required program 'pkg-config' not found in the PATH

0.001673s

version

Skipped

Required program 'pkg-config' not found in the PATH

0.001737s

atf/atf-c++/pkg_config_test

0.003607s

build

Skipped

Required program 'pkg-config' not found in the PATH

0.001608s

version

Skipped

Required program 'pkg-config' not found in the PATH

0.001703s

Execution details

Environment variables

Test case: dev/audio/t_pad/pad_output

Duration: 0.431950 seconds

Termination reason

FAILED: atf-check failed; see the output of the test for details

Standard output stream

Executing command [ uudecode /usr/tests/dev/audio/t_pad_output.bz2.uue ]
Executing command [ bunzip2 t_pad_output.bz2 ]
Executing command [ /usr/tests/dev/audio/h_pad ]

Standard error stream

Fail: stdout does not match golden output
Binary files t_pad_output and /tmp/check.Ylx2eQ/stdout differ
Error while running diff(3)

Test case: include/t_errno/errno_constants

Duration: 0.012072 seconds

Termination reason

XFAIL: PR standards/44921: 2 checks failed as expected; see output for more details

Standard error stream

*** Expected check failure: PR standards/44921: ENOTRECOVERABLE not defined
*** Expected check failure: PR standards/44921: EOWNERDEAD not defined

Test case: include/t_netdb/netdb_constants

Duration: 0.012186 seconds

Termination reason

XFAIL: PR standards/44777: 2 checks failed as expected; see output for more details

Standard error stream

*** Expected check failure: PR standards/44777: AI_V4MAPPED not defined
*** Expected check failure: PR standards/44777: AI_ALL not defined

Test case: include/t_paths/paths

Duration: 0.011546 seconds

Termination reason

SKIPPED: PR port-sparc/45580

Test case: kernel/t_ptrace/attach_pid1_securelevel

Duration: 0.011802 seconds

Termination reason

SKIPPED: Test must be run with securelevel >= 1

Test case: kernel/t_ptrace_wait/fpregs2

Duration: 0.019820 seconds

Termination reason

FAILED: /usr/src/tests/kernel/t_ptrace_wait.c:3894: ptrace(PT_SETFPREGS, child, &r, 0) != -1 not met

Standard output stream

Before forking process PID=21370
Parent process PID=21370, child's PID=11261
Before calling wait() for the child
Before calling PT_TRACE_ME from child 11261
Before raising Stopped (signal) from child
Call GETFPREGS for the child process
Call SETFPREGS for the child (without changed regs)

Test case: kernel/t_ptrace_wait3/fpregs2

Duration: 0.020287 seconds

Termination reason

FAILED: /usr/src/tests/kernel/t_ptrace_wait.c:3894: ptrace(PT_SETFPREGS, child, &r, 0) != -1 not met

Standard output stream

Before forking process PID=11169
Parent process PID=11169, child's PID=19469
Before calling PT_TRACE_ME from child 19469
Before calling wait3() for the child
Before raising Stopped (signal) from child
Call GETFPREGS for the child process
Call SETFPREGS for the child (without changed regs)

Test case: kernel/t_ptrace_wait4/fork1

Duration: 0.022131 seconds

Termination reason

FAILED: /usr/src/tests/kernel/t_ptrace_wait.h:295: Reported exited process

Standard output stream

Before forking process PID=21615
Parent process PID=21615, child's PID=23044
Before calling wait4() for the child
Before calling PT_TRACE_ME from child 23044
Before raising Stopped (signal) from child
Enable PTRACE_FORK in EVENT_MASK for the child 23044
Before resuming the child process where it left off and without signal to be sent
Before calling wait4() for the child 23044
Reported PTRACE_FORK event with forkee 11398
Before calling wait4() for the forkee 11398 of the child 23044

Test case: kernel/t_ptrace_wait4/fpregs2

Duration: 0.020404 seconds

Termination reason

FAILED: /usr/src/tests/kernel/t_ptrace_wait.c:3894: ptrace(PT_SETFPREGS, child, &r, 0) != -1 not met

Standard output stream

Before forking process PID=21690
Parent process PID=21690, child's PID=23143
Before calling wait4() for the child
Before calling PT_TRACE_ME from child 23143
Before raising Stopped (signal) from child
Call GETFPREGS for the child process
Call SETFPREGS for the child (without changed regs)

Test case: kernel/t_ptrace_wait4/vfork1

Duration: 0.022607 seconds

Termination reason

XFAIL: PR kern/51630: /usr/src/tests/kernel/t_ptrace_wait.h:305: WSTOPSIG(status) != expected: Unexpected stop signal received [Child exited] != [Trace/BPT trap]

Standard output stream

Before forking process PID=23172
Parent process PID=23172, child's PID=24494
Before calling wait4() for the child
Before calling PT_TRACE_ME from child 24494
Before raising Stopped (signal) from child
Enable PTRACE_VFORK in EVENT_MASK for the child 24494
Before resuming the child process where it left off and without signal to be sent
Before calling wait4() for the child 24494

Test case: kernel/t_ptrace_wait6/fork1

Duration: 0.021699 seconds

Termination reason

FAILED: /usr/src/tests/kernel/t_ptrace_wait.h:295: Reported exited process

Standard output stream

Before forking process PID=11378
Parent process PID=11378, child's PID=18515
Before calling wait6() for the child
Before calling PT_TRACE_ME from child 18515
Before raising Stopped (signal) from child
Enable PTRACE_FORK in EVENT_MASK for the child 18515
Before resuming the child process where it left off and without signal to be sent
Before calling wait6() for the child 18515
Reported PTRACE_FORK event with forkee 11803
Before calling wait6() for the forkee 11803 of the child 18515

Test case: kernel/t_ptrace_wait6/fpregs2

Duration: 0.020305 seconds

Termination reason

FAILED: /usr/src/tests/kernel/t_ptrace_wait.c:3894: ptrace(PT_SETFPREGS, child, &r, 0) != -1 not met

Standard output stream

Before forking process PID=11590
Parent process PID=11590, child's PID=21807
Before calling wait6() for the child
Before calling PT_TRACE_ME from child 21807
Before raising Stopped (signal) from child
Call GETFPREGS for the child process
Call SETFPREGS for the child (without changed regs)

Test case: kernel/t_ptrace_wait6/vfork1

Duration: 0.021044 seconds

Termination reason

XFAIL: PR kern/51630: /usr/src/tests/kernel/t_ptrace_wait.h:305: WSTOPSIG(status) != expected: Unexpected stop signal received [Child exited] != [Trace/BPT trap]

Standard output stream

Before forking process PID=18643
Parent process PID=18643, child's PID=24206
Before calling wait6() for the child
Before calling PT_TRACE_ME from child 24206
Before raising Stopped (signal) from child
Enable PTRACE_VFORK in EVENT_MASK for the child 24206
Before resuming the child process where it left off and without signal to be sent
Before calling wait6() for the child 24206

Test case: kernel/t_ptrace_waitid/fork1

Duration: 0.022713 seconds

Termination reason

FAILED: /usr/src/tests/kernel/t_ptrace_wait.c:1152: ptrace(PT_GET_PROCESS_STATE, child2, &state, slen) != -1 not met

Standard output stream

Before forking process PID=21705
Parent process PID=21705, child's PID=10272
Before calling PT_TRACE_ME from child 10272
Before raising Stopped (signal) from child
Before calling waitid() for the child
Enable PTRACE_FORK in EVENT_MASK for the child 10272
Before resuming the child process where it left off and without signal to be sent
Before calling waitid() for the child 10272
Reported PTRACE_FORK event with forkee 21033
Before calling waitid() for the forkee 21033 of the child 10272

Test case: kernel/t_ptrace_waitid/fpregs2

Duration: 0.021153 seconds

Termination reason

FAILED: /usr/src/tests/kernel/t_ptrace_wait.c:3894: ptrace(PT_SETFPREGS, child, &r, 0) != -1 not met

Standard output stream

Before forking process PID=11995
Parent process PID=11995, child's PID=11570
Before calling waitid() for the child
Before calling PT_TRACE_ME from child 11570
Before raising Stopped (signal) from child
Call GETFPREGS for the child process
Call SETFPREGS for the child (without changed regs)

Test case: kernel/t_ptrace_waitid/vfork1

Duration: 300.010029 seconds

Termination reason

FAILED: Test case timed out after 300 seconds

Standard output stream

Before forking process PID=10400
Parent process PID=10400, child's PID=10303
Before calling waitid() for the child
Before calling PT_TRACE_ME from child 10303
Before raising Stopped (signal) from child
Enable PTRACE_VFORK in EVENT_MASK for the child 10303
Before resuming the child process where it left off and without signal to be sent
Before calling waitid() for the child 10303
Reported PTRACE_VFORK event with forkee 0
Before calling waitid() for the forkee 0 of the child 10303

Test case: kernel/t_ptrace_waitpid/fork1

Duration: 0.025768 seconds

Termination reason

FAILED: /usr/src/tests/kernel/t_ptrace_wait.h:295: Reported exited process

Standard output stream

Before forking process PID=23191
Before calling PT_TRACE_ME from child 23623
Parent process PID=23191, child's PID=23623
Before calling waitpid() for the child
Before raising Stopped (signal) from child
Enable PTRACE_FORK in EVENT_MASK for the child 23623
Before resuming the child process where it left off and without signal to be sent
Before calling waitpid() for the child 23623
Reported PTRACE_FORK event with forkee 21225
Before calling waitpid() for the forkee 21225 of the child 23623

Test case: kernel/t_ptrace_waitpid/fpregs2

Duration: 0.018589 seconds

Termination reason

FAILED: /usr/src/tests/kernel/t_ptrace_wait.c:3894: ptrace(PT_SETFPREGS, child, &r, 0) != -1 not met

Standard output stream

Before forking process PID=18899
Parent process PID=18899, child's PID=24462
Before calling waitpid() for the child
Before calling PT_TRACE_ME from child 24462
Before raising Stopped (signal) from child
Call GETFPREGS for the child process
Call SETFPREGS for the child (without changed regs)

Test