ATF Tests Results

Execution summary

Item

Value

ATF

Version

Automated Testing Framework 0.20 (atf-0.20)

Timings

Start time of tests

Sun Dec 11 21:55:51 CET 2016

End time of tests

Sun Dec 11 22:17:44 CET 2016

System information

Host name

thirdstage.duskware.de

Operating system

NetBSD

Operating system release

7.99.45

Operating system version

NetBSD 7.99.45 (MODULAR) #580: Sun Dec 11 20:53:54 CET 2016 martin@thirdstage.duskware.de:/usr/src/sys/arch/sparc64/compile/MODULAR

Platform

sparc64

Tests results

Root

/usr/tests

Test programs

675

Bogus test programs

0

Test cases

4781

Passed test cases

4644

Failed test cases

18

Expected failures

37

Skipped test cases

82

See more execution details

Test cases summary

Test case

Result

Reason

Duration

bin/cat/t_cat

0.501429s

align

Passed

N/A

0.221956s

nonexistent

Passed

N/A

0.134481s

se_output

Passed

N/A

0.142825s

bin/cp/t_cp

2.303555s

dir_to_dir

Passed

N/A

0.529384s

dir_to_file

Passed

N/A

0.178794s

file_over_link

Passed

N/A

0.154887s

file_to_file

Passed

N/A

0.343136s

file_to_link

Passed

N/A

0.157337s

file_to_linkdir

Passed

N/A

0.221408s

files_to_dir

Passed

N/A

0.183704s

link_over_file

Passed

N/A

0.155610s

link_to_file

Passed

N/A

0.175230s

linkdir_to_file

Passed

N/A

0.183639s

bin/dd/t_dd

0.998821s

io

Passed

N/A

0.497917s

length

Passed

N/A

0.190533s

seek

Passed

N/A

0.307551s

bin/df/t_df

0.305413s

hflag

Passed

N/A

0.152709s

normal

Passed

N/A

0.150721s

bin/expr/t_expr

2.088935s

arithmetic_ops

Passed

N/A

0.165204s

basic_functional

Passed

N/A

0.130480s

basic_math

Passed

N/A

0.108785s

colon_vs_math

Passed

N/A

0.120445s

compare_ops

Passed

N/A

0.239160s

compare_ops_precedence

Passed

N/A

0.109823s

gtkmm

Passed

N/A

0.161831s

lang

Passed

N/A

0.216709s

math_precedence

Passed

N/A

0.113855s

multiply

Passed

N/A

0.113794s

negative

Passed

N/A

0.150111s

overflow

Passed

N/A

0.229689s

precedence

Passed

N/A

0.110280s

regex

Passed

N/A

0.110023s

bin/pax/t_pax

0.565226s

append

Passed

N/A

0.563773s

bin/ps/t_ps

3.042039s

default_columns

Passed

N/A

0.889822s

duplicate_column

Passed

N/A

0.226741s

minus_O

Passed

N/A

0.310424s

minus_o

Passed

N/A

0.383199s

override_heading_all_null

Passed

N/A

0.260849s

override_heading_embedded_specials

Passed

N/A

0.321151s

override_heading_simple

Passed

N/A

0.314987s

override_heading_some_null

Failed

heading [-o holdcnt -o holdcnt -o holdcnt]: expected [^HOLDCNT HOLDCNT HOLDCNT$], got [ HOLDCNT HOLDCNT HOLDCNT]

0.328667s

bin/sh/dotcmd/t_dotcmd

38.043685s

case_break_case

Passed

N/A

0.216036s

case_break_compound

Passed

N/A

0.194173s

case_break_file

Passed

N/A

0.197074s

case_break_for

Passed

N/A

0.201878s

case_break_func

Passed

N/A

0.192578s

case_break_subshell

Passed

N/A

0.196231s

case_break_until

Passed

N/A

0.188812s

case_break_while

Passed

N/A

0.198459s

case_continue_case

Passed

N/A

0.194909s

case_continue_compound

Passed

N/A

0.194759s

case_continue_file

Passed

N/A

0.198461s

case_continue_for

Passed

N/A

0.199604s

case_continue_func

Passed

N/A

0.203799s

case_continue_subshell

Passed

N/A

0.195841s

case_continue_until

Passed

N/A

0.191054s

case_continue_while

Passed

N/A

0.193660s

case_return_case

Passed

N/A

0.199706s

case_return_compound

Passed

N/A

0.190557s

case_return_file

Passed

N/A

0.195845s

case_return_for

Passed

N/A

0.193776s

case_return_func

Passed

N/A

0.199343s

case_return_subshell

Passed

N/A

0.214334s

case_return_until

Passed

N/A

0.204727s

case_return_while

Passed

N/A

0.191354s

compound_break_case

Passed

N/A

0.199882s

compound_break_compound

Passed

N/A

0.194241s

compound_break_file

Passed

N/A

0.205608s

compound_break_for

Passed

N/A

0.200894s

compound_break_func

Passed

N/A

0.198169s

compound_break_subshell

Passed

N/A

0.199687s

compound_break_until

Passed

N/A

0.204342s

compound_break_while

Passed

N/A

0.206116s

compound_continue_case

Passed

N/A

0.195661s

compound_continue_compound

Passed

N/A

0.197164s

compound_continue_file

Passed

N/A

0.189343s

compound_continue_for

Passed

N/A

0.196449s

compound_continue_func

Passed

N/A

0.199881s

compound_continue_subshell

Passed

N/A

0.200941s

compound_continue_until

Passed

N/A

0.200792s

compound_continue_while

Passed

N/A

0.188819s

compound_return_case

Passed

N/A

0.195306s

compound_return_compound

Passed

N/A

0.190958s

compound_return_file

Passed

N/A

0.189387s

compound_return_for

Passed

N/A

0.196664s

compound_return_func

Passed

N/A

0.191328s

compound_return_subshell

Passed

N/A

0.192646s

compound_return_until

Passed

N/A

0.200077s

compound_return_while

Passed

N/A

0.200293s

file_break_case

Passed

N/A

0.198400s

file_break_compound

Passed

N/A

0.199589s

file_break_file

Passed

N/A

0.197814s

file_break_for

Passed

N/A

0.189132s

file_break_func

Passed

N/A

0.199481s

file_break_subshell

Passed

N/A

0.200320s

file_break_until

Passed

N/A

0.189328s

file_break_while

Passed

N/A

0.192333s

file_continue_case

Passed

N/A

0.190615s

file_continue_compound

Passed

N/A

0.193661s

file_continue_file

Passed

N/A

0.193764s

file_continue_for

Passed

N/A

0.197096s

file_continue_func

Passed

N/A

0.202530s

file_continue_subshell

Passed

N/A

0.203576s

file_continue_until

Passed

N/A

0.198889s

file_continue_while

Passed

N/A

0.201005s

file_return_case

Passed

N/A

0.194184s

file_return_compound

Passed

N/A

0.196104s

file_return_file

Passed

N/A

0.189904s

file_return_for

Passed

N/A

0.192964s

file_return_func

Passed

N/A

0.190560s

file_return_subshell

Passed

N/A

0.192774s

file_return_until

Passed

N/A

0.197380s

file_return_while

Passed

N/A

0.190659s

for_break_case

Passed

N/A

0.200347s

for_break_compound

Passed

N/A

0.198449s

for_break_file

Passed

N/A

0.188963s

for_break_for

Passed

N/A

0.235177s

for_break_func

Passed

N/A

0.207825s

for_break_subshell

Passed

N/A

0.206045s

for_break_until

Passed

N/A

0.190433s

for_break_while

Passed

N/A

0.190571s

for_continue_case

Passed

N/A

0.193619s

for_continue_compound

Passed

N/A

0.192046s

for_continue_file

Passed

N/A

0.203291s

for_continue_for

Passed

N/A

0.199314s

for_continue_func

Passed

N/A

0.198785s

for_continue_subshell

Passed

N/A

0.204471s

for_continue_until

Passed

N/A

0.199873s

for_continue_while

Passed

N/A

0.198037s

for_return_case

Passed

N/A

0.199927s

for_return_compound

Passed

N/A

0.197205s

for_return_file

Passed

N/A

0.196985s

for_return_for

Passed

N/A

0.200584s

for_return_func

Passed

N/A

0.198471s

for_return_subshell

Passed

N/A

0.209656s

for_return_until

Passed

N/A

0.198940s

for_return_while

Passed

N/A

0.196562s

func_break_case

Passed

N/A

0.197517s

func_break_compound

Passed

N/A

0.200296s

func_break_file

Passed

N/A

0.191197s

func_break_for

Passed

N/A

0.190375s

func_break_func

Passed

N/A

0.189982s

func_break_subshell

Passed

N/A

0.203405s

func_break_until

Passed

N/A

0.190201s

func_break_while

Passed

N/A

0.198275s

func_continue_case

Passed

N/A

0.190274s

func_continue_compound

Passed

N/A

0.190991s

func_continue_file

Passed

N/A

0.198202s

func_continue_for

Passed

N/A

0.199065s

func_continue_func

Passed

N/A

0.203093s

func_continue_subshell

Passed

N/A

0.203947s

func_continue_until

Passed

N/A

0.197313s

func_continue_while

Passed

N/A

0.203132s

func_return_case

Passed

N/A

0.197032s

func_return_compound

Passed

N/A

0.197208s

func_return_file

Passed

N/A

0.197765s

func_return_for

Passed

N/A

0.196923s

func_return_func

Passed

N/A

0.196652s

func_return_subshell

Passed

N/A

0.194072s

func_return_until

Passed

N/A

0.200384s

func_return_while

Passed

N/A

0.190386s

subshell_break_case

Passed

N/A

0.197989s

subshell_break_compound

Passed

N/A

0.198783s

subshell_break_file

Passed

N/A

0.194384s

subshell_break_for

Passed

N/A

0.199409s

subshell_break_func

Passed

N/A

0.193547s

subshell_break_subshell

Passed

N/A

0.201518s

subshell_break_until

Passed

N/A

0.220026s

subshell_break_while

Passed

N/A

0.204258s

subshell_continue_case

Passed

N/A

0.201016s

subshell_continue_compound

Passed

N/A

0.206193s

subshell_continue_file

Passed

N/A

0.201135s

subshell_continue_for

Passed

N/A

0.204304s

subshell_continue_func

Passed

N/A

0.195070s

subshell_continue_subshell

Passed

N/A

0.200428s

subshell_continue_until

Passed

N/A

0.195367s

subshell_continue_while

Passed

N/A

0.192278s

subshell_return_case

Passed

N/A

0.194069s

subshell_return_compound

Passed

N/A

0.194565s

subshell_return_file

Passed

N/A

0.195790s

subshell_return_for

Passed

N/A

0.200541s

subshell_return_func

Passed

N/A

0.199254s

subshell_return_subshell

Passed

N/A

0.198836s

subshell_return_until

Passed

N/A

0.198384s

subshell_return_while

Passed

N/A

0.193660s

until_break_case

Passed

N/A

0.190694s

until_break_compound

Passed

N/A

0.194549s

until_break_file

Passed

N/A

0.194560s

until_break_for

Passed

N/A

0.195567s

until_break_func

Passed

N/A

0.197909s

until_break_subshell

Passed

N/A

0.207235s

until_break_until

Passed

N/A

0.199642s

until_break_while

Passed

N/A

0.202771s

until_continue_case

Passed

N/A

0.193957s

until_continue_compound

Passed

N/A

0.196605s

until_continue_file

Passed

N/A

0.193241s

until_continue_for

Passed

N/A

0.191790s

until_continue_func

Passed

N/A

0.205304s

until_continue_subshell

Passed

N/A

0.198296s

until_continue_until

Passed

N/A

0.198532s

until_continue_while

Passed

N/A

0.192252s

until_return_case

Passed

N/A

0.191937s

until_return_compound

Passed

N/A

0.195789s

until_return_file

Passed

N/A

0.195060s

until_return_for

Passed

N/A

0.189784s

until_return_func

Passed

N/A

0.192229s

until_return_subshell

Passed

N/A

0.196928s

until_return_until

Passed

N/A

0.192152s

until_return_while

Passed

N/A

0.197798s

while_break_case

Passed

N/A

0.196692s

while_break_compound

Passed

N/A

0.189817s

while_break_file

Passed

N/A

0.189984s

while_break_for

Passed

N/A

0.192863s

while_break_func

Passed

N/A

0.192745s

while_break_subshell

Passed

N/A

0.198239s

while_break_until

Passed

N/A

0.193441s

while_break_while

Passed

N/A

0.192359s

while_continue_case

Passed

N/A

0.193187s

while_continue_compound

Passed

N/A

0.254427s

while_continue_file

Passed

N/A

0.194113s

while_continue_for

Passed

N/A

0.193256s

while_continue_func

Passed

N/A

0.197885s

while_continue_subshell

Passed

N/A

0.200079s

while_continue_until

Passed

N/A

0.195879s

while_continue_while

Passed

N/A

0.189997s

while_return_case

Passed

N/A

0.194868s

while_return_compound

Passed

N/A

0.192337s

while_return_file

Passed

N/A

0.190703s

while_return_for

Passed

N/A

0.190723s

while_return_func

Passed

N/A

0.200312s

while_return_subshell

Passed

N/A

0.203916s

while_return_until

Passed

N/A

0.196784s

while_return_while

Passed

N/A

0.198108s

bin/sh/t_arith

12.742305s

constants

Passed

N/A

0.754116s

do_unary_minus

Passed

N/A

0.395633s

do_unary_not

Passed

N/A

0.336487s

do_unary_plus

Passed

N/A

0.332665s

do_unary_tilde

Passed

N/A

0.284527s

elementary_add

Passed

N/A

0.505879s

elementary_div

Passed

N/A

0.471549s

elementary_eq

Passed

N/A

0.598939s

elementary_ge

Passed

N/A

0.284698s

elementary_gt

Passed

N/A

0.536324s

elementary_le

Passed

N/A

0.440037s

elementary_lt

Passed

N/A

0.409506s

elementary_mul

Passed

N/A

0.574050s

elementary_ne

Passed

N/A

0.505448s

elementary_rem

Passed

N/A

0.685501s

elementary_shl

Passed

N/A

0.428802s

elementary_shr

Passed

N/A

0.526898s

elementary_sub

Passed

N/A

0.491865s

fiddle_bits_and

Passed

N/A

0.401029s

fiddle_bits_or

Passed

N/A

0.395672s

fiddle_bits_xor

Passed

N/A

0.397649s

logical_and

Passed

N/A

0.364963s

logical_or

Passed

N/A

0.364775s

make_selection

Passed

N/A

0.364098s

operator_precedence

Passed

N/A

0.967335s

parentheses

Passed

N/A

0.904659s

bin/sh/t_cmdsub

7.450350s

a_basic_cmdsub

Passed

N/A

0.605755s

b_basic_backticks

Passed

N/A

0.604402s

c_nested_cmdsub

Passed

N/A

0.219699s

d_nested_backticks

Passed

N/A

0.226560s

e_perverse_mixing

Passed

N/A

0.300405s

f_redirect_in_cmdsub

Passed

N/A

0.337486s

g_redirect_in_backticks

Passed

N/A

0.339718s

h_vars_in_cmdsub

Passed

N/A

0.446120s

i_vars_in_backticks

Passed

N/A

0.416913s

j_cmdsub_in_varexpand

Passed

N/A

0.232224s

k_backticks_in_varexpand

Passed

N/A

0.234197s

l_arithmetic_in_cmdsub

Passed

N/A

0.206141s

m_arithmetic_in_backticks

Passed

N/A

0.207025s

n_cmdsub_in_arithmetic

Passed

N/A

0.207293s

o_backticks_in_arithmetic

Passed

N/A

0.207107s

p_cmdsub_in_heredoc

Passed

N/A

0.155006s

q_backticks_in_heredoc

Passed

N/A

0.156588s

r_heredoc_in_cmdsub

Passed

N/A

0.253421s

s_heredoc_in_backticks

Passed

N/A

0.192004s

t_nested_cmdsubs_in_heredoc

Passed

N/A

0.280583s

u_nested_backticks_in_heredoc

Passed

N/A

0.278212s

v_cmdsub_paren_tests

Passed

N/A

0.631962s

w_heredoc_outside_cmdsub

Passed

N/A

0.244963s

x_heredoc_outside_backticks

Passed

N/A

0.196889s

z_absurd_heredoc_cmdsub_combos

Passed

N/A

0.240721s

bin/sh/t_evaltested

0.115016s

evaltested

Passed

N/A

0.113916s

bin/sh/t_exit

2.397392s

background

Passed

N/A

0.164253s

function

Passed

N/A

0.139347s

readout

Passed

N/A

0.135785s

simple_exit

Passed

N/A

0.645078s

subshell_background

Passed

N/A

0.164383s

subshell_exit

Passed

N/A

0.708035s

trap_subshell

Passed

N/A

0.152233s

trap_zero__explicit_exit

Passed

N/A

0.143711s

trap_zero__implicit_exit

Passed

N/A

0.137300s

bin/sh/t_expand

2.417738s

arithmetic

Passed

N/A

0.188673s

dollar_at

Passed

N/A

0.212688s

dollar_at_with_text

Passed

N/A

0.489754s

iteration_on_null_or_missing_parameter

Passed

N/A

0.127043s

iteration_on_null_or_null_parameter

Passed

N/A

0.124431s

iteration_on_null_parameter

Passed

N/A

0.125861s

iteration_on_quoted_null_parameter

Passed

N/A

0.126728s

shell_params

Passed

N/A

0.422157s

strip

Passed

N/A

0.466709s

varpattern_backslashes

Passed

N/A

0.126595s

bin/sh/t_fsplit

3.314942s

default_val

Passed

N/A

0.708999s

dollar_at

Passed

N/A

0.633263s

for

Passed

N/A

0.122566s

ifs

Passed

N/A

0.325360s

ifs_alpha

Passed

N/A

0.215265s

quote

Passed

N/A

0.155706s

replacement_val

Passed

N/A

0.953830s

var_length

Passed

N/A

0.193159s

bin/sh/t_here

11.303332s

do_simple

Passed

N/A

0.858192s

end_markers

Passed

N/A

8.342382s

incomplete

Passed

N/A

0.530302s

lineends

Passed

N/A

0.465566s

multiple

Passed

N/A

0.282933s

nested

Passed

N/A

0.215810s

quoting

Passed

N/A

0.244209s

side_effects

Passed

N/A

0.144513s

vicious

Passed

N/A

0.211745s

bin/sh/t_option

6.911909s

Option_switching

Passed

N/A

1.518836s

restore_local_opts

Passed

N/A

0.191910s

set_C

Passed

N/A

0.438347s

set_a

Passed

N/A

0.262429s

set_e

Passed

N/A

0.260145s

set_f

Passed

N/A

0.264809s

set_n

Passed

N/A

2.426782s

set_u

Passed

N/A

0.562371s

set_v

Passed

N/A

0.312358s

set_x

Passed

N/A

0.259889s

vi_emacs_VE_toggle

Passed

N/A

0.275880s

xx_bogus

Passed

N/A

0.125427s

bin/sh/t_redir

-3304.646622s

basic_test_method_test

Passed

N/A

0.426567s

do_input_redirections

Passed

N/A

0.723342s

do_output_redirections

Passed

N/A

0.709539s

fd_redirections

Passed

N/A

1.167760s

incorrect_redirections

Passed

N/A

0.562628s

local_redirections

Passed

N/A

0.285267s

named_fd_redirections

Passed

N/A

0.366613s

redir_here_doc

Passed

N/A

0.143779s

redir_in_case

Passed

N/A

0.216377s

subshell_redirections

Passed

N/A

0.302761s

ulimit_redirection_interaction

Passed

N/A

0.299427s

validate_fn_redirects

Passed

N/A

-3309.414903s

bin/sh/t_redircloexec

1.199293s

compound_redir_open

Passed

N/A

0.143855s

exec_redir_closed

Passed

N/A

0.309256s

exec_redir_open

Passed

N/A

0.305888s

loop_redir_open

Passed

N/A

0.142295s

simple_redir_open

Passed

N/A

0.145088s

subshell_redir_open

Passed

N/A

0.148679s

bin/sh/t_set_e

2.555972s

all

Passed

N/A

2.555018s

bin/sh/t_shift

1.733681s

basic_shift_test

Passed

N/A

0.516058s

excessive_shift

Passed

N/A

0.418727s

function_shift

Passed

N/A

0.098118s

non_numeric_shift

Passed

N/A

0.410487s

too_many_args

Passed

N/A

0.286985s

bin/sh/t_ulimit

0.199484s

limits

Passed

N/A

0.198715s

bin/sh/t_varquote

0.411659s

all

Passed

N/A

0.118743s

default_assignment_with_arith

Passed

N/A

0.160662s

nested_quotes_multiword

Passed

N/A

0.129784s

bin/sh/t_varval

4.704556s

aaa

Passed

N/A

0.296305s

assignment

Passed

N/A

1.057943s

cmdline

Passed

N/A

0.986151s

read

Passed

N/A

1.136220s

redirect

Passed

N/A

1.119478s

bin/sh/t_wait

21.731591s

basic_wait

Passed

N/A

6.267768s

individual

Passed

N/A

3.117292s

jobs

Passed

N/A

7.169794s

kill

Passed

N/A

5.172930s

bin/sleep/t_sleep

2.151169s

fraction

Passed

N/A

0.813089s

hex

Passed

N/A

1.129253s

nonnumeric

Passed

N/A

0.206850s

bin/tar/t_tar

0.242364s

append

Passed

N/A

0.240891s

dev/cgd/t_cgd_3des

0.300671s

cgd_3des_cbc_192_encblkno1

Passed

N/A

0.223558s

cgd_3des_cbc_192_encblkno8

Passed

N/A

0.075923s

dev/cgd/t_cgd_aes

0.651177s

cgd_aes_cbc_128_encblkno1

Passed

N/A

0.075735s

cgd_aes_cbc_128_encblkno8

Passed

N/A

0.076238s

cgd_aes_cbc_192_encblkno1

Passed

N/A

0.075239s

cgd_aes_cbc_192_encblkno8

Passed

N/A

0.082659s

cgd_aes_cbc_256_encblkno1

Passed

N/A

0.084675s

cgd_aes_cbc_256_encblkno8

Passed

N/A

0.084283s

cgd_aes_xts_256

Passed

N/A

0.084334s

cgd_aes_xts_512

Passed

N/A

0.083108s

dev/cgd/t_cgd_blowfish

0.498881s

cgd_bf_cbc_128_encblkno1

Passed

N/A

0.076324s

cgd_bf_cbc_128_encblkno8

Passed

N/A

0.083917s

cgd_bf_cbc_256_encblkno1

Passed

N/A

0.080929s

cgd_bf_cbc_256_encblkno8

Passed

N/A

0.085764s

cgd_bf_cbc_448_encblkno1

Passed

N/A

0.084108s

cgd_bf_cbc_448_encblkno8

Passed

N/A

0.083901s

dev/cgd/t_cgd

2.929022s

basic

Passed

N/A

0.648492s

unaligned_write

Passed

N/A

1.647839s

wrongpass

Passed

N/A

0.629579s

dev/clock_subr/t_clock_subr

0.028091s

secs_to_ymdhms

Passed

N/A

0.013598s

ymdhms_to_secs

Passed

N/A

0.012920s

dev/fss/t_fss

0.589776s

basic

Passed

N/A

0.585112s

dev/raidframe/t_raid

19.722370s

raid1_comp0fail

Passed

N/A

3.795596s

raid1_compfail

Passed

N/A

3.815132s

raid1_normal

Passed

N/A

3.773695s

raid5_compfail

Passed

N/A

3.818518s

raid5_normal

Passed

N/A

3.775590s

smalldisk

Passed

N/A

0.429719s

dev/audio/t_pad

0.510280s

pad_output

Failed

atf-check failed; see the output of the test for details

0.509262s

dev/md/t_md

0.516761s

basic

Passed

N/A

0.515672s

dev/scsipi/t_cd

0.093493s

noisyeject

Passed

N/A

0.092604s

dev/sysmon/t_swwdog

5.493322s

disarm

Passed

N/A

2.498108s

panic

Passed

N/A

1.512407s

reboot

Passed

N/A

1.474124s

dev/sysmon/t_swsensor

121.392314s

alarm_sensor

Passed

N/A

28.365850s

entropy_interrupt_sensor

Passed

N/A

16.875028s

entropy_polled_sensor

Passed

N/A

32.216092s

limit_sensor

Passed

N/A

27.058893s

simple_sensor

Passed

N/A

16.868292s

dev/usb/t_hid

0.089377s

khid

Passed

N/A

0.044955s

khid_parse_just_pop

Passed

N/A

0.042874s

games/t_factor

0.738328s

loop1

Passed

N/A

0.226522s

loop2

Passed

N/A

0.172415s

overflow1

Passed

N/A

0.166762s

overflow2

Passed

N/A

0.168994s

include/machine/t_bswap

0.081794s

bswap16_basic

Passed

N/A

0.013257s

bswap16_unconst

Passed

N/A

0.012836s

bswap32_basic

Passed

N/A

0.013090s

bswap32_unconst

Passed

N/A

0.012816s

bswap64_basic

Passed

N/A

0.012704s

bswap64_unconst

Passed

N/A

0.012868s

include/sys/t_bitops

0.089007s

bitmap_basic

Passed

N/A

0.015954s

fast_divide32

Passed

N/A

0.013245s

ffsfls

Passed

N/A

0.013855s

ilog2_32bit

Passed

N/A

0.013902s

ilog2_64bit

Passed

N/A

0.013772s

ilog2_const

Passed

N/A

0.013989s

include/sys/t_bootblock

0.026579s

mbr_partition

Passed

N/A

0.012703s

mbr_sector

Passed

N/A

0.012396s

include/sys/t_cdefs

0.106927s

sissigned

Passed

N/A

0.012844s

stypefit

Passed

N/A

0.012886s

stypemask

Passed

N/A

0.012550s

stypeminmax

Passed

N/A

0.012796s

uissigned

Passed

N/A

0.012517s

utypefit

Passed

N/A

0.012582s

utypemask

Passed

N/A

0.012810s

utypeminmax

Passed

N/A

0.012504s

include/sys/t_pslist

0.013740s

misc

Passed

N/A

0.012856s

include/sys/t_tree

0.501407s

tree_rbstress

Passed

N/A

0.500584s

include/sys/t_types

0.039956s

types_limits

Passed

N/A

0.012854s

types_signed

Passed

N/A

0.012511s

types_unsigned

Passed

N/A

0.012485s

include/sys/t_socket

0.242873s

cmsg_sendfd

Passed

N/A

0.085225s

cmsg_sendfd_bounds

Passed

N/A

0.077692s

sock_cloexec

Passed

N/A

0.077653s

include/t_bitstring

0.223183s

bits_27

Passed

N/A

0.031024s

bits_32

Passed

N/A

0.037825s

bits_49

Passed

N/A

0.042582s

bits_64

Passed

N/A

0.035963s

bits_67

Passed

N/A

0.037992s

bits_8

Passed

N/A

0.031645s

include/t_errno

0.013095s

errno_constants

Expected failure

PR standards/44921: 2 checks failed as expected; see output for more details

0.012240s

include/t_glob

0.012611s

glob_types

Passed

N/A

0.011795s

include/t_inttypes

0.012853s

int_fmtio

Passed

N/A

0.011971s

include/t_limits

0.038853s

char

Passed

N/A

0.013556s

posix

Passed

N/A

0.011323s

short

Passed

N/A

0.011191s

include/t_netdb

0.013632s

netdb_constants

Expected failure

PR standards/44777: 2 checks failed as expected; see output for more details

0.012493s

include/t_paths

0.012816s

paths

Skipped

PR port-sparc/45580

0.011960s

include/t_stdint

0.024438s

int16

Passed

N/A

0.011686s

int8

Passed

N/A

0.011148s

kernel/kqueue/read/t_fifo

0.013565s

fifo

Passed

N/A

0.012680s

kernel/kqueue/read/t_file

6.066333s

file

Passed

N/A

6.065602s

kernel/kqueue/read/t_file2

0.012378s

file2

Passed

N/A

0.011493s

kernel/kqueue/read/t_pipe

0.012293s

pipe

Passed

N/A

0.011739s

kernel/kqueue/read/t_ttypty

2.036210s

master

Passed

N/A

1.015741s

slave

Passed

N/A

1.019408s

kernel/kqueue/write/t_fifo

0.015433s

fifo

Passed

N/A

0.014725s

kernel/kqueue/write/t_pipe

0.094876s

pipe1

Passed

N/A

0.067089s

pipe2

Passed

N/A

0.014855s

pipe3

Passed

N/A

0.011287s

kernel/kqueue/write/t_ttypty

2.042213s

master

Passed

N/A

1.021672s

slave

Passed

N/A

1.019480s

kernel/kqueue/t_ioctl

0.024956s

kfilter_byfilter

Passed

N/A

0.012315s

kfilter_byname

Passed

N/A

0.011622s

kernel/kqueue/t_proc1

2.025633s

proc1

Passed

N/A

2.025042s

kernel/kqueue/t_proc2

2.054229s

proc2

Passed

N/A

2.053624s

kernel/kqueue/t_proc3

0.016119s

proc3

Passed

N/A

0.015547s

kernel/kqueue/t_sig

12.072205s

sig

Passed

N/A

12.071663s

kernel/kqueue/t_vnode

0.468647s

dir_no_note_link_create_file_in

Passed

N/A

0.025302s

dir_no_note_link_delete_file_in

Passed

N/A

0.025916s

dir_no_note_link_mv_dir_within

Passed

N/A

0.026091s

dir_no_note_link_mv_file_within

Passed

N/A

0.025427s

dir_note_link_create_dir_in

Passed

N/A

0.026548s

dir_note_link_delete_dir_in

Passed

N/A

0.026753s

dir_note_link_mv_dir_in

Passed

N/A

0.026611s

dir_note_link_mv_dir_out

Passed

N/A

0.026592s

dir_note_write_create_dir_in

Passed

N/A

0.026563s

dir_note_write_create_file_in

Passed

N/A

0.024835s

dir_note_write_delete_dir_in

Passed

N/A

0.024266s

dir_note_write_delete_file_in

Passed

N/A

0.024281s

dir_note_write_mv_dir_in

Passed

N/A

0.024255s

dir_note_write_mv_dir_out

Passed

N/A

0.024291s

dir_note_write_mv_dir_within

Passed

N/A

0.024568s

dir_note_write_mv_file_in

Passed

N/A

0.024490s

dir_note_write_mv_file_out

Passed

N/A

0.024362s

dir_note_write_mv_file_within

Passed

N/A

0.024258s

kernel/tty/t_pr

0.199606s

client_first

Passed

N/A

0.063019s

master_first

Passed

N/A

0.067366s

ptyioctl

Passed

N/A

0.066885s

kernel/t_lock

1.010200s

lock

Passed

N/A

1.009313s

kernel/t_lockf

61.058794s

deadlock

Passed

N/A

1.019684s

randlock

Passed

N/A

60.037401s

kernel/t_ptrace

0.069548s

attach_chroot

Passed

N/A

0.015921s

attach_pid0

Passed

N/A

0.011882s

attach_pid1

Passed

N/A

0.014169s

attach_pid1_securelevel

Skipped

Test must be run with securelevel >= 1

0.012304s

attach_self

Passed

N/A

0.011728s

kernel/t_ptrace_wait

0.976334s

attach3

Passed

N/A

0.020810s

attach4

Passed

N/A

0.019265s

eventmask1

Passed

N/A

0.019155s

eventmask2

Passed

N/A

0.018887s

fork2

Passed

N/A

0.021275s

fpregs1

Passed

N/A

0.018376s

fpregs2

Failed

/usr/src/tests/kernel/t_ptrace_wait.c:3894: ptrace(PT_SETFPREGS, child, &r, 0) != -1 not met

0.019163s

io_read_d1

Passed

N/A

0.019458s

io_read_d2

Passed

N/A

0.019452s

io_read_d3

Passed

N/A

0.020662s

io_read_d4

Passed

N/A

0.020416s

io_read_d_write_d_handshake1

Passed

N/A

0.020984s

io_read_d_write_d_handshake2

Passed

N/A

0.021287s

io_read_i1

Passed

N/A

0.020056s

io_read_i2

Passed

N/A

0.018715s

io_read_i3

Passed

N/A

0.018261s

io_read_i4

Passed

N/A

0.017610s

io_write_d1

Passed

N/A

0.019557s

io_write_d2

Passed

N/A

0.019267s

io_write_d3

Passed

N/A

0.017630s

io_write_d4

Passed

N/A

0.019658s

kill1

Passed

N/A

0.020352s

kill2

Passed

N/A

0.020312s

lwpinfo1

Passed

N/A

0.022857s

read_d1

Passed

N/A

0.020031s

read_d2

Passed

N/A

0.018397s

read_d3

Passed

N/A

0.019806s

read_d4

Passed

N/A

0.019474s

read_d_write_d_handshake1

Passed

N/A

0.019157s

read_d_write_d_handshake2

Passed

N/A

0.019312s

read_i1

Passed

N/A

0.019339s

read_i2

Passed

N/A

0.019319s

read_i3

Passed

N/A

0.019587s

read_i4

Passed

N/A

0.019115s

regs1

Passed

N/A

0.019191s

regs2

Passed

N/A

0.019226s

regs3

Passed

N/A

0.019333s

regs4

Passed

N/A

0.019240s

regs5

Passed

N/A

0.019368s

traceme1

Passed

N/A

0.019423s

traceme2

Passed

N/A

0.019722s

traceme3

Passed

N/A

0.019080s

traceme4

Passed

N/A

0.019689s

vfork2

Passed

N/A

0.020233s

write_d1

Passed

N/A

0.018236s

write_d2

Passed

N/A

0.019871s

write_d3

Passed

N/A

0.020404s

write_d4

Passed

N/A

0.021603s

kernel/t_ptrace_wait3

0.979410s

attach3

Passed

N/A

0.028059s

attach4

Passed

N/A

0.018724s

eventmask1

Passed

N/A

0.020360s

eventmask2

Passed

N/A

0.019709s

fork2

Passed

N/A

0.022271s

fpregs1

Passed

N/A

0.021550s

fpregs2

Failed

/usr/src/tests/kernel/t_ptrace_wait.c:3894: ptrace(PT_SETFPREGS, child, &r, 0) != -1 not met

0.020026s

io_read_d1

Passed

N/A

0.018826s

io_read_d2

Passed

N/A

0.019217s

io_read_d3

Passed

N/A

0.019139s

io_read_d4

Passed

N/A

0.019370s

io_read_d_write_d_handshake1

Passed

N/A

0.020082s

io_read_d_write_d_handshake2

Passed

N/A

0.019884s

io_read_i1

Passed

N/A

0.018951s

io_read_i2

Passed

N/A

0.019795s

io_read_i3

Passed

N/A

0.019484s

io_read_i4

Passed

N/A

0.018754s

io_write_d1

Passed

N/A

0.018904s

io_write_d2

Passed

N/A

0.018774s

io_write_d3

Passed

N/A

0.018891s

io_write_d4

Passed

N/A

0.018925s

kill1

Passed

N/A

0.018698s

kill2

Passed

N/A

0.018826s

lwpinfo1

Passed

N/A

0.019546s

read_d1

Passed

N/A

0.018735s

read_d2

Passed

N/A

0.021247s

read_d3

Passed

N/A

0.019033s

read_d4

Passed

N/A

0.019289s

read_d_write_d_handshake1

Passed

N/A

0.018981s

read_d_write_d_handshake2

Passed

N/A

0.018955s

read_i1

Passed

N/A

0.018887s

read_i2

Passed

N/A

0.019134s

read_i3

Passed

N/A

0.019209s

read_i4

Passed

N/A

0.019388s

regs1

Passed

N/A

0.018828s

regs2

Passed

N/A

0.018859s

regs3

Passed

N/A

0.018435s

regs4

Passed

N/A

0.020732s

regs5

Passed

N/A

0.018827s

traceme1

Passed

N/A

0.018900s

traceme2

Passed

N/A

0.019218s

traceme3

Passed

N/A

0.019222s

traceme4

Passed

N/A

0.019661s

vfork2

Passed

N/A

0.019522s

write_d1

Passed

N/A

0.018909s

write_d2

Passed

N/A

0.018753s

write_d3

Passed

N/A

0.021129s

write_d4

Passed

N/A

0.020377s

kernel/t_ptrace_wait4

1.252874s

attach1

Passed

N/A

0.027277s

attach2

Passed

N/A

0.022910s

attach3

Passed

N/A

0.021407s

attach4

Passed

N/A

0.017368s

attach5

Passed

N/A

0.021964s

attach6

Passed

N/A

0.031557s

attach7

Passed

N/A

0.038648s

eventmask1

Passed

N/A

0.020015s

eventmask2

Passed

N/A

0.019691s

fork1

Failed

/usr/src/tests/kernel/t_ptrace_wait.h:295: Reported exited process

0.022405s

fork2

Passed

N/A

0.021425s

fpregs1

Passed

N/A

0.021676s

fpregs2

Failed

/usr/src/tests/kernel/t_ptrace_wait.c:3894: ptrace(PT_SETFPREGS, child, &r, 0) != -1 not met

0.021609s

io_read_d1

Passed

N/A

0.022515s

io_read_d2

Passed

N/A

0.019562s

io_read_d3

Passed

N/A

0.019388s

io_read_d4

Passed

N/A

0.019232s

io_read_d_write_d_handshake1

Passed

N/A

0.020503s

io_read_d_write_d_handshake2

Passed

N/A

0.018989s

io_read_i1

Passed

N/A

0.019163s

io_read_i2

Passed

N/A

0.019361s

io_read_i3

Passed

N/A

0.019825s

io_read_i4

Passed

N/A

0.019010s

io_write_d1

Passed

N/A

0.019668s

io_write_d2

Passed

N/A

0.019828s

io_write_d3

Passed

N/A

0.018938s

io_write_d4

Passed

N/A

0.019599s

kill1

Passed

N/A

0.019624s

kill2

Passed

N/A

0.019471s

lwpinfo1

Passed

N/A

0.019820s

lwpinfo2

Passed

N/A

0.032947s

read_d1

Passed

N/A

0.021491s

read_d2

Passed

N/A

0.021696s

read_d3

Passed

N/A

0.022945s

read_d4

Passed

N/A

0.022287s

read_d_write_d_handshake1

Passed

N/A

0.022387s

read_d_write_d_handshake2

Passed

N/A

0.021482s

read_i1

Passed

N/A

0.019688s

read_i2

Passed

N/A

0.020890s

read_i3

Passed

N/A

0.021494s

read_i4

Passed

N/A

0.021367s

regs1

Passed

N/A

0.022485s

regs2

Passed

N/A

0.020484s

regs3

Passed

N/A

0.021848s

regs4

Passed

N/A

0.021375s

regs5

Passed

N/A

0.021802s

traceme1

Passed

N/A

0.021516s

traceme2

Passed

N/A

0.020953s

traceme3

Passed

N/A

0.020789s

traceme4

Passed

N/A

0.022081s

vfork1

Expected failure

PR kern/51630: /usr/src/tests/kernel/t_ptrace_wait.h:305: WSTOPSIG(status) != expected: Unexpected stop signal received [Child exited] != [Trace/BPT trap]

0.022861s

vfork2

Passed

N/A

0.020872s

write_d1

Passed

N/A

0.021059s

write_d2

Passed

N/A

0.020174s

write_d3

Passed

N/A

0.019959s

write_d4

Passed

N/A

0.020850s

kernel/t_ptrace_wait6

1.228445s

attach1

Passed

N/A

0.022533s

attach2

Passed

N/A

0.022073s

attach3

Passed

N/A

0.019769s

attach4

Passed

N/A

0.018355s

attach5

Passed

N/A

0.034793s

attach6

Passed

N/A

0.021412s

attach7

Passed

N/A

0.022707s

eventmask1

Passed

N/A

0.019439s

eventmask2

Passed

N/A

0.019175s

fork1

Failed

/usr/src/tests/kernel/t_ptrace_wait.h:295: Reported exited process

0.021926s

fork2

Passed

N/A

0.022183s

fpregs1

Passed

N/A

0.020640s

fpregs2

Failed

/usr/src/tests/kernel/t_ptrace_wait.c:3894: ptrace(PT_SETFPREGS, child, &r, 0) != -1 not met

0.021008s

io_read_d1

Passed

N/A

0.020228s

io_read_d2

Passed

N/A

0.022270s

io_read_d3

Passed

N/A

0.021035s

io_read_d4

Passed

N/A

0.021987s

io_read_d_write_d_handshake1

Passed

N/A

0.021043s

io_read_d_write_d_handshake2

Passed

N/A

0.019771s

io_read_i1

Passed

N/A

0.019287s

io_read_i2

Passed

N/A

0.019530s

io_read_i3

Passed

N/A

0.020114s

io_read_i4

Passed

N/A

0.019985s

io_write_d1

Passed

N/A

0.020526s

io_write_d2

Passed

N/A

0.021089s

io_write_d3

Passed

N/A

0.021548s

io_write_d4

Passed

N/A

0.021795s

kill1

Passed

N/A

0.021888s

kill2

Passed

N/A

0.021765s

lwpinfo1

Passed

N/A

0.022147s

lwpinfo2

Passed

N/A

0.023153s

read_d1

Passed

N/A

0.020439s

read_d2

Passed

N/A

0.021448s

read_d3

Passed

N/A

0.019975s

read_d4

Passed

N/A

0.021287s

read_d_write_d_handshake1

Passed

N/A

0.019891s

read_d_write_d_handshake2

Passed

N/A

0.020729s

read_i1

Passed

N/A

0.019711s

read_i2

Passed

N/A

0.019910s

read_i3

Passed

N/A

0.021291s

read_i4

Passed

N/A

0.024428s

regs1

Passed

N/A

0.021047s

regs2

Passed

N/A

0.020599s

regs3

Passed

N/A

0.019336s

regs4

Passed

N/A

0.022333s

regs5

Passed

N/A

0.021514s

traceme1

Passed

N/A

0.020377s

traceme2

Passed

N/A

0.019887s

traceme3

Passed

N/A

0.020302s

traceme4

Passed

N/A

0.020560s

vfork1

Expected failure

PR kern/51630: /usr/src/tests/kernel/t_ptrace_wait.h:305: WSTOPSIG(status) != expected: Unexpected stop signal received [Child exited] != [Trace/BPT trap]

0.021167s

vfork2

Passed

N/A

0.023825s

write_d1

Passed

N/A

0.020391s

write_d2

Passed

N/A

0.019684s

write_d3

Passed

N/A

0.019691s

write_d4

Passed

N/A

0.020102s

kernel/t_ptrace_waitid

301.217720s

attach1

Passed

N/A

0.036035s

attach2

Passed

N/A

0.038660s

attach3

Passed

N/A

0.017496s

attach4

Passed

N/A

0.018617s

attach5

Passed

N/A

0.030546s

attach6

Passed

N/A

0.021627s

attach7

Passed

N/A

0.036959s

eventmask1

Passed

N/A

0.020468s

eventmask2

Passed

N/A

0.021475s

fork1

Failed

/usr/src/tests/kernel/t_ptrace_wait.c:1152: ptrace(PT_GET_PROCESS_STATE, child2, &state, slen) != -1 not met

0.022906s

fork2

Passed

N/A

0.021082s

fpregs1

Passed

N/A

0.019885s

fpregs2

Failed

/usr/src/tests/kernel/t_ptrace_wait.c:3894: ptrace(PT_SETFPREGS, child, &r, 0) != -1 not met

0.020432s

io_read_d1

Passed

N/A

0.019875s

io_read_d2

Passed

N/A

0.024850s

io_read_d3

Passed

N/A

0.019394s

io_read_d4

Passed

N/A

0.019728s

io_read_d_write_d_handshake1

Passed

N/A

0.019439s

io_read_d_write_d_handshake2

Passed

N/A

0.020551s

io_read_i1

Passed

N/A

0.019135s

io_read_i2

Passed

N/A

0.019343s

io_read_i3

Passed

N/A

0.022025s

io_read_i4

Passed

N/A

0.019765s

io_write_d1

Passed

N/A

0.019324s

io_write_d2

Passed

N/A

0.019089s

io_write_d3

Passed

N/A

0.019326s

io_write_d4

Passed

N/A

0.019043s

kill1

Passed

N/A

0.018620s

kill2

Passed

N/A

0.019159s

lwpinfo1

Passed

N/A

0.018579s

lwpinfo2

Passed

N/A

0.038372s

read_d1

Passed

N/A

0.019691s

read_d2

Passed

N/A

0.018852s

read_d3

Passed

N/A

0.019038s

read_d4

Passed

N/A

0.020560s

read_d_write_d_handshake1

Passed

N/A

0.019593s

read_d_write_d_handshake2

Passed

N/A

0.020109s

read_i1

Passed

N/A

0.019833s

read_i2

Passed

N/A

0.019304s

read_i3

Passed

N/A

0.019390s

read_i4

Passed

N/A

0.019839s

regs1

Passed

N/A

0.018970s

regs2

Passed

N/A

0.018863s

regs3

Passed

N/A

0.018880s

regs4

Passed

N/A

0.019011s

regs5

Passed

N/A

0.019124s

traceme1

Passed

N/A

0.019634s

traceme2

Passed

N/A

0.019599s

traceme3

Passed

N/A

0.019904s

traceme4

Passed

N/A

0.019262s

vfork1

Failed

Test case timed out after 300 seconds

300.006887s

vfork2

Passed

N/A

0.019763s

write_d1

Passed

N/A

0.018822s

write_d2

Passed

N/A

0.018707s

write_d3

Passed

N/A

0.018942s

write_d4

Passed

N/A

0.018870s

kernel/t_ptrace_waitpid

1.208224s

attach1

Passed

N/A

0.035305s

attach2

Passed

N/A

0.038465s

attach3

Passed

N/A

0.018936s

attach4

Passed

N/A

0.019163s

attach5

Passed

N/A

0.039520s

attach6

Passed

N/A

0.038765s

attach7

Passed

N/A

0.022218s

eventmask1

Passed

N/A

0.019817s

eventmask2

Passed

N/A

0.019136s

fork1

Failed

/usr/src/tests/kernel/t_ptrace_wait.h:295: Reported exited process

0.022325s

fork2

Passed

N/A

0.021036s

fpregs1

Passed

N/A

0.019962s

fpregs2

Failed

/usr/src/tests/kernel/t_ptrace_wait.c:3894: ptrace(PT_SETFPREGS, child, &r, 0) != -1 not met

0.019857s

io_read_d1

Passed

N/A

0.019936s

io_read_d2

Passed

N/A

0.019308s

io_read_d3

Passed

N/A

0.019264s

io_read_d4

Passed

N/A

0.019653s

io_read_d_write_d_handshake1

Passed

N/A

0.024537s

io_read_d_write_d_handshake2

Passed

N/A

0.019338s

io_read_i1

Passed

N/A

0.019002s

io_read_i2

Passed

N/A

0.019179s

io_read_i3

Passed

N/A

0.018953s

io_read_i4

Passed

N/A

0.018946s

io_write_d1

Passed

N/A

0.019124s

io_write_d2

Passed

N/A

0.018968s

io_write_d3

Passed

N/A

0.019164s

io_write_d4

Passed

N/A

0.019454s

kill1

Passed

N/A

0.018952s

kill2

Passed

N/A

0.018353s

lwpinfo1

Passed

N/A

0.019961s

lwpinfo2

Passed

N/A

0.021888s

read_d1

Passed

N/A

0.018921s

read_d2

Passed

N/A

0.019936s

read_d3

Passed

N/A

0.018750s

read_d4

Passed

N/A

0.018922s

read_d_write_d_handshake1

Passed

N/A

0.019857s

read_d_write_d_handshake2

Passed

N/A

0.018744s

read_i1

Passed

N/A

0.019830s

read_i2

Passed

N/A

0.018643s

read_i3

Passed

N/A

0.019959s

read_i4

Passed

N/A

0.018891s

regs1

Passed

N/A

0.019698s

regs2

Passed

N/A

0.018666s

regs3

Passed

N/A

0.019865s

regs4

Passed

N/A

0.018873s

regs5

Passed

N/A

0.018899s

traceme1

Passed

N/A

0.019821s

traceme2

Passed

N/A

0.018810s

traceme3

Passed

N/A

0.019805s

traceme4

Passed

N/A

0.019314s

vfork1

Expected failure

PR kern/51630: /usr/src/tests/kernel/t_ptrace_wait.h:305: WSTOPSIG(status) != expected: Unexpected stop signal received [Child exited] != [Trace/BPT trap]

0.019765s

vfork2

Passed

N/A

0.018841s

write_d1

Passed

N/A

0.018613s

write_d2

Passed

N/A

0.018296s

write_d3

Passed

N/A

0.018144s

write_d4

Passed

N/A

0.018213s

kernel/t_pty

6.067082s

pty_no_queue

Passed

N/A

3.026184s

pty_queue

Passed

N/A

3.039748s

kernel/t_mqueue

0.013096s

mqueue

Passed

N/A

0.012235s

kernel/t_sysv

1.102965s

msg

Passed

N/A

0.027264s

sem

Passed

N/A

1.046354s

shm

Passed

N/A

0.027048s

kernel/t_subr_prf

0.049827s

snprintf_count

Passed

N/A

0.011234s

snprintf_count_overflow

Passed

N/A

0.013452s

snprintf_print

Passed

N/A

0.011460s

snprintf_print_overflow

Passed

N/A

0.011078s

kernel/t_kauth_pr_47598

0.496097s

kauth_curtain

Passed

N/A

0.495480s

kernel/t_sysctl

0.016036s

bufsize

Passed

N/A

0.015300s

kernel/t_extattrctl

0.064592s

extattrctl_namei

Passed

N/A

0.063625s

kernel/t_filedesc

28.083965s

getfilerace

Passed

N/A

28.082989s

kernel/t_rnd

0.211550s

RNDADDDATA

Passed

N/A

0.069184s

RNDADDDATA2

Passed

N/A

0.069820s

read_random

Passed

N/A

0.069708s

kernel/t_extent

0.144072s

bound1

Passed

N/A

0.014190s

bound2

Passed

N/A

0.013498s

bound3

Passed

N/A

0.012437s

bound4

Passed

N/A

0.011840s

bound5

Passed

N/A

0.011814s

coalesce

Passed

N/A

0.011791s

free

Passed

N/A

0.011799s

subregion1

Passed

N/A

0.011803s

subregion2

Passed

N/A

0.011740s

subregion3

Passed

N/A

0.011852s

subregion4

Passed

N/A

0.013534s

kernel/t_umount

0.832653s

umount

Passed

N/A

0.827295s

kernel/t_umountstress

2.839568s

fileop

Passed

N/A

1.042693s

mountlist

Passed

N/A

1.786499s

kernel/t_ps_strings

0.890532s

update

Passed

N/A

0.766873s

validate

Passed

N/A

0.122314s

lib/csu/t_crt0

0.616051s

initfini1

Passed

N/A

0.146314s

initfini2

Passed

N/A

0.165010s

initfini3

Passed

N/A

0.142865s

initfini4

Passed

N/A

0.157900s

lib/libbluetooth/t_bluetooth

0.025244s

check_bt_aton

Passed

N/A

0.012138s

check_bt_ntoa

Passed

N/A

0.011780s

lib/libbluetooth/t_sdp_data

0.025995s

check_sdp_data_size

Passed

N/A

0.012939s

check_sdp_data_type

Passed

N/A

0.011750s

lib/libbluetooth/t_sdp_get

0.131293s

check_sdp_get_alt

Passed

N/A

0.012272s

check_sdp_get_attr

Passed

N/A

0.012117s

check_sdp_get_bool

Passed

N/A

0.011980s

check_sdp_get_data

Passed

N/A

0.014103s

check_sdp_get_int

Passed

N/A

0.013659s

check_sdp_get_seq

Passed

N/A

0.012296s

check_sdp_get_str

Passed

N/A

0.012123s

check_sdp_get_uint

Passed

N/A

0.012110s

check_sdp_get_url

Passed

N/A

0.012082s

check_sdp_get_uuid

Passed

N/A

0.011956s

lib/libbluetooth/t_sdp_match

0.012953s

check_sdp_match_uuid16

Passed

N/A

0.012202s

lib/libbluetooth/t_sdp_put

0.288117s

check_sdp_put_alt

Passed

N/A

0.014525s

check_sdp_put_attr

Passed

N/A

0.014103s

check_sdp_put_bool

Passed

N/A

0.012716s

check_sdp_put_data

Passed

N/A

0.012846s

check_sdp_put_int

Passed

N/A

0.012511s

check_sdp_put_int16

Passed

N/A

0.013693s

check_sdp_put_int32

Passed

N/A

0.014207s

check_sdp_put_int64

Passed

N/A

0.012838s

check_sdp_put_int8

Passed

N/A

0.012636s

check_sdp_put_seq

Passed

N/A

0.013658s

check_sdp_put_str

Passed

N/A

0.012442s

check_sdp_put_uint

Passed

N/A

0.012480s

check_sdp_put_uint16

Passed

N/A

0.012372s

check_sdp_put_uint32

Passed

N/A

0.014279s

check_sdp_put_uint64

Passed

N/A

0.013961s

check_sdp_put_uint8

Passed

N/A

0.012602s

check_sdp_put_url

Passed

N/A

0.012788s

check_sdp_put_uuid

Passed

N/A

0.012292s

check_sdp_put_uuid128

Passed

N/A

0.012392s

check_sdp_put_uuid16

Passed

N/A

0.012557s

check_sdp_put_uuid32

Passed

N/A

0.012367s

lib/libbluetooth/t_sdp_set

0.064364s

check_sdp_set_alt

Passed

N/A

0.012270s

check_sdp_set_bool

Passed

N/A

0.011883s

check_sdp_set_int

Passed

N/A

0.013413s

check_sdp_set_seq

Passed

N/A

0.011948s

check_sdp_set_uint

Passed

N/A

0.011832s

lib/libc/c063/t_faccessat

0.088962s

faccessat_fd

Passed

N/A

0.011982s

faccessat_fdcwd

Passed

N/A

0.011635s

faccessat_fdcwderr

Passed

N/A

0.011564s

faccessat_fderr1

Passed

N/A

0.011563s

faccessat_fderr2

Passed

N/A

0.011657s

faccessat_fderr3

Passed

N/A

0.011592s

faccessat_fdlink

Passed

N/A

0.011856s

lib/libc/c063/t_fchmodat

0.094955s

fchmodat_fd

Passed

N/A

0.013984s

fchmodat_fdcwd

Passed

N/A

0.013278s

fchmodat_fdcwderr

Passed

N/A

0.013010s

fchmodat_fderr1

Passed

N/A

0.011913s

fchmodat_fderr2

Passed

N/A

0.011709s

fchmodat_fderr3

Passed

N/A

0.011657s

fchmodat_fdlink

Passed

N/A

0.011609s

lib/libc/c063/t_fchownat

0.111695s

fchownat_fd

Passed

N/A

0.015082s

fchownat_fdcwd

Passed

N/A

0.014692s

fchownat_fdcwderr

Passed

N/A

0.014587s

fchownat_fderr1

Passed

N/A

0.014676s

fchownat_fderr2

Passed

N/A

0.014814s

fchownat_fderr3

Passed

N/A

0.014633s

fchownat_fdlink

Passed

N/A

0.014685s

lib/libc/c063/t_fexecve

0.019417s

fexecve

Expected failure

fexecve not implemented: /usr/src/tests/lib/libc/c063/t_fexecve.c:85: access("test", F_OK) == 0 not met

0.018392s

lib/libc/c063/t_fstatat

0.098536s

fstatat_fd

Passed

N/A

0.013958s

fstatat_fdcwd

Passed

N/A

0.013240s

fstatat_fdcwderr

Passed

N/A

0.013117s

fstatat_fderr1

Passed

N/A

0.012965s

fstatat_fderr2

Passed

N/A

0.013035s

fstatat_fderr3

Passed

N/A

0.012178s

fstatat_fdlink

Passed

N/A

0.011723s

lib/libc/c063/t_linkat

0.084323s

linkat_fd

Passed

N/A

0.011987s

linkat_fdcwd

Passed

N/A

0.011676s

linkat_fdcwderr

Passed

N/A

0.013964s

linkat_fderr

Passed

N/A

0.013572s

linkat_fdlink1

Passed

N/A

0.011792s

linkat_fdlink2

Passed

N/A

0.011853s

lib/libc/c063/t_mkdirat

0.051484s

mkdirat_fd

Passed

N/A

0.011751s

mkdirat_fdcwd

Passed

N/A

0.011633s

mkdirat_fdcwderr

Passed

N/A

0.011740s

mkdirat_fderr

Passed

N/A

0.012259s

lib/libc/c063/t_mkfifoat

0.055723s

mkfifoat_fd

Passed

N/A

0.011398s

mkfifoat_fdcwd

Passed

N/A

0.013316s

mkfifoat_fdcwderr

Passed

N/A

0.013058s

mkfifoat_fderr

Passed

N/A

0.013179s

lib/libc/c063/t_mknodat

0.056963s

mknodat_fd

Passed

N/A

0.013375s

mknodat_fdcwd

Passed

N/A

0.012988s

mknodat_fdcwderr

Passed

N/A

0.012932s

mknodat_fderr

Passed

N/A

0.012925s

lib/libc/c063/t_o_search

0.041222s

o_search_notdir

Passed

N/A

0.011807s

o_search_perm1

Passed

N/A

0.012873s

o_search_perm2

Passed

N/A

0.012697s

lib/libc/c063/t_openat

0.080228s

openat_fd

Passed

N/A

0.013320s

openat_fdcwd

Passed

N/A

0.013026s

openat_fdcwderr

Passed

N/A

0.011735s

openat_fderr1

Passed

N/A

0.011575s

openat_fderr2

Passed

N/A

0.011457s

openat_fderr3

Passed

N/A

0.012675s

lib/libc/c063/t_readlinkat

0.062595s

readlinkat_fd

Passed

N/A

0.011477s

readlinkat_fdcwd

Passed

N/A

0.011504s

readlinkat_fdcwderr

Passed

N/A

0.011395s

readlinkat_fderr1

Passed

N/A

0.011417s

readlinkat_fderr2

Passed

N/A

0.011579s

lib/libc/c063/t_renameat

0.051959s

renameat_fd

Passed

N/A

0.011895s

renameat_fdcwd

Passed

N/A

0.011690s

renameat_fdcwderr

Passed

N/A

0.011517s

renameat_fderr

Passed

N/A

0.011476s

lib/libc/c063/t_symlinkat

0.052002s

symlinkat_fd

Passed

N/A

0.011505s

symlinkat_fdcwd

Passed

N/A

0.011528s

symlinkat_fdcwderr

Passed

N/A

0.011450s

symlinkat_fderr

Passed

N/A

0.011433s

lib/libc/c063/t_unlinkat

0.093205s

unlinkat_dir

Passed

N/A

0.013883s

unlinkat_fd

Passed

N/A

0.013351s

unlinkat_fdcwd

Passed

N/A

0.012140s

unlinkat_fdcwderr

Passed

N/A

0.011775s

unlinkat_fderr1

Passed

N/A

0.011939s

unlinkat_fderr2

Passed

N/A

0.011506s

unlinkat_fderr3

Passed

N/A

0.011870s

lib/libc/c063/t_utimensat

0.088535s

utimensat_fd

Passed

N/A

0.011951s

utimensat_fdcwd

Passed

N/A

0.011596s

utimensat_fdcwderr

Passed

N/A

0.011548s

utimensat_fderr1

Passed

N/A

0.011570s

utimensat_fderr2

Passed

N/A

0.011627s

utimensat_fderr3

Passed

N/A

0.011567s

utimensat_fdlink

Passed

N/A

0.011579s

lib/libc/db/t_db_hash_seq

0.059144s

test_hash_del_all

Passed

N/A

0.013735s

test_hash_del_alt

Passed

N/A

0.013441s

test_hash_del_every_7

Passed

N/A

0.013333s

test_hash_del_none

Passed

N/A

0.015735s

lib/libc/db/t_db

364.546867s

alternate_recno

Passed

N/A

0.275782s

big_btree

Passed

N/A

0.925918s

big_hash

Passed

N/A

0.389925s

big_recno

Passed

N/A

0.841125s

bsize_ffactor

Passed

N/A

41.423575s

bsize_torture

Passed

N/A

280.720298s

btree_byteswap_unaligned_access_bksd

Passed

N/A

0.203592s

btree_byteswap_unaligned_access_skbd

Passed

N/A

0.202586s

btree_known_byte_order

Passed

N/A

0.279493s

btree_recursive_traversal

Passed

N/A

2.387502s

btree_tricky_page_split

Passed

N/A

0.450261s

btree_weird_page_split

Passed

N/A

29.414975s

byte_orders_btree

Passed

N/A

0.319589s

byte_orders_hash

Passed

N/A

0.336582s

cursor_flags_btree

Passed

N/A

0.273468s

cursor_flags_recno

Passed

N/A

0.276074s

delete_btree

Passed

N/A

0.239104s

delete_recno

Passed

N/A

0.228439s

duplicate_btree

Passed

N/A

0.211864s

four_char_hash

Passed

N/A

0.151795s

medium_btree

Passed

N/A

0.185756s

medium_hash

Passed

N/A

0.188457s

medium_recno

Passed

N/A

0.178033s

random_recno

Passed

N/A

0.301980s

repeated_btree

Passed

N/A

0.246295s

repeated_hash

Passed

N/A

0.260436s

reverse_order_recno

Passed

N/A

0.213163s

reverse_recno

Passed

N/A

0.257314s

small_btree

Passed

N/A

0.187891s

small_hash

Passed

N/A

0.185882s

small_page_btree

Passed

N/A

2.531565s

small_recno

Passed

N/A

0.179104s

lib/libc/gen/exect/t_exect

0.014119s

t_exect_null

Skipped

exect(3) misdesigned and hangs - PR port-amd64/51700

0.013290s

lib/libc/gen/execve/t_execve

0.013721s

t_execve_null

Passed

N/A

0.012867s

lib/libc/gen/posix_spawn/t_spawn

0.114266s

t_spawn_child

Passed

N/A

0.029230s

t_spawn_ls

Passed

N/A

0.014014s

t_spawn_missing

Passed

N/A

0.012065s

t_spawn_nonexec

Passed

N/A

0.018518s

t_spawn_zero

Passed

N/A

0.022147s

t_spawnp_ls

Passed

N/A

0.014020s

lib/libc/gen/posix_spawn/t_fileactions

0.112747s

t_spawn_empty_fileactions

Passed

N/A

0.018301s

t_spawn_fileactions

Passed

N/A

0.019449s

t_spawn_open_nonexistent

Passed

N/A

0.012484s

t_spawn_open_nonexistent_diag

Passed

N/A

0.012216s

t_spawn_openmode

Passed

N/A

0.027911s

t_spawn_reopen

Passed

N/A

0.017114s

lib/libc/gen/posix_spawn/t_spawnattr

0.024932s

t_spawnattr

Passed

N/A

0.024259s

lib/libc/gen/t_alarm

1.047481s

alarm_basic

Passed

N/A

1.017778s

alarm_fork

Passed

N/A

0.014677s

alarm_previous

Passed

N/A

0.012680s

lib/libc/gen/t_assert

0.036101s

assert_false

Passed

N/A

0.013816s

assert_true

Passed

N/A

0.019618s

lib/libc/gen/t_basedirname

0.024884s

basename_posix

Passed

N/A

0.011841s

dirname_posix

Passed

N/A

0.011488s

lib/libc/gen/t_closefrom

0.072756s

closefrom_basic

Passed

N/A

0.022798s

closefrom_buffer

Passed

N/A

0.022228s

closefrom_err

Passed

N/A

0.011430s

closefrom_one

Passed

N/A

0.013182s

lib/libc/gen/t_cpuset

0.037059s

cpuset_err

Passed

N/A

0.011935s

cpuset_set

Passed

N/A

0.011438s

cpuset_size

Passed

N/A

0.011343s

lib/libc/gen/t_dir

0.049783s

seekdir_basic

Passed

N/A

0.014017s

telldir_leak

Passed

N/A

0.033729s

lib/libc/gen/t_floatunditf

0.013971s

floatunditf

Passed

N/A

0.013115s

lib/libc/gen/t_fmtcheck

0.013791s

fmtcheck_basic

Passed

N/A

0.012895s

lib/libc/gen/t_fnmatch

0.086672s

fnmatch_backslashes

Passed

N/A

0.012157s

fnmatch_casefold

Passed

N/A

0.011572s

fnmatch_initialbracket

Passed

N/A

0.011591s

fnmatch_leadingdir

Passed

N/A

0.011573s

fnmatch_noescape

Passed

N/A

0.011537s

fnmatch_pathname

Passed

N/A

0.011494s

fnmatch_period

Passed

N/A

0.011513s

lib/libc/gen/t_fpclassify

0.030720s

fpclassify_double

Passed

N/A

0.015042s

fpclassify_float

Passed

N/A

0.014205s

lib/libc/gen/t_fpsetmask

0.091398s

fpsetmask_basic

Passed

N/A

0.012218s

fpsetmask_masked_double

Passed

N/A

0.011503s

fpsetmask_masked_float

Passed

N/A

0.011602s

fpsetmask_masked_long_double

Passed

N/A

0.011651s

fpsetmask_unmasked_double

Passed

N/A

0.013296s

fpsetmask_unmasked_float

Passed

N/A

0.013017s

fpsetmask_unmasked_long_double

Passed

N/A

0.012935s

lib/libc/gen/t_fpsetround

0.015219s

fpsetround_basic

Passed

N/A

0.014411s

lib/libc/gen/t_ftok

0.038626s

ftok_err

Passed

N/A

0.013130s

ftok_link

Passed

N/A

0.023930s

lib/libc/gen/t_getcwd

1.438727s

getcwd_err

Passed

N/A

0.012394s

getcwd_fts

Passed

N/A

1.424713s

lib/libc/gen/t_getgrent

0.146393s

getgrent_loop

Passed

N/A

0.017106s

getgrent_setgid

Passed

N/A

0.127639s

lib/libc/gen/t_glob

0.025525s

glob_star

Passed

N/A

0.012175s

glob_star_not

Passed

N/A

0.011772s

lib/libc/gen/t_humanize_number

0.024956s

humanize_number_basic

Passed

N/A

0.011877s

humanize_number_big

Passed

N/A

0.011507s

lib/libc/gen/t_isnan

0.025002s

isinf_basic

Passed

N/A

0.011956s

isnan_basic

Passed

N/A

0.011465s

lib/libc/gen/t_nice

0.102870s

nice_err

Passed

N/A

0.014888s

nice_priority

Passed

N/A

0.058214s

nice_root

Passed

N/A

0.012950s

nice_thread

Passed

N/A

0.013415s

lib/libc/gen/t_pause

3.048226s

pause_basic

Passed

N/A

1.017299s

pause_kill

Passed

N/A

2.029327s

lib/libc/gen/t_raise

1.258830s

raise_err

Passed

N/A

0.012089s

raise_ret

Passed

N/A

1.014826s

raise_sig

Passed

N/A

0.109219s

raise_stress

Passed

N/A

0.119612s

lib/libc/gen/t_randomid

0.387939s

randomid_basic

Passed

N/A

0.387304s

lib/libc/gen/t_realpath

0.041328s

realpath_basic

Passed

N/A

0.013462s

realpath_huge

Passed

N/A

0.012782s

realpath_symlink

Passed

N/A

0.012901s

lib/libc/gen/t_setdomainname

0.076123s

setdomainname_basic

Passed

N/A

0.024704s

setdomainname_limit

Passed

N/A

0.023680s

setdomainname_perm

Passed

N/A

0.025196s

lib/libc/gen/t_sethostname

0.071102s

sethostname_basic

Passed

N/A

0.022374s

sethostname_limit

Passed

N/A

0.021752s

sethostname_perm

Passed

N/A

0.024367s

lib/libc/gen/t_siginfo

3.158428s

sigalarm

Passed

N/A

1.020721s

sigbus_adraln

Passed

N/A

0.014450s

sigchild_dump

Passed

N/A

1.030356s

sigchild_kill

Passed

N/A

0.015840s

sigchild_normal

Passed

N/A

1.027525s

sigfpe_flt

Passed

N/A

0.014537s

sigfpe_int

Passed

N/A

0.014599s

sigsegv

Passed

N/A

0.014671s

lib/libc/gen/t_sleep

166.031079s

kevent

Passed

N/A

26.599240s

nanosleep

Passed

N/A

36.789651s

poll

Passed

N/A

36.789803s

select

Passed

N/A

36.789777s

sleep

Passed

N/A

29.059349s

lib/libc/gen/t_syslog

0.015413s

syslog_pthread

Passed

N/A

0.014683s

lib/libc/gen/t_time

10.133483s

time_copy

Passed

N/A

0.011658s

time_mono

Passed

N/A

10.107934s

time_timeofday

Passed

N/A

0.011881s

lib/libc/gen/t_ttyname

0.054182s

ttyname_err

Passed

N/A

0.014013s

ttyname_r_err

Passed

N/A

0.013814s

ttyname_r_stdin

Passed

N/A

0.011837s

ttyname_stdin

Passed

N/A

0.011464s

lib/libc/gen/t_vis

0.096572s

strunvis_hex

Passed

N/A

0.011950s

strvis_basic

Passed

N/A

0.014380s

strvis_empty

Passed

N/A

0.011646s

strvis_locale

Passed

N/A

0.041709s

strvis_null

Passed

N/A

0.013220s

lib/libc/hash/t_sha2

0.044370s

t_sha256

Passed

N/A

0.014159s

t_sha384

Passed

N/A

0.014256s

t_sha512

Passed

N/A

0.013754s

lib/libc/hash/t_hmac

3.002074s

t_hmac

Passed

N/A

3.001168s

lib/libc/hash/t_hash

1.424280s

md5

Passed

N/A

0.155985s

sha1

Passed

N/A

1.266722s

lib/libc/inet/t_inet_addr

0.026324s

inet_addr_basic

Passed

N/A

0.012434s

inet_addr_err

Passed

N/A

0.012320s

lib/libc/inet/t_inet_network

0.024844s

inet_network_basic

Passed

N/A

0.011910s

inet_network_err

Passed

N/A

0.011350s

lib/libc/locale/t_mbrtowc

0.133239s

mbrtowc_internal

Passed

N/A

0.112641s

mbrtowc_object

Passed

N/A

0.019459s

lib/libc/locale/t_mbstowcs

0.028686s

mbstowcs_basic

Passed

N/A

0.028154s

lib/libc/locale/t_mbsnrtowcs

0.016236s

mbsnrtowcs

Passed

N/A

0.015608s

lib/libc/locale/t_mbtowc

0.126054s

mbtowc

Passed

N/A

0.125499s

lib/libc/locale/t_wcscspn

0.013644s

wcscspn

Passed

N/A

0.013016s

lib/libc/locale/t_wcspbrk

0.013313s

wcspbrk

Passed

N/A

0.012685s

lib/libc/locale/t_wcsspn

0.012108s

wcsspn

Passed

N/A

0.011509s

lib/libc/locale/t_wcstod

0.212020s

wcstod

Passed

N/A

0.211393s

lib/libc/locale/t_wctomb

0.048364s

wcrtomb

Passed

N/A

0.015498s

wcrtomb_state

Passed

N/A

0.015523s

wctomb

Passed

N/A

0.015397s

lib/libc/locale/t_io

0.088902s

bad_big5_getwc

Passed

N/A

0.014549s

bad_big5_swprintf

Passed

N/A

0.014318s

bad_big5_wprintf

Passed

N/A

0.014590s

good_big5_getwc

Passed

N/A

0.014513s

good_big5_swprintf

Passed

N/A

0.013588s

good_big5_wprintf

Passed

N/A

0.013173s

lib/libc/net/getaddrinfo/t_getaddrinfo

1.155732s

basic

Passed

N/A

0.236616s

empty_hostname

Passed

N/A

0.199861s

empty_servname

Passed

N/A

0.161394s

scopeaddr

Passed

N/A

0.115792s

sock_raw

Passed

N/A

0.162768s

specific

Passed

N/A

0.158960s

unsupported_family

Passed

N/A

0.113532s

lib/libc/net/t_getprotoent

0.109988s

endprotoent_rewind

Passed

N/A

0.012685s

getprotobyname_basic

Passed

N/A

0.015362s

getprotobyname_err

Passed

N/A

0.020906s

getprotobynumber_basic

Passed

N/A

0.015502s

getprotobynumber_err

Passed

N/A

0.015868s

getprotoent_next

Passed

N/A

0.012584s

setprotoent_rewind

Passed

N/A

0.012087s

lib/libc/net/t_ether_aton

0.012431s

tc_ether_aton

Passed

N/A

0.011648s

lib/libc/net/t_nsdispatch

0.144171s

recurse

Passed

N/A

0.143113s

lib/libc/net/t_protoent

0.170221s

protoent

Passed

N/A

0.167941s

lib/libc/net/t_servent

1.508052s

servent

Passed

N/A

1.504742s

lib/libc/net/t_hostent

4.276412s

dnsbyaddrlookup4

Passed

N/A

0.477750s

dnsbyaddrlookup6

Passed

N/A

0.457988s

dnsbynamelookup4

Passed

N/A

0.451985s

dnsbynamelookup6

Passed

N/A

0.447298s

gethostbyaddr4

Passed

N/A

0.470234s

gethostbyaddr6

Passed

N/A

0.471061s

gethostbyname4

Passed

N/A

0.458269s

gethostbyname6

Passed

N/A

0.452399s

hostsbyaddrlookup4

Passed

N/A

0.142567s

hostsbyaddrlookup6

Passed

N/A

0.140160s

hostsbynamelookup4

Passed

N/A

0.142507s

hostsbynamelookup6

Passed

N/A

0.142675s

lib/libc/regex/t_regex_att

0.141474s

basic

Passed

N/A

0.038159s

categorization

Passed

N/A

0.021546s

forcedassoc

Passed

N/A

0.015903s

leftassoc

Expected failure

Reason for breakage unknown: /usr/src/tests/lib/libc/regex/t_regex_att.c:377: res != matches ((0,4)(0,2)(2,3)(3,4) != (0,4)(0,1)(1,4)(4,4)): at line 3

0.012634s

nullsubexpr

Passed

N/A

0.015238s

repetition

Passed

N/A

0.018755s

rightassoc

Passed

N/A

0.014903s

lib/libc/regex/t_exhaust

0.458410s

regcomp_too_big

Passed

N/A

0.457583s

lib/libc/regex/t_regex

4.396746s

anchor

Passed

N/A

0.230368s

backref

Passed

N/A

0.218876s

basic

Passed

N/A

0.214437s

bracket

Passed

N/A

0.249975s

c_comments

Passed

N/A

0.221039s

complex

Passed

N/A

0.224425s

error

Passed

N/A

0.274606s

meta

Passed

N/A

0.235795s

nospec

Passed

N/A

0.224882s

paren

Passed

N/A

0.224397s

regress

Passed

N/A

0.221863s

repet_bounded

Passed

N/A

0.284380s

repet_multi

Passed

N/A

0.234905s

repet_ordinary

Passed

N/A

0.225731s

startend

Passed

N/A

0.220146s

subexp

Passed

N/A

0.218087s

subtle

Passed

N/A

0.220105s

word_bound

Passed

N/A

0.222334s

zero

Passed

N/A

0.216825s

lib/libc/rpc/t_xdr

0.014100s

xdr

Passed

N/A

0.013234s

lib/libc/rpc/t_rpc

4.199439s

get_svc_addr_tcp

Passed

N/A

0.030025s

get_svc_addr_udp

Passed

N/A

0.024327s

raw

Passed

N/A

0.018105s

tcp

Passed

N/A

1.034134s

tcp_poll

Passed

N/A

1.029387s

udp

Passed

N/A

1.028332s

udp_poll

Passed

N/A

1.029538s

lib/libc/setjmp/t_setjmp

0.047695s

_setjmp

Passed

N/A

0.011674s

setjmp

Passed

N/A

0.011305s

sigsetjmp_nosave

Passed

N/A

0.011362s

sigsetjmp_save

Passed

N/A

0.011190s

lib/libc/setjmp/t_threadjmp

0.052776s

_setjmp

Passed

N/A

0.012685s

setjmp

Passed

N/A

0.012688s

sigsetjmp_nosave

Passed

N/A

0.012586s

sigsetjmp_save

Passed

N/A

0.012668s

lib/libc/stdlib/t_abs

0.047452s

abs_basic

Passed

N/A

0.011513s

imaxabs_basic

Passed

N/A

0.011308s

labs_basic

Passed

N/A

0.011296s

llabs_basic

Passed

N/A

0.011208s

lib/libc/stdlib/t_atoi

0.048331s

atof_strtod

Passed

N/A

0.012091s

atoi_strtol

Passed

N/A

0.011411s

atol_strtol

Passed

N/A

0.011413s

atoll_strtoll

Passed

N/A

0.011293s

lib/libc/stdlib/t_div

0.035789s

div_basic

Passed

N/A

0.011597s

ldiv_basic

Passed

N/A

0.011251s

lldiv_basic

Passed

N/A

0.011310s

lib/libc/stdlib/t_getenv

17.932083s

clearenv_basic

Passed

N/A

0.062556s

getenv_basic

Passed

N/A

0.011428s

putenv_basic

Passed

N/A

0.012944s

setenv_basic

Passed

N/A

17.830572s

setenv_mixed

Passed

N/A

0.011906s

lib/libc/stdlib/t_getenv_thread

39.805339s

getenv_r_thread

Passed

N/A

9.804842s

putenv_thread

Passed

N/A

9.998971s

setenv_thread

Passed

N/A

9.999382s

unsetenv_thread

Passed

N/A

9.999215s

lib/libc/stdlib/t_exit

0.085150s

exit_atexit

Passed

N/A

0.015063s

exit_basic

Passed

N/A

0.015241s

exit_status

Passed

N/A

0.033734s

exit_tmpfile

Passed

N/A

0.018336s

lib/libc/stdlib/t_hsearch

0.107136s

hsearch_basic

Passed

N/A

0.013355s

hsearch_duplicate

Passed

N/A

0.012829s

hsearch_nonexistent

Passed

N/A

0.012632s

hsearch_r_basic

Passed

N/A

0.012781s

hsearch_r_duplicate

Passed

N/A

0.012997s

hsearch_r_nonexistent

Passed

N/A

0.012673s

hsearch_r_two

Passed

N/A

0.012665s

hsearch_two

Passed

N/A

0.012585s

lib/libc/stdlib/t_mi_vector_hash

0.013094s

mi_vector_hash_basic

Passed

N/A

0.012495s

lib/libc/stdlib/t_posix_memalign

0.027031s

aligned_alloc_basic

Passed

N/A

0.012938s

posix_memalign_basic

Passed

N/A

0.012982s

lib/libc/stdlib/t_random

0.018219s

random_same

Passed

N/A

0.017603s

lib/libc/stdlib/t_strtod

0.163116s

strtod_basic

Passed

N/A

0.017035s

strtod_gherman_bug

Passed

N/A

0.014169s

strtod_hex

Passed

N/A

0.013946s

strtod_inf

Passed

N/A

0.013888s

strtod_nan

Passed

N/A

0.013883s

strtod_round

Passed

N/A

0.014126s

strtod_underflow

Passed

N/A

0.014053s

strtof_inf

Passed

N/A

0.013908s

strtof_nan

Passed

N/A

0.013810s

strtold_inf

Passed

N/A

0.013933s

strtold_nan

Passed

N/A

0.013940s

lib/libc/stdlib/t_strtol

0.053119s

strtol_base

Passed

N/A

0.013049s

strtol_case

Passed

N/A

0.012691s

strtol_range

Passed

N/A

0.012488s

strtol_signed

Passed

N/A

0.012537s

lib/libc/stdlib/t_strtoi

0.053380s

strtoi_base

Passed

N/A

0.013056s

strtoi_case

Passed

N/A

0.012584s

strtoi_range

Passed

N/A

0.012898s

strtoi_signed

Passed

N/A

0.012503s

lib/libc/stdlib/t_system

0.079922s

system_basic

Passed

N/A

0.079304s

lib/libc/stdlib/t_atexit

0.125581s

atexit

Passed

N/A

0.124516s

lib/libc/stdlib/t_getopt

0.894234s

getopt

Passed

N/A

0.472772s

getopt_long

Passed

N/A

0.420214s

lib/libc/stdio/t_clearerr

0.033534s

clearerr_basic

Passed

N/A

0.019663s

clearerr_err

Passed

N/A

0.012691s

lib/libc/stdio/t_fflush

0.075796s

fflush_err

Passed

N/A

0.025258s

fflush_seek

Passed

N/A

0.024500s

fpurge_err

Passed

N/A

0.024189s

lib/libc/stdio/t_fmemopen

0.433326s

test00

Passed

N/A

0.013939s

test01

Passed

N/A

0.013247s

test02

Passed

N/A

0.013247s

test03

Passed

N/A

0.013210s

test04

Passed

N/A

0.018213s

test05

Passed

N/A

0.013048s

test06

Passed

N/A

0.012997s

test07

Passed

N/A

0.013061s

test08

Passed

N/A

0.013130s

test09

Passed

N/A

0.028278s

test10

Passed

N/A

0.024965s

test11

Passed

N/A

0.021754s

test12

Passed

N/A

0.018050s

test13

Passed

N/A

0.018241s

test14

Passed

N/A

0.018361s

test15

Passed

N/A

0.021331s

test16

Passed

N/A

0.014524s

test17

Passed

N/A

0.016995s

test18

Passed

N/A

0.013714s

test19

Passed

N/A

0.027265s

test20

Passed

N/A

0.014871s

test21

Passed

N/A

0.017977s

test22

Passed

N/A

0.039468s

lib/libc/stdio/t_fopen

0.236962s

fdopen_close

Passed

N/A

0.025331s

fdopen_err

Passed

N/A

0.027605s

fdopen_seek

Passed

N/A

0.025004s

fopen_append

Passed

N/A

0.023883s

fopen_err

Passed

N/A

0.023182s

fopen_mode

Passed

N/A

0.025824s

fopen_perm

Passed

N/A

0.014879s

fopen_regular

Passed

N/A

0.013721s

fopen_seek

Passed

N/A

0.025446s

freopen_std

Passed

N/A

0.025798s

lib/libc/stdio/t_open_memstream

0.014050s

test_open_memstream

Passed

N/A

0.013432s

lib/libc/stdio/t_fputc

0.153293s

fputc_basic

Passed

N/A

0.025586s

fputc_err

Passed

N/A

0.024675s

putc_basic

Passed

N/A

0.024888s

putc_err

Passed

N/A

0.024572s

putc_unlocked_basic

Passed

N/A

0.025069s

putc_unlocked_err

Passed

N/A

0.024893s

lib/libc/stdio/t_mktemp

0.013626s

mktemp_not_exist

Passed

N/A

0.013047s

lib/libc/stdio/t_popen

0.180343s

popen_zeropad

Passed

N/A

0.179756s

lib/libc/stdio/t_printf

0.570584s

snprintf_c99

Passed

N/A

0.013320s

snprintf_dotzero

Passed

N/A

0.013338s

snprintf_float

Passed

N/A

0.487829s

snprintf_posarg

Passed

N/A

0.013336s

snprintf_posarg_error

Passed

N/A

0.012794s

snprintf_posarg_width

Passed

N/A

0.013029s

sprintf_zeropad

Passed

N/A

0.012932s

lib/libc/stdio/t_scanf

0.026509s

sscanf_neghex

Passed

N/A

0.012698s

sscanf_whitespace

Passed

N/A

0.012641s

lib/libc/string/t_bm

0.013296s

bm

Passed

N/A

0.012663s

lib/libc/string/t_memchr

0.040233s

memchr_basic

Passed

N/A

0.013098s

memchr_simple

Passed

N/A

0.012672s

memrchr_simple

Passed

N/A

0.012810s

lib/libc/string/t_memcpy

3.324159s

memccpy_simple

Passed

N/A

0.013051s

memcpy_basic

Passed

N/A

3.296511s

memcpy_return

Passed

N/A

0.012924s

lib/libc/string/t_memmem

0.013020s

memmem_basic

Passed

N/A

0.012443s

lib/libc/string/t_memset

0.097522s

bzero_zero_size

Passed

N/A

0.013165s

memset_array

Passed

N/A

0.012826s

memset_basic

Passed

N/A

0.012882s

memset_nonzero

Passed

N/A

0.016743s

memset_return

Passed

N/A

0.012624s

memset_struct

Passed

N/A

0.012592s

memset_zero_size

Passed

N/A

0.012692s

lib/libc/string/t_popcount

0.026654s

popcount_basic

Skipped

config variable "run_popcount" not set to YES/TRUE

0.012838s

popcountll_basic

Skipped

config variable "run_popcount" not set to YES/TRUE

0.012720s

lib/libc/string/t_strcat

0.059233s

strcat_basic

Passed

N/A

0.045570s

strncat_simple

Passed

N/A

0.012544s

lib/libc/string/t_strchr

0.014237s

strchr_basic

Passed

N/A

0.013658s

lib/libc/string/t_strcmp

0.026923s

strcmp_basic

Passed

N/A

0.013264s

strcmp_simple

Passed

N/A

0.012525s

lib/libc/string/t_strcpy

0.013739s

strcpy_basic

Passed

N/A

0.013091s

lib/libc/string/t_strcspn

0.013209s

strcspn

Passed

N/A

0.012579s

lib/libc/string/t_strerror

0.108877s

strerror_basic

Passed

N/A

0.039693s

strerror_err

Passed

N/A

0.013858s

strerror_r_basic

Passed

N/A

0.039467s

strerror_r_err

Passed

N/A

0.013666s

lib/libc/string/t_stresep

0.013341s

stresep_basic

Passed

N/A

0.012750s

lib/libc/string/t_strlen

0.386265s

strlen_basic

Passed

N/A

0.012949s

strlen_huge

Passed

N/A

0.358064s

strnlen_basic

Passed

N/A

0.013416s

lib/libc/string/t_strpbrk

0.013036s

strpbrk

Passed

N/A

0.012407s

lib/libc/string/t_strrchr

0.013476s

strrchr_basic

Passed

N/A

0.012896s

lib/libc/string/t_strspn

0.013397s

strspn

Passed

N/A

0.012748s

lib/libc/string/t_swab

0.013708s

swab_basic

Passed

N/A

0.013085s

lib/libc/sys/t_access

0.094581s

access_access

Passed

N/A

0.027930s

access_fault

Passed

N/A

0.012643s

access_inval

Passed

N/A

0.012628s

access_notdir

Passed

N/A

0.012666s

access_notexist

Passed

N/A

0.012540s

access_toolong

Passed

N/A

0.012565s

lib/libc/sys/t_bind

0.013472s

bind_foreign_family

Passed

N/A

0.012890s

lib/libc/sys/t_chroot

0.092634s

chroot_basic

Passed

N/A

0.015357s

chroot_err

Passed

N/A

0.012782s

chroot_perm

Passed

N/A

0.016430s

fchroot_basic

Passed

N/A

0.014744s

fchroot_err

Passed

N/A

0.012779s

fchroot_perm

Passed

N/A

0.016121s

lib/libc/sys/t_clock_gettime

17.201103s

clock_gettime_real

Passed

N/A

17.201064s

lib/libc/sys/t_clock_nanosleep

0.013315s

clock_nanosleep_remain

Passed

N/A

0.012505s

lib/libc/sys/t_clone

0.057660s

clone_basic

Passed

N/A

0.013594s

clone_null_func

Passed

N/A

0.013401s

clone_null_stack

Passed

N/A

0.013093s

clone_out_of_proc

Passed

N/A

0.014513s

lib/libc/sys/t_connect

0.027842s

connect_foreign_family

Passed

N/A

0.013188s

connect_low_port

Passed

N/A

0.013102s

lib/libc/sys/t_dup

0.190022s

dup2_basic

Passed

N/A

0.013159s

dup2_err

Passed

N/A

0.013271s

dup2_max

Passed

N/A

0.013046s

dup2_mode

Passed

N/A

0.026422s

dup3_err

Passed

N/A

0.012936s

dup3_max

Passed

N/A

0.012917s

dup3_mode

Passed

N/A

0.026095s

dup_err

Passed

N/A

0.012898s

dup_max

Passed

N/A

0.027802s

dup_mode

Passed

N/A

0.024152s

lib/libc/sys/t_fsync

0.026569s

fsync_err

Passed

N/A

0.012061s

fsync_sync

Passed

N/A

0.012936s

lib/libc/sys/t_getcontext

0.037430s

getcontext_err

Passed

N/A

0.012008s

setcontext_err

Passed

N/A

0.011507s

setcontext_link

Passed

N/A

0.011666s

lib/libc/sys/t_getgroups

0.061227s

getgroups_err

Passed

N/A

0.012043s

getgroups_getgid

Passed

N/A

0.011389s

getgroups_setgid

Passed

N/A

0.023142s

getgroups_zero

Passed

N/A

0.011543s

lib/libc/sys/t_getitimer

0.073566s

getitimer_empty

Passed

N/A

0.012498s

getitimer_err

Passed

N/A

0.011596s

setitimer_basic

Passed

N/A

0.022625s

setitimer_err

Passed

N/A

0.011521s

setitimer_old

Passed

N/A

0.011417s

lib/libc/sys/t_getlogin

0.073345s

getlogin_r_err

Passed

N/A

0.011708s

getlogin_same

Passed

N/A

0.013423s

setlogin_basic

Passed

N/A

0.015185s

setlogin_err

Passed

N/A

0.014033s

setlogin_perm

Passed

N/A

0.015107s

lib/libc/sys/t_getpid

0.048658s

getpid_process

Passed

N/A

0.033525s

getpid_thread

Passed

N/A

0.013612s

lib/libc/sys/t_getrusage

2.636802s

getrusage_err

Passed

N/A

0.011967s

getrusage_sig

Passed

N/A

0.011522s

getrusage_utime_back

Expected failure

PR kern/30115: user time went backwards

2.595181s

getrusage_utime_zero

Expected failure

PR kern/30115: zero user time from getrusage(2)

0.014940s

lib/libc/sys/t_getsid

0.038958s

getsid_current

Passed

N/A

0.012015s

getsid_err

Passed

N/A

0.011467s

getsid_process

Passed

N/A

0.013237s

lib/libc/sys/t_getsockname

0.013971s

getsockname_unix

Passed

N/A

0.013147s

lib/libc/sys/t_gettimeofday

0.026707s

gettimeofday_err

Passed

N/A

0.012516s

gettimeofday_mono

Passed

N/A

0.012695s

lib/libc/sys/t_issetugid

0.066624s

issetugid_egid

Passed

N/A

0.016393s

issetugid_euid

Passed

N/A

0.016215s

issetugid_rgid

Passed

N/A

0.016102s

issetugid_ruid

Passed

N/A

0.014932s

lib/libc/sys/t_kevent

0.098323s

kevent_zerotimer

Passed

N/A

0.013376s

kqueue_desc_passing

Skipped

PR kern/46523

0.014202s

kqueue_unsupported_fd

Passed

N/A

0.068464s

lib/libc/sys/t_kill

1.086716s

kill_basic

Passed

N/A

0.015414s

kill_err

Passed

N/A

0.015051s

kill_perm

Passed

N/A

1.021059s

kill_pgrp_neg

Passed

N/A

0.015723s

kill_pgrp_zero

Passed

N/A

0.015845s

lib/libc/sys/t_link

0.089961s

link_count

Passed

N/A

0.024320s

link_err

Passed

N/A

0.023124s

link_perm

Passed

N/A

0.014372s

link_stat

Passed

N/A

0.024874s

lib/libc/sys/t_listen

0.039475s

listen_err

Passed

N/A

0.025375s

listen_low_port

Passed

N/A

0.012694s

lib/libc/sys/t_lwp_ctl

0.031050s

lwpctl_counter

Passed

N/A

0.030340s

lib/libc/sys/t_lwp_create

0.080842s

lwp_create_generic_fail_no_uc_cpu

Passed

N/A

0.013321s

lwp_create_sparc_fail_npc_null

Passed

N/A

0.012787s

lwp_create_sparc_fail_npc_odd

Passed

N/A

0.012803s

lwp_create_sparc_fail_pc_null

Passed

N/A

0.012667s

lwp_create_sparc_fail_pc_odd

Passed

N/A

0.012869s

lwp_create_works

Passed

N/A

0.012956s

lib/libc/sys/t_minherit

0.076302s

minherit_bad

Passed

N/A

0.012725s

minherit_copy

Passed

N/A

0.015349s

minherit_none

Passed

N/A

0.014763s

minherit_share

Passed

N/A

0.014911s

minherit_zero

Passed

N/A

0.015647s

lib/libc/sys/t_mincore

0.123105s

mincore_err

Passed

N/A

0.013198s

mincore_resid

Passed

N/A

0.086481s

mincore_shmseg

Passed

N/A

0.021383s

lib/libc/sys/t_mkdir

1.091023s

mkdir_err

Passed

N/A

0.013751s

mkdir_mode

Passed

N/A

1.032301s

mkdir_perm

Passed

N/A

0.027745s

mkdir_trail

Passed

N/A

0.013412s

lib/libc/sys/t_mkfifo

2.144565s

mkfifo_block

Passed

N/A

1.036451s

mkfifo_err

Passed

N/A

0.024740s

mkfifo_nonblock

Passed

N/A

1.032643s

mkfifo_perm

Passed

N/A

0.024831s

mkfifo_stat

Passed

N/A

0.021956s

lib/libc/sys/t_mknod

0.094505s

mknod_err

Passed

N/A

0.022462s

mknod_exist

Passed

N/A

0.022239s

mknod_perm

Passed

N/A

0.024651s

mknod_stat

Passed

N/A

0.022131s

lib/libc/sys/t_mlock

0.073338s

mlock_clip

Passed

N/A

0.011962s

mlock_err

Passed

N/A

0.011731s

mlock_limits

Passed

N/A

0.022737s

mlock_mmap

Passed

N/A

0.011989s

mlock_nested

Passed

N/A

0.011790s

lib/libc/sys/t_mmap

0.182714s

mmap_block

Skipped

The test case causes a panic (PR kern/38889, kern/46592)

0.011638s

mmap_err

Passed

N/A

0.012030s

mmap_loan

Passed

N/A

0.025207s

mmap_prot_1

Passed

N/A

0.026213s

mmap_prot_2

Passed

N/A

0.015014s

mmap_prot_3

Passed

N/A

0.026590s

mmap_truncate

Passed

N/A

0.023017s

mmap_truncate_signal

Passed

N/A

0.024561s

mmap_va0

Passed

N/A

0.012016s

lib/libc/sys/t_mprotect

0.078317s

mprotect_access

Passed

N/A

0.022421s

mprotect_err

Passed

N/A

0.011473s

mprotect_exec

Skipped

Execute protection callback check not implemented

0.011443s

mprotect_pax

Failed

non-executable mapping made executable

0.013864s

mprotect_write

Passed

N/A

0.015080s

lib/libc/sys/t_msgctl

2.134978s

msgctl_err

Passed

N/A

0.025447s

msgctl_perm

Passed

N/A

0.025574s

msgctl_pid

Passed

N/A

2.035034s

msgctl_set

Passed

N/A

0.023734s

msgctl_time

Passed

N/A

0.021929s

lib/libc/sys/t_msgget

0.119841s

msgget_excl

Passed

N/A

0.025505s

msgget_exit

Passed

N/A

0.026574s

msgget_init

Passed

N/A

0.024989s

msgget_limit

Passed

N/A

0.014979s

msgget_mode

Passed

N/A

0.023853s

lib/libc/sys/t_msgrcv

4.160883s

msgrcv_basic

Passed

N/A

0.025572s

msgrcv_block

Passed

N/A

2.041595s

msgrcv_err

Passed

N/A

0.022014s

msgrcv_mtype

Passed

N/A

0.022017s

msgrcv_nonblock

Passed

N/A

2.023911s

msgrcv_truncate

Passed

N/A

0.021897s

lib/libc/sys/t_msgsnd

4.122439s

msgsnd_block

Passed

N/A

2.025570s

msgsnd_count

Passed

N/A

0.022193s

msgsnd_err

Passed

N/A

0.021862s

msgsnd_nonblock

Passed

N/A

2.024303s

msgsnd_perm

Passed

N/A

0.025232s

lib/libc/sys/t_msync

0.074036s

msync_async

Passed

N/A

0.016315s

msync_err

Passed

N/A

0.020624s

msync_invalidate

Passed

N/A

0.016011s

msync_sync

Passed

N/A

0.018246s

lib/libc/sys/t_nanosleep

1.222126s

nanosleep_basic

Passed

N/A

0.190356s

nanosleep_err

Passed

N/A

0.013212s

nanosleep_sig

Passed

N/A

1.015979s

lib/libc/sys/t_pipe

2.039298s

pipe_restart

Passed

N/A

2.038444s

lib/libc/sys/t_pipe2

0.079293s

pipe2_basic

Passed

N/A

0.013940s

pipe2_cloexec

Passed

N/A

0.013055s

pipe2_consume

Passed

N/A

0.013033s

pipe2_einval

Passed

N/A

0.012046s

pipe2_nonblock

Passed

N/A

0.011529s

pipe2_nosigpipe

Passed

N/A

0.011406s

lib/libc/sys/t_poll

11.107122s

poll_3way

Passed

N/A

10.025050s

poll_basic

Passed

N/A

0.026177s

poll_err

Passed

N/A

0.011584s

pollts_basic

Passed

N/A

1.017343s

pollts_err

Passed

N/A

0.011740s

pollts_sigmask

Passed

N/A

0.011903s

lib/libc/sys/t_posix_fallocate

0.012096s

ebadf

Passed

N/A

0.011515s

lib/libc/sys/t_recvmmsg

0.175866s

recvmmsg_basic

Passed

N/A

0.175307s

lib/libc/sys/t_revoke

0.063701s

revoke_basic

Passed

N/A

0.023963s

revoke_err

Passed

N/A

0.012992s

revoke_perm

Passed

N/A

0.024801s

lib/libc/sys/t_select

1.041202s

pselect_sigmask

Passed

N/A

1.023105s

pselect_timeout

Passed

N/A

0.016589s

lib/libc/sys/t_setrlimit

0.174698s

setrlimit_basic

Passed

N/A

0.013369s

setrlimit_current

Passed

N/A

0.012262s

setrlimit_err

Passed

N/A

0.011782s

setrlimit_fsize

Passed

N/A

0.024480s

setrlimit_memlock

Passed

N/A

0.015302s

setrlimit_nofile_1

Passed

N/A

0.016156s

setrlimit_nofile_2

Passed

N/A

0.016198s

setrlimit_nproc

Passed

N/A

0.015290s

setrlimit_nthr

Passed

N/A

0.013379s

setrlimit_perm

Passed

N/A

0.013098s

setrlimit_stack

Passed

N/A

0.013528s

lib/libc/sys/t_setuid

0.112309s

setuid_perm

Passed

N/A

0.013960s

setuid_real

Passed

N/A

0.011467s

setuid_root

Passed

N/A

0.084392s

lib/libc/sys/t_sigaction

0.043475s

sigaction_basic

Passed

N/A

0.013022s

sigaction_noflags

Passed

N/A

0.014220s

sigaction_resethand

Passed

N/A

0.013880s

lib/libc/sys/t_sigqueue

1.047329s

sigqueue_basic

Passed

N/A

0.013244s

sigqueue_err

Passed

N/A

0.012697s

sigqueue_rt

Passed

N/A

1.019161s

lib/libc/sys/t_sigtimedwait

10.047490s

sigtimedwait_NULL_timeout

Passed

N/A

5.016783s

sigtimedwait_all0timeout

Passed

N/A

0.012926s

sigtimedwait_small_timeout

Passed

N/A

5.015565s

lib/libc/sys/t_socketpair

0.041056s

socketpair_basic

Passed

N/A

0.013004s

socketpair_cloexec

Passed

N/A

0.012864s

socketpair_nonblock

Passed

N/A

0.012932s

lib/libc/sys/t_swapcontext

0.027896s

swapcontext1

Passed

N/A

0.012978s

swapcontext2

Passed

N/A

0.013583s

lib/libc/sys/t_stat

4.094011s

stat_chflags

Passed

N/A

0.025630s

stat_dir

Passed

N/A

0.911697s

stat_err

Passed

N/A

0.014217s

stat_mtime

Passed

N/A

3.054529s

stat_perm

Passed

N/A

0.024133s

stat_size

Passed

N/A

0.022914s

stat_socket

Passed

N/A

0.011937s

stat_symlink

Passed

N/A

0.022601s

lib/libc/sys/t_timer_create

6.091214s

timer_create_err

Passed

N/A

0.011783s

timer_create_mono

Passed

N/A

1.018818s

timer_create_mono_expire

Passed

N/A

2.018744s

timer_create_real

Passed

N/A

1.020250s

timer_create_real_expire

Passed

N/A

2.018759s

lib/libc/sys/t_truncate

0.074054s

ftruncate_basic

Passed

N/A

0.022658s

ftruncate_err

Passed

N/A

0.013001s

truncate_basic

Passed

N/A

0.022701s

truncate_err

Passed

N/A

0.013039s

lib/libc/sys/t_ucontext

0.012328s

ucontext_basic

Passed

N/A

0.011806s

lib/libc/sys/t_umask

0.085116s

umask_fork

Passed

N/A

0.039383s

umask_open

Passed

N/A

0.022511s

umask_previous

Passed

N/A

0.021543s

lib/libc/sys/t_unlink

0.132967s

unlink_basic

Passed

N/A

0.059801s

unlink_err

Passed

N/A

0.022277s

unlink_fifo

Passed

N/A

0.022869s

unlink_perm

Passed

N/A

0.025194s

lib/libc/sys/t_wait

0.089358s

wait6_coredumped

Passed

N/A

0.017167s

wait6_exited

Passed

N/A

0.014220s

wait6_invalid

Passed

N/A

0.011462s

wait6_stop_and_go

Passed

N/A

0.013023s

wait6_stopgo_loop

Passed

N/A

0.016353s

wait6_terminated

Passed

N/A

0.013089s

lib/libc/sys/t_wait_noproc

0.137024s

wait

Passed

N/A

0.012070s

wait3

Passed

N/A

0.011731s

wait3_options

Passed

N/A

0.011761s

wait4

Passed

N/A

0.011813s

wait4_options

Passed

N/A

0.011847s

wait6

Passed

N/A

0.011835s

wait6_options

Passed

N/A

0.011999s

waitid

Passed

N/A

0.012149s

waitid_options

Passed

N/A

0.012036s

waitpid

Passed

N/A

0.011770s

waitpid_options

Passed

N/A

0.012229s

lib/libc/sys/t_wait_noproc_wnohang

0.123956s

wait3

Passed

N/A

0.011893s

wait3_options

Passed

N/A

0.011888s

wait4

Passed

N/A

0.011763s

wait4_options

Passed

N/A

0.011946s

wait6

Passed

N/A

0.011648s

wait6_options

Passed

N/A

0.012067s

waitid

Passed

N/A

0.011730s

waitid_options

Passed

N/A

0.012101s

waitpid

Passed

N/A

0.011826s

waitpid_options

Passed

N/A

0.011845s

lib/libc/sys/t_write

0.094689s

write_err

Passed

N/A

0.022832s

write_pipe

Passed

N/A

0.011527s

write_pos

Passed

N/A

0.023065s

write_ret

Passed

N/A

0.023033s

writev_iovmax

Passed

N/A

0.011519s

lib/libc/sys/t_posix_fadvise

0.076393s

posix_fadvise

Passed

N/A

0.018043s

posix_fadvise_reg

Passed

N/A

0.056535s

lib/libc/termios/t_tcsetpgrp

0.012420s

tcsetpgrp_err

Passed

N/A

0.011866s

lib/libc/time/t_mktime

0.039199s

localtime_r_gmt

Passed

N/A

0.012906s

mktime_negyear

Passed

N/A

0.012191s

timegm_epoch

Passed

N/A

0.012452s

lib/libc/time/t_strptime

0.126206s

Zone

Passed

N/A

0.036032s

common

Passed

N/A

0.011716s

day

Passed

N/A

0.011639s

hour

Passed

N/A

0.011531s

month

Passed

N/A

0.011608s

seconds

Passed

N/A

0.011435s

year

Passed

N/A

0.011437s

zone

Passed

N/A

0.016457s

lib/libc/tls/t_tls_static

0.009453s

t_tls_static

Passed

N/A

0.008937s

lib/libc/tls/t_tls_dynamic

0.023618s

t_tls_dynamic

Passed

N/A

0.023074s

lib/libc/tls/t_tls_dlopen

0.027897s

t_tls_dlopen

Passed

N/A

0.027323s

lib/libc/ttyio/t_ptm

0.026962s

ptm

Passed

N/A

0.013031s

ptmx

Passed

N/A

0.012809s

lib/libc/ttyio/t_ttyio

2.022741s

ioctl

Passed

N/A

2.021953s

lib/libc/ssp/t_ssp

3.127448s

fgets

Passed

N/A

0.176996s

getcwd

Passed

N/A

0.156499s

gets

Passed

N/A

0.174383s

memcpy

Passed

N/A

0.154061s

memmove

Passed

N/A

0.156715s

memset

Passed

N/A

0.165382s

raw

Passed

N/A

0.165374s

read

Passed

N/A

0.174330s

readlink

Passed

N/A

0.155121s

snprintf

Passed

N/A

0.170201s

sprintf

Passed

N/A

0.160084s

stpcpy

Passed

N/A

0.157222s

stpncpy

Passed

N/A

0.163395s

strcat

Passed

N/A

0.164000s

strcpy

Passed

N/A

0.163476s

strncat

Passed

N/A

0.167170s

strncpy

Passed

N/A

0.156109s

vsnprintf

Passed

N/A

0.160087s

vsprintf

Passed

N/A

0.156150s

lib/libc/t_convfp

0.053815s

cast_ulong

Passed

N/A

0.013268s

cast_ulong2

Passed

N/A

0.012535s

conv_uint

Passed

N/A

0.012572s

conv_ulong

Passed

N/A

0.012568s

lib/libc/t_gdtoa

0.022761s

long_format

Passed

N/A

0.021869s

lib/libc/t_cdb

0.119946s

cdb

Passed

N/A

0.119065s

lib/libcrypt/t_crypt

0.025264s

crypt_salts

Passed

N/A

0.024410s

lib/libcurses/t_curses

14.012580s

addch

Passed

N/A

0.328358s

addchnstr

Passed

N/A

0.192580s

addchstr

Passed

N/A

0.198712s

addnstr

Passed

N/A

0.189058s

addstr

Passed

N/A

0.199422s

assume_default_colors

Passed

N/A

0.353726s

attributes

Passed

N/A

0.523410s

background

Passed

N/A

0.419149s

box

Passed

N/A

0.285211s

can_change_color

Passed

N/A

0.162589s

cbreak

Passed

N/A

0.449494s

clear

Passed

N/A

2.379715s

copywin

Passed

N/A

1.489952s

curs_set

Passed

N/A

0.208578s

getch

Passed

N/A

0.189127s

getstr

Passed

N/A

0.350131s

mvwin

Passed

N/A

0.328015s

startup

Passed

N/A

0.149456s

termattrs

Passed

N/A

0.169102s

timeout

Passed

N/A

4.429655s

wborder

Passed

N/A

0.249424s

window

Passed

N/A

0.188925s

wprintw

Passed

N/A

0.210018s

wscrl

Passed

N/A

0.349679s

lib/libevent/t_event

243.961798s

kqueue

Passed

N/A

82.033221s

poll

Passed

N/A

81.007387s

select

Passed

N/A

80.918944s

lib/libexecinfo/t_backtrace

0.024340s

backtrace_fmt_basic

Passed

N/A

0.023830s

lib/libm/t_acos

0.039156s

acos_inrange

Passed

N/A

0.012804s

acos_is_nan

Passed

N/A

0.012486s

acos_is_plus_zero

Passed

N/A

0.012240s

lib/libm/t_asin

0.183922s

asin_inf_neg

Passed

N/A

0.012897s

asin_inf_pos

Passed

N/A

0.012679s

asin_inrange

Passed

N/A

0.012772s

asin_nan

Passed

N/A

0.012614s

asin_range

Passed

N/A

0.012697s

asin_zero_neg

Passed

N/A

0.012475s

asin_zero_pos

Passed

N/A

0.012448s

asinf_inf_neg

Passed

N/A

0.012597s

asinf_inf_pos

Passed

N/A

0.012569s

asinf_inrange

Passed

N/A

0.012561s

asinf_nan

Passed

N/A

0.012483s

asinf_range

Passed

N/A

0.012566s

asinf_zero_neg

Passed

N/A

0.012539s

asinf_zero_pos

Passed

N/A

0.012593s

lib/libm/t_atan

0.051617s

atan_inrange

Passed

N/A

0.012656s

atan_nan

Passed

N/A

0.012270s

atan_zero_neg

Passed

N/A

0.012310s

atan_zero_pos

Passed

N/A

0.012239s

lib/libm/t_casinh

0.013095s

casinh

Passed

N/A

0.012522s

lib/libm/t_cbrt

0.239912s

cbrt_inf_neg

Passed

N/A

0.013164s

cbrt_inf_pos

Passed

N/A

0.012788s

cbrt_nan

Passed

N/A

0.012645s

cbrt_pow

Passed

N/A

0.012885s

cbrt_zero_neg

Passed

N/A

0.012675s

cbrt_zero_pos

Passed

N/A

0.012747s

cbrtf_inf_neg

Passed

N/A

0.012768s

cbrtf_inf_pos

Passed

N/A

0.012847s

cbrtf_nan

Passed

N/A

0.012739s

cbrtf_powf

Passed

N/A

0.012962s

cbrtf_zero_neg

Passed

N/A

0.013009s

cbrtf_zero_pos

Passed

N/A

0.012777s

cbrtl_inf_neg

Passed

N/A

0.012752s

cbrtl_inf_pos

Passed

N/A

0.012826s

cbrtl_nan

Passed

N/A

0.012720s

cbrtl_powl

Passed

N/A

0.012955s

cbrtl_zero_neg

Passed

N/A

0.012711s

cbrtl_zero_pos

Passed

N/A

0.012703s

lib/libm/t_ceil

0.793946s

ceil_basic

Passed

N/A

0.014436s

ceil_inf_neg

Passed

N/A

0.014256s

ceil_inf_pos

Passed

N/A

0.014151s

ceil_nan

Passed

N/A

0.014137s

ceil_zero_neg

Passed

N/A

0.014184s

ceil_zero_pos

Passed

N/A

0.014083s

ceilf_basic

Passed

N/A

0.014098s

ceilf_inf_neg

Passed

N/A

0.014109s

ceilf_inf_pos

Passed

N/A

0.014304s

ceilf_nan

Passed

N/A

0.014218s

ceilf_zero_neg

Passed

N/A

0.014181s

ceilf_zero_pos

Passed

N/A

0.014145s

ceill_basic

Passed

N/A

0.014045s

ceill_inf_neg

Passed

N/A

0.014260s

ceill_inf_pos

Passed

N/A

0.014212s

ceill_nan

Passed

N/A

0.014326s

ceill_zero_neg

Passed

N/A

0.014119s

ceill_zero_pos

Passed

N/A

0.014155s

floor_basic

Passed

N/A

0.014061s

floor_inf_neg

Passed

N/A

0.014212s

floor_inf_pos

Passed

N/A

0.014075s

floor_nan

Passed

N/A

0.014258s

floor_zero_neg

Passed

N/A

0.014205s

floor_zero_pos

Passed

N/A

0.014265s

floorf_basic

Passed

N/A

0.014095s

floorf_inf_neg

Passed

N/A

0.014156s

floorf_inf_pos

Passed

N/A

0.014150s

floorf_nan

Passed

N/A

0.014176s

floorf_zero_neg

Passed

N/A

0.014168s

floorf_zero_pos

Passed

N/A

0.014277s

floorl_basic

Passed

N/A

0.014203s

floorl_inf_neg

Passed

N/A

0.014145s

floorl_inf_pos

Passed

N/A

0.014442s

floorl_nan

Passed

N/A

0.014183s

floorl_zero_neg

Passed

N/A

0.014267s

floorl_zero_pos

Passed

N/A

0.014133s

trunc_basic

Passed

N/A

0.014150s

trunc_inf_neg

Passed

N/A

0.014197s

trunc_inf_pos

Passed

N/A

0.014220s

trunc_nan

Passed

N/A

0.014174s

trunc_zero_neg

Passed

N/A

0.014243s

trunc_zero_pos

Passed

N/A

0.014161s

truncf_basic

Passed

N/A

0.014144s

truncf_inf_neg

Passed

N/A

0.014267s

truncf_inf_pos

Passed

N/A

0.014181s

truncf_nan

Passed

N/A

0.014110s

truncf_zero_neg

Passed

N/A

0.014110s

truncf_zero_pos

Passed

N/A

0.014124s

truncl_basic

Passed

N/A

0.014080s

truncl_inf_neg

Passed

N/A

0.014269s

truncl_inf_pos

Passed

N/A

0.014167s

truncl_nan

Passed

N/A

0.014257s

truncl_zero_neg

Passed

N/A

0.014227s

truncl_zero_pos

Passed

N/A

0.014147s

lib/libm/t_cos

0.158254s

cos_angles

Passed

N/A

0.012938s

cos_inf_neg

Passed

N/A

0.012618s

cos_inf_pos

Passed

N/A

0.013766s

cos_nan

Passed

N/A

0.012623s

cos_zero_neg

Passed

N/A

0.012599s

cos_zero_pos

Passed

N/A

0.012576s

cosf_angles

Passed

N/A

0.012559s

cosf_inf_neg

Passed

N/A

0.012517s

cosf_inf_pos

Passed

N/A

0.012503s

cosf_nan

Passed

N/A

0.012399s

cosf_zero_neg

Passed

N/A

0.012447s

cosf_zero_pos

Passed

N/A

0.012446s

lib/libm/t_cosh

0.156559s

cosh_inf_neg

Passed

N/A

0.012922s

cosh_inf_pos

Passed

N/A

0.012556s

cosh_inrange

Passed

N/A

0.012694s

cosh_nan

Passed

N/A

0.012484s

cosh_zero_neg

Passed

N/A

0.012362s

cosh_zero_pos

Passed

N/A

0.012460s

coshf_inf_neg

Passed

N/A

0.012538s

coshf_inf_pos

Passed

N/A

0.012555s

coshf_inrange

Passed

N/A

0.012440s

coshf_nan

Passed

N/A

0.012499s

coshf_zero_neg

Passed

N/A

0.012471s

coshf_zero_pos

Passed

N/A

0.012466s

lib/libm/t_erf

0.211389s

erf_inf_neg

Passed

N/A

0.012951s

erf_inf_pos

Passed

N/A

0.012796s

erf_nan

Passed

N/A

0.012851s

erf_zero_neg

Passed

N/A

0.012551s

erf_zero_pos

Passed

N/A

0.012726s

erfc_inf_neg

Passed

N/A

0.012765s

erfc_inf_pos

Passed

N/A

0.012602s

erfc_nan

Passed

N/A

0.012730s

erfcf_inf_neg

Passed

N/A

0.012682s

erfcf_inf_pos

Passed

N/A

0.012665s

erfcf_nan

Passed

N/A

0.012636s

erff_inf_neg

Passed

N/A

0.012700s

erff_inf_pos

Passed

N/A

0.012673s

erff_nan

Passed

N/A

0.012637s

erff_zero_neg

Passed

N/A

0.012553s

erff_zero_pos

Passed

N/A

0.012609s

lib/libm/t_exp

0.353548s

exp2_is_nan

Passed

N/A

0.013512s

exp2_is_plus_zero

Passed

N/A

0.013245s

exp2_powers

Passed

N/A

0.013246s

exp2_values

Passed

N/A

0.013134s

exp_inf_neg

Passed

N/A

0.013012s

exp_inf_pos

Passed

N/A

0.012942s

exp_nan

Passed

N/A

0.013033s

exp_product

Passed

N/A

0.013159s

exp_zero_neg

Passed

N/A

0.012953s

exp_zero_pos

Passed

N/A

0.012988s

expf_inf_neg

Passed

N/A

0.013056s

expf_inf_pos

Passed

N/A

0.013093s

expf_nan

Passed

N/A

0.013036s

expf_product

Passed

N/A

0.013083s

expf_zero_neg

Passed

N/A

0.012992s

expf_zero_pos

Passed

N/A

0.012964s

expm1_inf_neg

Passed

N/A

0.012924s

expm1_inf_pos

Passed

N/A

0.013094s

expm1_nan

Passed

N/A

0.013031s

expm1_zero_neg

Passed

N/A

0.012982s

expm1_zero_pos

Passed

N/A

0.012909s

expm1f_inf_neg

Passed

N/A

0.013015s

expm1f_inf_pos

Passed

N/A

0.013016s

expm1f_nan

Passed

N/A

0.013045s

expm1f_zero_neg

Passed

N/A

0.012910s

expm1f_zero_pos

Passed

N/A

0.013170s

lib/libm/t_fenv

0.051665s

feenableexcept

Passed

N/A

0.012645s

fegetexcept

Passed

N/A

0.012323s

fegetround

Passed

N/A

0.012234s

fesetround

Passed

N/A

0.012313s

lib/libm/t_fmod

0.013212s

fmod

Passed

N/A

0.012623s

lib/libm/t_hypot

0.038919s

hypot_integer

Passed

N/A

0.012766s

hypotf_integer

Passed

N/A

0.012323s

pr50698

Passed

N/A

0.012102s

lib/libm/t_ilogb

0.015070s

ilogb

Passed

N/A

0.014205s

lib/libm/t_infinity

0.043536s

infinity_double

Passed

N/A

0.013771s

infinity_float

Passed

N/A

0.013749s

infinity_long_double

Passed

N/A

0.013854s

lib/libm/t_ldexp

0.282824s

ldexp_basic

Passed

N/A

0.013862s

ldexp_denormal

Passed

N/A

0.013574s

ldexp_denormal_large

Passed

N/A

0.013693s

ldexp_exp2

Passed

N/A

0.012962s

ldexp_inf_neg

Passed

N/A

0.012885s

ldexp_inf_pos

Passed

N/A

0.014797s

ldexp_infinity

Passed

N/A

0.014683s

ldexp_nan

Passed

N/A

0.014287s

ldexp_overflow

Passed

N/A

0.014374s

ldexp_underflow

Passed

N/A

0.014613s

ldexp_zero

Passed

N/A

0.014469s

ldexp_zero_neg

Passed

N/A

0.014439s

ldexp_zero_pos

Passed

N/A

0.014381s

ldexpf_exp2f

Passed

N/A

0.014354s

ldexpf_inf_neg

Passed

N/A

0.014413s

ldexpf_inf_pos

Passed

N/A

0.014340s

ldexpf_nan

Passed

N/A

0.014319s

ldexpf_zero_neg

Passed

N/A

0.014514s

ldexpf_zero_pos

Passed

N/A

0.014393s

lib/libm/t_log

0.839703s

log10_base

Passed

N/A

0.014951s

log10_inf_neg

Passed

N/A

0.014537s

log10_inf_pos

Passed

N/A

0.014416s

log10_nan

Passed

N/A

0.016476s

log10_one_pos

Passed

N/A

0.015910s

log10_zero_neg

Passed

N/A

0.016031s

log10_zero_pos

Passed

N/A

0.014670s

log10f_base

Passed

N/A

0.014363s

log10f_inf_neg

Passed

N/A

0.016241s

log10f_inf_pos

Passed

N/A

0.015980s

log10f_nan

Passed

N/A

0.015970s

log10f_one_pos

Passed

N/A

0.014745s

log10f_zero_neg

Passed

N/A

0.014383s

log10f_zero_pos

Passed

N/A

0.014352s

log1p_inf_neg

Passed

N/A

0.014461s

log1p_inf_pos

Passed

N/A

0.014547s

log1p_nan

Passed

N/A

0.014362s

log1p_one_neg

Passed

N/A

0.014382s

log1p_zero_neg

Passed

N/A

0.014322s

log1p_zero_pos

Passed

N/A

0.014382s

log1pf_inf_neg

Passed

N/A

0.014557s

log1pf_inf_pos

Passed

N/A

0.014406s

log1pf_nan

Passed

N/A

0.014436s

log1pf_one_neg

Passed

N/A

0.014464s

log1pf_zero_neg

Passed

N/A

0.014267s

log1pf_zero_pos

Passed

N/A

0.014303s

log2_base

Passed

N/A

0.014419s

log2_inf_neg

Passed

N/A

0.014498s

log2_inf_pos

Passed

N/A

0.014613s

log2_nan

Passed

N/A

0.014437s

log2_one_pos

Passed

N/A

0.014436s

log2_zero_neg

Passed

N/A

0.016825s

log2_zero_pos

Passed

N/A

0.014775s

log2f_base

Passed

N/A

0.014669s

log2f_inf_neg

Passed

N/A

0.014977s

log2f_inf_pos

Passed

N/A

0.014687s

log2f_nan

Passed

N/A

0.016036s

log2f_one_pos

Passed

N/A

0.014831s

log2f_zero_neg

Passed

N/A

0.017090s

log2f_zero_pos

Passed

N/A

0.015010s

log_base

Passed

N/A

0.014666s

log_inf_neg

Passed

N/A

0.014658s

log_inf_pos

Passed

N/A

0.014744s

log_nan

Passed

N/A

0.014876s

log_one_pos

Passed

N/A

0.014558s

log_zero_neg

Passed

N/A

0.014355s

log_zero_pos

Passed

N/A

0.014289s

logf_base

Passed

N/A

0.014176s

logf_inf_neg

Passed

N/A

0.014323s

logf_inf_pos

Passed

N/A

0.014355s

logf_nan

Passed

N/A

0.014335s

logf_one_pos

Passed

N/A

0.014253s

logf_zero_neg

Passed

N/A

0.014293s

logf_zero_pos

Passed

N/A

0.014304s

lib/libm/t_modf

0.013185s

modf

Passed

N/A

0.012412s

lib/libm/t_pow

0.283406s

pow_inf_neg_x

Passed

N/A

0.013172s

pow_inf_neg_y

Passed

N/A

0.013117s

pow_inf_pos_x

Passed

N/A

0.012974s

pow_inf_pos_y

Passed

N/A

0.013029s

pow_nan_x

Passed

N/A

0.012885s

pow_nan_y

Passed

N/A

0.013047s

pow_one_neg_x

Passed

N/A

0.012917s

pow_one_pos_x

Passed

N/A

0.012921s

pow_zero_x

Passed

N/A

0.012937s

pow_zero_y

Passed

N/A

0.014342s

powf_inf_neg_x

Passed

N/A

0.013015s

powf_inf_neg_y

Passed

N/A

0.012915s

powf_inf_pos_x

Passed

N/A

0.012881s

powf_inf_pos_y

Passed

N/A

0.012861s

powf_nan_x

Passed

N/A

0.012742s

powf_nan_y

Passed

N/A

0.015193s

powf_one_neg_x

Passed

N/A

0.014831s

powf_one_pos_x

Passed

N/A

0.014580s

powf_zero_x

Passed

N/A

0.014630s

powf_zero_y

Passed

N/A

0.014563s

lib/libm/t_precision

0.015378s

t_precision

Passed

N/A

0.014458s

lib/libm/t_round

0.015249s

round_dir

Passed

N/A

0.014479s

lib/libm/t_scalbn

0.294141s

scalbn_inf_neg

Passed

N/A

0.013196s

scalbn_inf_pos

Passed

N/A

0.012863s

scalbn_ldexp

Passed

N/A

0.012964s

scalbn_nan

Passed

N/A

0.012775s

scalbn_val

Passed

N/A

0.012934s

scalbn_zero_neg

Passed

N/A

0.012850s

scalbn_zero_pos

Passed

N/A

0.012901s

scalbnf_inf_neg

Passed

N/A

0.015028s

scalbnf_inf_pos

Passed

N/A

0.014592s

scalbnf_ldexpf

Passed

N/A

0.014508s

scalbnf_nan

Passed

N/A

0.014565s

scalbnf_val

Passed

N/A

0.014431s

scalbnf_zero_neg

Passed

N/A

0.014420s

scalbnf_zero_pos

Passed

N/A

0.014365s

scalbnl_inf_neg

Passed

N/A

0.014527s

scalbnl_inf_pos

Passed

N/A

0.014482s

scalbnl_nan

Passed

N/A

0.014575s

scalbnl_val

Passed

N/A

0.013525s

scalbnl_zero_neg

Passed

N/A

0.014048s

scalbnl_zero_pos

Passed

N/A

0.014706s

lib/libm/t_sin

0.171464s

sin_angles

Passed

N/A

0.013625s

sin_inf_neg

Passed

N/A

0.014159s

sin_inf_pos

Passed

N/A

0.012957s

sin_nan

Passed

N/A

0.012614s

sin_zero_neg

Passed

N/A

0.014536s

sin_zero_pos

Passed

N/A

0.013202s

sinf_angles

Passed

N/A

0.014440s

sinf_inf_neg

Passed

N/A

0.014338s

sinf_inf_pos

Passed

N/A

0.012920s

sinf_nan

Passed

N/A

0.012721s

sinf_zero_neg

Passed

N/A

0.012566s

sinf_zero_pos

Passed

N/A

0.014529s

lib/libm/t_sinh

0.181828s

sinh_inf_neg

Passed

N/A

0.015114s

sinh_inf_pos

Passed

N/A

0.014338s

sinh_inrange

Passed

N/A

0.014231s

sinh_nan

Passed

N/A

0.014314s

sinh_zero_neg

Passed

N/A

0.014134s

sinh_zero_pos

Passed

N/A

0.014358s

sinhf_inf_neg

Passed

N/A

0.014217s

sinhf_inf_pos

Passed

N/A

0.014293s

sinhf_inrange

Passed

N/A

0.014264s

sinhf_nan

Passed

N/A

0.014110s

sinhf_zero_neg

Passed

N/A

0.014217s

sinhf_zero_pos

Passed

N/A

0.014174s

lib/libm/t_sqrt

0.257832s

sqrt_inf_neg

Passed

N/A

0.015336s

sqrt_inf_pos

Passed

N/A

0.014571s

sqrt_nan

Passed

N/A

0.014624s

sqrt_pow

Passed

N/A

0.014684s

sqrt_zero_neg

Passed

N/A

0.014433s

sqrt_zero_pos

Passed

N/A

0.014456s

sqrtf_inf_neg

Passed

N/A

0.014710s

sqrtf_inf_pos

Passed

N/A

0.013296s

sqrtf_nan

Passed

N/A

0.013020s

sqrtf_powf

Passed

N/A

0.012852s

sqrtf_zero_neg

Passed

N/A

0.012884s

sqrtf_zero_pos

Passed

N/A

0.012773s

sqrtl_inf_neg

Passed

N/A

0.013011s

sqrtl_inf_pos

Passed

N/A

0.012937s

sqrtl_nan

Passed

N/A

0.012879s

sqrtl_powl

Passed

N/A

0.013008s

sqrtl_zero_neg

Passed

N/A

0.012816s

sqrtl_zero_pos

Passed

N/A

0.012904s

lib/libm/t_tan

0.159053s

tan_angles

Passed

N/A

0.012894s

tan_inf_neg

Passed

N/A

0.012643s

tan_inf_pos

Passed

N/A

0.012568s

tan_nan

Passed

N/A

0.012591s

tan_zero_neg

Passed

N/A

0.012582s

tan_zero_pos

Passed

N/A

0.012608s

tanf_angles

Passed

N/A

0.012690s

tanf_inf_neg

Passed

N/A

0.012652s

tanf_inf_pos

Passed

N/A

0.012605s

tanf_nan

Passed

N/A

0.012603s

tanf_zero_neg

Passed

N/A

0.012512s

tanf_zero_pos

Passed

N/A

0.012511s

lib/libm/t_tanh

0.144048s

tanh_inf_neg

Passed

N/A

0.012817s

tanh_inf_pos

Passed

N/A

0.012604s

tanh_nan

Passed

N/A

0.014843s

tanh_zero_neg

Passed

N/A

0.014404s

tanh_zero_pos

Passed

N/A

0.014382s

tanhf_inf_neg

Passed

N/A

0.014249s

tanhf_inf_pos

Passed

N/A

0.013285s

tanhf_nan

Passed

N/A

0.014289s

tanhf_zero_neg

Passed

N/A

0.013040s

tanhf_zero_pos

Passed

N/A

0.012676s

lib/libobjc/t_threads

0.015611s

thread_callback

Passed

N/A

0.015020s

lib/libposix/bsd/t_rename

0.012430s

rename

Passed

N/A

0.011709s

lib/libposix/posix1/t_rename

0.012569s

rename

Passed

N/A

0.011700s

lib/libposix/posix2/t_rename

0.012470s

rename

Passed

N/A

0.011612s

lib/libppath/t_ppath

0.366608s

component_at

Passed

N/A

0.014643s

copydel_bool_success

Passed

N/A

0.014938s

copydel_object_twice_success

Passed

N/A

0.014713s

copyset_bool_success

Passed

N/A

0.014641s

copyset_object_twice_success

Passed

N/A

0.014598s

create_bool_eexist

Passed

N/A

0.014135s

create_bool_success

Passed

N/A

0.014149s

delete_bool_eftype

Passed

N/A

0.014106s

delete_bool_enoent

Passed

N/A

0.014070s

delete_bool_success

Passed

N/A

0.014048s

get_bool_eftype

Passed

N/A

0.014116s

get_bool_enoent

Passed

N/A

0.014065s

get_bool_success

Passed

N/A

0.014112s

get_idx_key

Passed

N/A

0.013771s

get_string_eftype

Passed

N/A

0.014134s

get_string_enoent

Passed

N/A

0.014203s

get_string_success

Passed

N/A

0.014121s

length

Passed

N/A

0.013997s

pop_until_empty

Passed

N/A

0.013822s

ppath_copy

Passed

N/A

0.013746s

push_until_full

Passed

N/A

0.013762s

replace

Passed

N/A

0.013875s

set_bool_eftype

Passed

N/A

0.014042s

set_bool_enoent

Passed

N/A

0.014108s

set_bool_success

Passed

N/A

0.014037s

lib/libprop/t_basic

0.026484s

prop_basic

Passed

N/A

0.013042s

prop_dictionary_equals

Passed

N/A

0.012356s

lib/libpthread/t_barrier

10.060869s

barrier

Passed

N/A

10.060306s

lib/libpthread/t_cond

9.067967s

bogus_timedwaits

Passed

N/A

0.013885s

broadcast

Passed

N/A

0.395883s

cond_timedwait_race

Passed

N/A

2.176608s

condattr

Passed

N/A

0.013654s

destroy_after_cancel

Passed

N/A

0.013507s

signal_before_unlock

Passed

N/A

2.018281s

signal_before_unlock_static_init

Passed

N/A

2.019495s

signal_delay_wait

Passed

N/A

2.019864s

signal_wait_race

Passed

N/A

0.392096s

lib/libpthread/t_condwait

4.036505s

cond_wait_mono

Passed

N/A

2.015883s

cond_wait_real

Passed

N/A

2.019626s

lib/libpthread/t_detach

0.013616s

pthread_detach

Passed

N/A

0.013080s

lib/libpthread/t_equal

0.013879s

pthread_equal

Passed

N/A

0.013339s

lib/libpthread/t_fork

5.020714s

fork

Passed

N/A

5.020110s

lib/libpthread/t_fpu

0.018682s

fpu

Passed

N/A

0.017859s

lib/libpthread/t_join

0.020691s

pthread_join

Passed

N/A

0.020060s

lib/libpthread/t_kill

0.036385s

simple

Passed

N/A

0.035664s

lib/libpthread/t_mutex

53.124204s

mutex1

Passed

N/A

4.025002s

mutex2

Passed

N/A

7.050519s

mutex3

Passed

N/A

6.747432s

mutex4

Passed

N/A

4.030716s

mutex5

Passed

N/A

10.019884s

mutex6

Failed

/usr/src/tests/lib/libpthread/t_mutex.c:524: start != 1

21.219681s

mutexattr1

Passed

N/A

0.013084s

mutexattr2

Passed

N/A

0.013216s

lib/libpthread/t_name

0.016893s

name

Passed

N/A

0.015951s

lib/libpthread/t_once

0.045624s

once1

Passed

N/A

0.012887s

once2

Passed

N/A

0.017611s

once3

Passed

N/A

0.013169s

lib/libpthread/t_preempt

1.021648s

preempt1

Passed

N/A

1.020821s

lib/libpthread/t_rwlock

1.031382s

rwlock1

Passed

N/A

1.017420s

rwlock_static

Passed

N/A

0.012754s

lib/libpthread/t_sem

20.447997s

before_start_no_threads

Passed

N/A

10.009590s

before_start_one_thread

Passed

N/A

10.008403s

named

Passed

N/A

0.015059s

unnamed

Passed

N/A

0.412563s

lib/libpthread/t_sigmask

4.089012s

before_threads

Passed

N/A

0.015255s

incorrect_mask_bug

Passed

N/A

3.037537s

respected_while_running

Passed

N/A

1.019424s

upcalls_not_started

Passed

N/A

0.014560s

lib/libpthread/t_sigsuspend

1.019825s

sigsuspend

Passed

N/A

1.019187s

lib/libpthread/t_siglongjmp

0.013669s

siglongjmp1

Passed

N/A

0.013077s

lib/libpthread/t_sleep

1.020457s

sleep1

Passed

N/A

1.019843s

lib/libpthread/t_swapcontext

0.015790s

swapcontext1

Passed

N/A

0.015205s

lib/libpthread/t_timedmutex

84.819472s

mutex1

Passed

N/A

4.033018s

mutex2

Passed

N/A

22.804170s

mutex3

Passed

N/A

22.598463s

mutex4

Passed

N/A

4.036643s

mutex5

Passed

N/A

10.018855s

mutex6

Passed

N/A

21.230097s

mutexattr1

Passed

N/A

0.015359s

mutexattr2

Passed

N/A

0.015103s

timedmutex1

Passed

N/A

0.014712s

timedmutex2

Passed

N/A

0.015055s

timedmutex3

Passed

N/A

0.015686s

timedmutex4

Passed

N/A

0.015170s

lib/libpthread/t_atexit

0.138005s

atexit

Passed

N/A

0.137065s

lib/libpthread/t_cancel

0.132851s

register_while_disabled

Passed

N/A

0.132092s

lib/libpthread/t_exit

0.128122s

main_thread

Passed

N/A

0.127359s

lib/libpthread/t_resolv

5.152713s

resolv

Passed

N/A

5.152037s

lib/libpthread_dbg/t_dummy

0.042110s

dummy1

Passed

N/A

0.013337s

dummy2

Passed

N/A

0.013387s

dummy3

Passed

N/A

0.013632s

lib/libpthread_dbg/t_threads

0.159811s

threads1

Passed

N/A

0.016707s

threads2

Passed

N/A

0.016113s

threads3

Passed

N/A

0.018453s

threads4

Passed

N/A

0.017893s

threads5

Passed

N/A

0.017996s

threads6

Passed

N/A

0.016193s

threads7

Passed

N/A

0.016120s

threads8

Passed

N/A

0.017959s

threads9

Passed

N/A

0.016164s

lib/librefuse/t_refuse_opt

0.143467s

t_fuse_opt_add_arg

Passed

N/A

0.015813s

t_fuse_opt_add_opt

Passed

N/A

0.015837s

t_fuse_opt_add_opt_escaped

Passed

N/A

0.015612s

t_fuse_opt_insert_arg

Passed

N/A

0.015881s

t_fuse_opt_match

Passed

N/A

0.015715s

t_fuse_opt_parse

Passed

N/A

0.014942s

t_fuse_opt_parse_null_args

Passed

N/A

0.014209s

t_fuse_opt_parse_null_opts

Passed

N/A

0.014282s

t_fuse_opt_parse_null_proc

Passed

N/A

0.014321s

lib/librt/t_sched

0.109595s

sched_getparam

Passed

N/A

0.012697s

sched_priority

Passed

N/A

0.012591s

sched_rr_get_interval_1

Passed

N/A

0.012476s

sched_rr_get_interval_2

Passed

N/A

0.012579s

sched_setscheduler_1

Passed

N/A

0.012441s

sched_setscheduler_2

Passed

N/A

0.012390s

sched_setscheduler_3

Passed

N/A

0.014479s

sched_setscheduler_4

Passed

N/A

0.013976s

lib/librt/t_sem

20.228624s

basic

Passed

N/A

0.012560s

child

Passed

N/A

20.214506s

lib/libtre/t_regex_att

0.217090s

basic

Passed

N/A

0.076187s

categorization

Passed

N/A

0.024781s

forcedassoc

Passed

N/A

0.021740s

leftassoc

Passed

N/A

0.017939s

nullsubexpr

Passed

N/A

0.019320s

repetition

Passed

N/A

0.038023s

rightassoc

Expected failure

Reason for breakage unknown: /usr/src/tests/lib/libtre/../libc/regex/t_regex_att.c:377: res != matches ((0,4)(0,1)(1,4)(4,4) != (0,4)(0,2)(2,3)(3,4)): at line 3

0.014476s

lib/libtre/t_exhaust

4.293860s

regcomp_too_big

Passed

N/A

4.293072s

lib/libusbhid/t_usbhid

0.094900s

check_hid_get_data

Expected failure

only the 32-bit opcode works, 8 and 16-bit is broken: 4 checks failed as expected; see output for more details

0.013560s

check_hid_logical_range

Expected failure

only the 32-bit opcode works, 8 and 16-bit is broken: 4 checks failed as expected; see output for more details

0.013594s

check_hid_physical_range

Expected failure

only the 32-bit opcode works, 8 and 16-bit is broken: 4 checks failed as expected; see output for more details

0.013685s

check_hid_set_data

Passed

N/A

0.012444s

check_hid_usage

Passed

N/A

0.023513s

check_parse_just_pop

Passed

N/A

0.013557s

lib/libutil/t_efun

0.058615s

ecalloc

Passed

N/A

0.014329s

efopen

Passed

N/A

0.013819s

emalloc

Passed

N/A

0.013487s

erealloc

Passed

N/A

0.013465s

lib/libutil/t_parsedate

2.687298s

atsecs

Passed

N/A

0.017798s

dates

Passed

N/A

0.016211s

dsttimes

Passed

N/A

0.049265s

gibberish

Passed

N/A

0.015119s

relative

Passed

N/A

2.548124s

times

Passed

N/A

0.016886s

zones

Passed

N/A

0.017470s

lib/libutil/t_pidfile

0.114658s

change_basenames

Passed

N/A

0.021229s

change_mix

Passed

N/A

0.020185s

change_paths

Passed

N/A

0.018074s

custom_basename

Passed

N/A

0.017185s

custom_path

Passed

N/A

0.016568s

default_path

Passed

N/A

0.017008s

lib/libutil/t_snprintb

0.025040s

snprintb

Passed

N/A

0.012133s

snprintb_m

Passed

N/A

0.011790s

lib/libutil/t_sockaddr_snprintf

0.063694s

sockaddr_snprintf_at

Passed

N/A

0.012442s

sockaddr_snprintf_dl

Passed

N/A

0.012271s

sockaddr_snprintf_in

Passed

N/A

0.012194s

sockaddr_snprintf_in6

Passed

N/A

0.012187s

sockaddr_snprintf_un

Passed

N/A

0.012017s

lib/semaphore/pthread/t_sem_pth

0.642044s

blocktimedwait

Passed

N/A

0.121211s

blockwait

Passed

N/A

0.239763s

busydestroy

Passed

N/A

0.059077s

destroy

Passed

N/A

0.042712s

initvalue

Passed

N/A

0.043875s

named

Passed

N/A

0.044287s

postwait

Passed

N/A

0.042833s

unlink

Passed

N/A

0.043712s

lib/librumpclient/t_fd

0.391324s

bigenough

Passed

N/A

0.119209s

sigio

Passed

N/A

0.270554s

lib/librumpclient/t_exec

4.257981s

cloexec

Passed

N/A

0.625765s

exec

Passed

N/A

0.604266s

noexec

Passed

N/A

0.593318s

threxec

Passed

N/A

1.737859s

vfork

Passed

N/A

0.683949s

lib/librumphijack/t_asyncio

1.089183s

invafd

Passed

N/A

0.365219s

select_allunset

Passed

N/A

0.380523s

select_timeout

Passed

N/A

0.340285s

lib/librumphijack/t_config

0.367238s

fdoff

Passed

N/A

0.366373s

lib/librumphijack/t_cwd

2.658272s

basic_chdir

Passed

N/A

0.333949s

basic_fchdir

Passed

N/A

0.331951s

slash_chdir

Passed

N/A

0.341114s

slash_fchdir

Passed

N/A

0.333687s

symlink_chdir

Passed

N/A

0.326214s

symlink_fchdir

Passed

N/A

0.332432s

symlink_slash_chdir

Passed

N/A

0.324205s

symlink_slash_fchdir

Passed

N/A

0.327180s

lib/librumphijack/t_sh

0.941956s

redirect

Passed

N/A

0.515203s

runscript

Passed

N/A

0.424210s

lib/librumphijack/t_tcpip

4.473843s

http

Passed

N/A

0.826148s

nfs

Passed

N/A

1.950696s

nfs_autoload

Skipped

test currently valid only on i386

0.233091s

ssh

Expected failure

PR lib/50174: atf-check failed; see the output of the test for details

1.452227s

lib/librumphijack/t_vfs

5.344521s

blanket

Passed

N/A

0.385467s

cpcopy

Passed

N/A

0.785002s

doubleblanket

Passed

N/A

0.530565s

ln_nox

Passed

N/A

0.734388s

ln_x

Passed

N/A

0.384394s

mv_nox

Passed

N/A

0.692958s

mv_x

Passed

N/A

0.600308s

paxcopy

Passed

N/A

0.826579s

runonprefix

Passed

N/A

0.374135s

lib/libdes/t_des

0.215852s

align

Passed

N/A

0.020844s

cbc

Passed

N/A

0.013401s

cbc_cksum

Passed

N/A

0.013214s

cbcm

Passed

N/A

0.013224s

cfb

Passed

N/A

0.013429s

desx_cbc

Passed

N/A

0.013693s

ecb

Passed

N/A

0.013285s

ede_cbc

Passed

N/A

0.013353s

ede_ecb

Passed

N/A

0.013549s

ede_ofb64

Passed

N/A

0.013280s

fast_crypt

Passed

N/A

0.013160s

ofb

Passed

N/A

0.013253s

ofb64

Passed

N/A

0.013183s

pcbc

Passed

N/A

0.013167s

quad_cksum

Passed

N/A

0.012992s

lib/libskey/t_algorithms

0.092442s

md4

Passed

N/A

0.013838s

md5

Passed

N/A

0.013595s

sha1

Passed

N/A

0.063173s

libexec/ld.elf_so/t_dlerror-cleared

0.013920s

rtld_dlerror_cleared

Passed

N/A

0.013190s

libexec/ld.elf_so/t_dlerror-false

0.013110s

rtld_dlerror_false

Passed

N/A

0.012388s

libexec/ld.elf_so/t_dlinfo

0.053545s

rtld_dlinfo_linkmap_dlopen

Passed

N/A

0.012259s

rtld_dlinfo_linkmap_dlopen_iter

Passed

N/A

0.012014s

rtld_dlinfo_linkmap_inval

Passed

N/A

0.013387s

rtld_dlinfo_linkmap_self

Passed

N/A

0.012803s

libexec/ld.elf_so/t_dlvsym

0.077035s

rtld_dlvsym_symbol_nonexistent

Passed

N/A

0.018428s

rtld_dlvsym_v1

Passed

N/A

0.013597s

rtld_dlvsym_v3

Passed

N/A

0.013850s

rtld_dlvsym_version_nonexistent

Passed

N/A

0.013397s

rtld_dlvsym_version_null

Passed

N/A

0.013462s

libexec/ld.elf_so/t_ifunc

0.054709s

rtld_ifunc

Passed

N/A

0.053739s

libexec/ld.elf_so/t_df_1_noopen

0.290077s

df_1_noopen1

Passed

N/A

0.145241s

df_1_noopen2

Passed

N/A

0.142820s

libexec/ld.elf_so/t_dl_symver

0.612979s

dl_symver

Passed

N/A

0.612064s

net/fdpass/t_fdpass

0.683229s

fdpass_compat

Passed

N/A

0.250994s

fdpass_compat_normal

Passed

N/A

0.146746s

fdpass_normal

Passed

N/A

0.129241s

fdpass_normal_compat

Passed

N/A

0.152964s

net/in_cksum/t_in_cksum

22.316869s

mbufs_aligned

Passed

N/A

7.091857s

mbufs_unaligned

Passed

N/A

7.024804s

sizes_aligned

Passed

N/A

4.313026s

sizes_unaligned

Passed

N/A

3.884073s

net/net/t_unix

0.044979s

sockaddr_un_closed

Passed

N/A

0.014590s

sockaddr_un_len_exceed

Passed

N/A

0.013335s

sockaddr_un_len_max

Passed

N/A

0.014265s

net/net/t_tcp

0.041067s

fcntl_reset_nonblock

Passed

N/A

0.013648s

paccept_nonblock

Passed

N/A

0.013076s

paccept_reset_nonblock

Passed

N/A

0.012005s

net/net/t_udp

0.026968s

udp4_send

Passed

N/A

0.012761s

udp6_send

Passed

N/A

0.012807s

net/net/t_pktinfo

0.012460s

pktinfo

Passed

N/A

0.011702s

net/net/t_raw

0.170547s

PRU_SENSE

Passed

N/A

0.169712s

net/net/t_forwarding

67.414311s

ipforwarding_fastforward_v4

Passed

N/A

7.043846s

ipforwarding_fastforward_v6

Passed

N/A

7.038996s

ipforwarding_misc

Passed

N/A

22.427056s

ipforwarding_v4

Passed

N/A

12.826394s

ipforwarding_v6

Passed

N/A

18.056724s

net/net/t_ipaddress

12.300339s

ipaddr_auto_linklocal

Passed

N/A

1.176441s

ipaddr_same_address

Passed

N/A

6.817253s

ipaddr_same_address6

Passed

N/A

4.298738s

net/net/t_ipv6address

39.853700s

linklocal

Passed

N/A

37.857880s

linklocal_ops

Passed

N/A

1.986020s

net/net/t_ipv6_lifetime

29.674404s

basic

Passed

N/A

29.670879s

net/net/t_mtudisc

12.218531s

mtudisc_basic

Passed

N/A

12.214462s

net/net/t_mtudisc6

13.614512s

mtudisc6_basic

Passed

N/A

13.610756s

net/net/t_ping6_opts

42.605748s

ping6_opts_gateway

Passed

N/A

10.280696s

ping6_opts_hops

Passed

N/A

15.137986s

ping6_opts_interface

Passed

N/A

8.075644s

ping6_opts_sourceaddr

Passed

N/A

9.094599s

net/sys/t_rfc6056

0.050609s

inet4

Passed

N/A

0.024499s

inet6

Passed

N/A

0.024993s

net/arp/t_arp

77.878745s

arp_cache_expiration_10s

Passed

N/A

13.620395s

arp_cache_expiration_5s

Passed

N/A

8.594868s

arp_cache_overwriting

Passed

N/A

1.726162s

arp_command

Passed

N/A

9.452538s

arp_garp

Passed

N/A

5.898556s

arp_link_activation

Passed

N/A

3.827528s

arp_proxy_arp_pub

Passed

N/A

17.148426s

arp_proxy_arp_pubproxy

Passed

N/A

16.052186s

arp_static

Passed

N/A

1.532652s

net/arp/t_dad

16.931133s

dad_basic

Passed

N/A

13.295656s

dad_duplicated

Passed

N/A

3.626775s

net/bpf/t_bpf

0.376264s

bpfwriteleak

Passed

N/A

0.181386s

bpfwritetrunc

Passed

N/A

0.192438s

net/bpf/t_div-by-zero

0.183613s

div_by_zero

Passed

N/A

0.182860s

net/bpf/t_mbuf

3.684216s

bpf_mbuf_ldb_abs

Passed

N/A

0.182542s

bpf_mbuf_ldb_abs_overflow

Passed

N/A

0.185753s

bpf_mbuf_ldb_ind

Passed

N/A

0.199096s

bpf_mbuf_ldb_ind_overflow1

Passed

N/A

0.187055s

bpf_mbuf_ldb_ind_overflow2

Passed

N/A

0.181451s

bpf_mbuf_ldb_ind_overflow3

Passed

N/A

0.181695s

bpf_mbuf_ldh_abs

Passed

N/A

0.181505s

bpf_mbuf_ldh_abs_overflow

Passed

N/A

0.182158s

bpf_mbuf_ldh_ind

Passed

N/A

0.178754s

bpf_mbuf_ldh_ind_overflow1

Passed

N/A

0.177016s

bpf_mbuf_ldh_ind_overflow2

Passed

N/A

0.185066s

bpf_mbuf_ldh_ind_overflow3

Passed

N/A

0.183618s

bpf_mbuf_ldw_abs

Passed

N/A

0.182950s

bpf_mbuf_ldw_abs_overflow

Passed

N/A

0.189193s

bpf_mbuf_ldw_ind

Passed

N/A

0.185637s

bpf_mbuf_ldw_ind_overflow1

Passed

N/A

0.184613s

bpf_mbuf_ldw_ind_overflow2

Passed

N/A

0.182629s

bpf_mbuf_ldw_ind_overflow3

Passed

N/A

0.182602s

bpf_mbuf_msh

Passed

N/A

0.178559s

bpf_mbuf_msh_overflow

Passed

N/A

0.175704s

net/bpfilter/t_bpfilter

1.602458s

bpfilterbadjmp

Passed

N/A

0.184160s

bpfilterbadmem

Passed

N/A

0.185264s

bpfilterbadret

Passed

N/A

0.181654s

bpfiltercontig

Passed

N/A

0.229813s

bpfiltermchain

Passed

N/A

0.238517s

bpfilternegjmp

Passed

N/A

0.190979s

bpfilternoinitA

Passed

N/A

0.186237s

bpfilternoinitX

Passed

N/A

0.190212s

net/carp/t_basic

8.361616s

handover

Passed

N/A

8.359661s

net/icmp/t_forward

1.206443s

returndatabytes

Passed

N/A

1.204532s

net/icmp/t_ping

9.994675s

floodping

Passed

N/A

2.346635s

floodping2

Passed

N/A

3.196783s

ping_of_death

Passed

N/A

0.275640s

pingsize

Passed

N/A

3.453758s

simpleping

Passed

N/A

0.713410s

net/icmp/t_ping2

0.949478s

basic

Passed

N/A

0.947632s

net/icmp/t_icmp_redirect

22.418947s

icmp_redirect

Passed

N/A

7.662047s

icmp_redirect_timeout

Passed

N/A

14.748816s

net/icmp/t_icmp6_redirect

13.205555s

icmp6_redirect_basic

Passed

N/A

13.201758s

net/if/t_compat

0.187326s

OOSIOCGIFBRDADDR

Expected failure

PR kern/51610: rump does not include COMPAT_43: /usr/src/tests/net/if/t_compat.c:72: rump_sys_ioctl(fd, ((((unsigned long)0x80000000|(unsigned long)0x40000000)) | (((sizeof(struct oifreq)) & 0x1fff) << 16) | ((('i')) << 8) | ((18))), &ifreq): Inappropriate ioctl for device

0.184503s

net/if/t_ifconf

1.855981s

basic

Passed

N/A

1.853994s

net/if/t_ifconfig

29.088385s

ifconfig_create_destroy

Passed

N/A

0.961666s

ifconfig_options

Passed

N/A

5.610702s

ifconfig_parameters

Passed

N/A

22.508802s

net/if_bridge/t_bridge

88.283838s

bridge_ipv4

Passed

N/A

14.163478s

bridge_ipv6

Passed

N/A

24.341702s

bridge_member_ipv4

Passed

N/A

19.864295s

bridge_member_ipv6

Passed

N/A

25.795661s

bridge_rtable

Passed

N/A

4.101121s

net/if_gif/t_gif

141.843578s

gif_basic_ipv4overipv4

Passed

N/A

9.619249s

gif_basic_ipv4overipv6

Passed

N/A

9.574570s

gif_basic_ipv6overipv4

Passed

N/A

14.600248s

gif_basic_ipv6overipv6

Passed

N/A

14.594236s

gif_ioctl_ipv4overipv4

Passed

N/A

10.710392s

gif_ioctl_ipv4overipv6

Passed

N/A

10.770266s

gif_ioctl_ipv6overipv4

Passed

N/A

15.793464s

gif_ioctl_ipv6overipv6

Passed

N/A

15.774887s

gif_recursive_ipv4overipv4

Passed

N/A

10.074810s

gif_recursive_ipv4overipv6

Passed

N/A

10.109291s

gif_recursive_ipv6overipv4

Passed

N/A

10.106361s

gif_recursive_ipv6overipv6

Passed

N/A

10.066765s

net/if_loop/t_pr

0.349842s

loopmtu

Passed

N/A

0.172227s

loopmtu_csum

Passed

N/A

0.175903s

net/if_pppoe/t_pppoe

83.921493s

pppoe6_chap

Passed

N/A

19.964072s

pppoe6_pap

Passed

N/A

20.261524s

pppoe_chap

Passed

N/A

21.860420s

pppoe_pap

Passed

N/A

21.824585s

net/if_tap/t_tap

12.770766s

tap_bridged

Passed

N/A

5.087867s

tap_create_destroy

Passed

N/A

0.901346s

tap_stand_alone

Passed

N/A

6.773887s

net/if_tun/t_tun

13.382398s

tun_create_destroy

Passed

N/A

0.595816s

tun_setup

Passed

N/A

12.783488s

net/mcast/t_mcast

23.842578s

mcast_conninet4

Passed

N/A

3.050840s

mcast_conninet6

Passed

N/A

2.892156s

mcast_connmappedbuginet4

Passed

N/A

3.030152s

mcast_connmappedinet4

Passed

N/A

2.916568s

mcast_unconninet4

Passed

N/A

2.939124s

mcast_unconninet6

Passed

N/A

3.101122s

mcast_unconnmappedbuginet4

Passed

N/A

2.797181s

mcast_unconnmappedinet4

Passed

N/A

3.095823s

net/mpls/t_mpls_fw

4.954215s

mplsfw4

Passed

N/A

2.496798s

mplsfw4_expl

Passed

N/A

2.451042s

net/mpls/t_mpls_fw6

5.305473s

mplsfw6

Passed

N/A

2.707691s

mplsfw6_expl

Passed

N/A

2.587855s

net/mpls/t_mpls_fw64

5.535045s

mplsfw64_expl

Passed

N/A

2.811674s

mplsfw64_impl

Passed

N/A

2.712266s

net/mpls/t_rfc4182

2.480900s

rfc4182

Passed

N/A

2.474828s

net/mpls/t_ldp_regen

19.909419s

ldp_regen

Passed

N/A

19.904545s

net/ndp/t_dad

28.766643s

dad_basic

Passed

N/A

5.549562s

dad_count

Passed

N/A

16.318068s

dad_duplicated

Passed

N/A

6.890219s

net/ndp/t_ndp

45.005425s

ndp_cache_expiration

Passed

N/A

19.201778s

ndp_cache_overwriting

Passed

N/A

5.503457s

ndp_commands

Passed

N/A

7.323471s

ndp_link_activation

Passed

N/A

7.650579s

ndp_neighborgcthresh

Passed

N/A

5.313285s

net/ndp/t_ra

22.008855s

ra_basic

Passed

N/A

22.006406s

net/npf/t_npf

2.111180s

npf_bpf

Passed

N/A

0.386718s

npf_nat

Passed

N/A

0.329650s

npf_nbuf

Passed

N/A

0.339011s

npf_rule

Passed

N/A

0.328155s

npf_state

Passed

N/A

0.346024s

npf_table

Failed

atf-check failed; see the output of the test for details

0.369341s

net/route/t_change

3.893545s

route_change_gateway

Passed

N/A

0.704071s

route_change_ifa

Passed

N/A

0.840874s

route_change_ifp

Passed

N/A

0.910300s

route_change_ifp_ifa

Passed

N/A

0.819350s

route_change_reject2blackhole

Passed

N/A

0.611159s

net/route/t_flags

21.815735s

route_flags_announce

Passed

N/A

1.360457s

route_flags_blackhole

Passed

N/A

2.492592s

route_flags_connected

Passed

N/A

1.342484s

route_flags_default_gateway

Passed

N/A

1.304920s

route_flags_icmp_redirect

Passed

N/A

7.763672s

route_flags_lo

Passed

N/A

1.283887s

route_flags_reject

Passed

N/A

4.853259s

route_flags_static

Passed

N/A

1.389939s

net/route/t_flags6

13.355463s

route_flags_announce6

Passed

N/A

1.379853s

route_flags_blackhole6

Passed

N/A

2.513131s

route_flags_connected6

Passed

N/A

1.360653s

route_flags_default_gateway6

Passed

N/A

1.347861s

route_flags_lo6

Passed

N/A

1.364707s

route_flags_reject6

Passed

N/A

3.925708s

route_flags_static6

Passed

N/A

1.441946s

net/route/t_route

7.155834s

route_command_get

Passed

N/A

2.355692s

route_command_get6

Passed

N/A

2.369136s

route_non_subnet_gateway

Passed

N/A

2.416930s

net/if_vlan/t_vlan

12.290181s

vlan_basic

Passed

N/A

11.670812s

vlan_create_destroy

Passed

N/A

0.615730s

sbin/fsck_ffs/t_enable_quotas

11.456291s

corrupt_be_1

Passed

N/A

0.873106s

corrupt_be_2

Passed

N/A

0.591899s

corrupt_le_1

Passed

N/A

0.599248s

corrupt_le_2

Passed

N/A

0.597113s

dir1_be_1

Passed

N/A

0.455933s

dir1_be_2

Passed

N/A

0.449449s

dir1_le_1

Passed

N/A

0.465732s

dir1_le_2

Passed

N/A

0.442189s

disable_be_1

Passed

N/A

0.624424s

disable_be_2

Passed

N/A

0.652256s

disable_le_1

Passed

N/A

0.622720s

disable_le_2

Passed

N/A

0.602611s

notreg_be_1

Passed

N/A

0.563776s

notreg_be_2

Passed

N/A

0.554844s

notreg_le_1

Passed

N/A

0.563026s

notreg_le_2

Passed

N/A

0.572700s

unallocated_be_1

Passed

N/A

0.580000s

unallocated_be_2

Passed

N/A

0.526277s

unallocated_le_1

Passed

N/A

0.569435s

unallocated_le_2

Passed

N/A

0.519968s

sbin/fsck_ffs/t_check_quotas

31.632459s

corrupt_list_be_1

Passed

N/A

0.604751s

corrupt_list_be_2

Passed

N/A

0.603301s

corrupt_list_le_1

Passed

N/A

0.598314s

corrupt_list_le_2

Passed

N/A

0.586596s

expand1_list_be_1

Passed

N/A

0.698127s

expand1_list_be_2

Passed

N/A

0.628197s

expand1_list_le_1

Passed

N/A

0.646482s

expand1_list_le_2

Passed

N/A

0.677464s

expand2_list_be_1

Passed

N/A

6.391502s

expand2_list_be_2

Passed

N/A

6.556609s

expand2_list_le_1

Passed

N/A

6.394478s

expand2_list_le_2

Passed

N/A

6.439919s

sbin/gpt/t_gpt

4.483416s

backup_2part

Passed

N/A

0.510248s

bootable_2part

Skipped

Required file '/usr/mdec/gptmbr.bin' not found

0.000393s

change_attr_2part

Passed

N/A

0.465641s

change_type_2part

Passed

N/A

0.455468s

create_2part

Passed

N/A

0.336744s

create_empty

Passed

N/A

0.219177s

label_2part

Passed

N/A

0.365142s

migrate_disklabel

Failed

atf-check failed; see the output of the test for details

0.254026s

recover_backup

Failed

atf-check failed; see the output of the test for details

0.309564s

recover_primary

Passed

N/A

0.362838s

remove_2part

Passed

N/A

0.305290s

resize_2part

Passed

N/A

0.427156s

restore_2part

Passed

N/A

0.458479s

sbin/ifconfig/t_nonexistent

0.131659s

nonexistent

Passed

N/A

0.130872s

sbin/newfs/t_enable_quotas

2.930789s

enabled_be_1_both

Passed

N/A

0.267551s

enabled_be_1_group

Passed

N/A

0.238500s

enabled_be_1_user

Passed

N/A

0.239200s

enabled_be_2_both

Passed

N/A

0.238692s

enabled_be_2_group

Passed

N/A

0.237588s

enabled_be_2_user

Passed

N/A

0.244949s

enabled_le_1_both

Passed

N/A

0.244231s

enabled_le_1_group

Passed

N/A

0.244481s

enabled_le_1_user

Passed

N/A

0.244491s

enabled_le_2_both

Passed

N/A

0.243939s

enabled_le_2_group

Passed

N/A

0.244785s

enabled_le_2_user

Passed

N/A

0.225512s

sbin/newfs_msdos/t_create

0.232960s

validfat32

Passed

N/A

0.230681s

sbin/resize_ffs/t_check

0.430461s

check_grow

Passed

N/A

0.426344s

sbin/resize_ffs/t_grow

32.502755s

grow_16M_v0_8192

Passed

N/A

10.615451s

grow_16M_v1_16384

Passed

N/A

10.968852s

grow_16M_v2_32768

Passed

N/A

10.458265s

grow_ffsv1_partial_cg

Passed

N/A

0.376957s

sbin/resize_ffs/t_shrink

38.886152s

shrink_24M_16M_v0_32768

Passed

N/A

14.209610s

shrink_24M_16M_v1_65536

Passed

N/A

13.038530s

shrink_24M_16M_v2_4096

Expected failure

PR bin/44205: atf-check failed; see the output of the test for details

11.191052s

shrink_ffsv1_partial_cg

Passed

N/A

0.365971s

sbin/resize_ffs/t_grow_swapped

31.625030s

grow_16M_v0_65536

Passed

N/A

9.749426s

grow_16M_v1_4096

Passed

N/A

10.830207s

grow_16M_v2_8192

Passed

N/A

10.600167s

grow_ffsv1_partial_cg

Passed

N/A

0.362239s

sbin/resize_ffs/t_shrink_swapped

40.456461s

shrink_24M_16M_v0_4096

Passed

N/A

14.246345s

shrink_24M_16M_v1_8192

Passed

N/A

14.290593s

shrink_24M_16M_v2_16384

Expected failure

PR bin/44205: atf-check failed; see the output of the test for details

11.441811s

shrink_ffsv1_partial_cg

Passed

N/A

0.397082s

sbin/route/t_missing

0.131973s

missing

Passed

N/A

0.131192s

sbin/sysctl/t_perm

24.423229s

sysctl_ddb

Passed

N/A

0.656612s

sysctl_hw

Passed

N/A

3.361684s

sysctl_kern

Passed

N/A

6.160601s

sysctl_machdep

Passed

N/A

0.482664s

sysctl_net

Passed

N/A

10.445717s

sysctl_security

Passed

N/A

1.418343s

sysctl_vfs

Passed

N/A

0.887468s

sysctl_vm

Passed

N/A

1.001602s

sbin/sysctl/t_sysctl

0.230443s

basic

Passed

N/A

0.229654s

sys/net/t_print

0.027366s

dl_print

Passed

N/A

0.012692s

sdl_print

Passed

N/A

0.013570s

sys/netatalk/t_print

0.025857s

at_print

Passed

N/A

0.012247s

sat_print

Passed

N/A

0.012510s

sys/netinet/t_print

0.027270s

in_print

Passed

N/A

0.012044s

sin_print

Passed

N/A

0.013701s

sys/netinet6/t_print

0.026664s

in6_print

Passed

N/A

0.013107s

sin6_print

Passed

N/A

0.012046s

sys/rc/t_rc_d_cli

3.949163s

default_restart_no_args

Passed

N/A

0.530257s

default_restart_with_args

Passed

N/A

0.399258s

default_start_no_args

Passed

N/A

0.319623s

default_start_with_args

Passed

N/A

0.255338s

default_stop_no_args

Passed

N/A

0.325836s

default_stop_with_args

Passed

N/A

0.378914s

no_command

Passed

N/A

0.164220s

overriden_custom_no_args

Passed

N/A

0.196753s

overriden_custom_with_args

Passed

N/A

0.193629s

overriden_restart_no_args

Passed

N/A

0.187789s

overriden_restart_with_args

Passed

N/A

0.199082s

overriden_start_no_args

Passed

N/A

0.190049s

overriden_start_with_args

Passed

N/A

0.202550s

overriden_stop_no_args

Passed

N/A

0.199112s

overriden_stop_with_args

Passed

N/A

0.194526s

usr.bin/awk/t_awk

3.888168s

assign_NF

Passed

N/A

0.171406s

big_regexp

Passed

N/A

0.162348s

empty_rs

Passed

N/A

0.144983s

end

Passed

N/A

0.244444s

modify_subsep

Passed

N/A

0.143276s

multibyte

Passed

N/A

0.304773s

newline_rs

Passed

N/A

0.139045s

period

Passed

N/A

0.184023s

regex_caret_1_rs

Passed

N/A

0.147496s

regex_caret_2_rs

Passed

N/A

0.146868s

regex_dollar_1_rs

Passed

N/A

0.144231s

regex_dollar_2_rs

Passed

N/A

0.144079s

regex_or_1_rs

Passed

N/A

0.141421s

regex_or_2_rs

Passed

N/A

0.140294s

regex_or_3_rs

Passed

N/A

0.148859s

regex_reallocation_rs

Passed

N/A

0.184861s

regex_two_star_rs

Passed

N/A

0.142170s

single_char_regex_group_rs

Passed

N/A

0.143401s

single_char_regex_star_rs

Passed

N/A

0.140635s

single_char_rs

Passed

N/A

0.139451s

string1

Passed

N/A

0.158782s

two_char_regex_group_rs

Passed

N/A

0.157116s

two_char_regex_star_rs

Passed

N/A

0.146802s

two_char_rs

Passed

N/A

0.145138s

usr.bin/basename/t_basename

0.562183s

basic

Passed

N/A

0.340862s

suffix

Passed

N/A

0.219927s

usr.bin/bzip2/t_bzip2

1.018783s

basic

Passed

N/A

1.018109s

usr.bin/cc/t_hello

6.646871s

hello

Passed

N/A

3.437395s

hello32

Passed

N/A

1.839691s

hello_pic

Passed

N/A

0.775898s

hello_pie

Passed

N/A

0.587272s

usr.bin/cmp/t_cmp

0.465449s

missing

Passed

N/A

0.248347s

skip

Passed

N/A

0.214962s

usr.bin/config/t_config

2.352862s

deffs_redef

Passed

N/A

0.255669s

devi

Passed

N/A

0.248311s

loop

Passed

N/A

0.163780s

loop2

Passed

N/A

0.157408s

min

Passed

N/A

0.195682s

no_pseudo

Passed

N/A

0.154307s

no_select

Passed

N/A

0.176036s

no_undefined_opt

Passed

N/A

0.152921s

postponed_orphan

Passed

N/A

0.156918s

pseudo_parent

Passed

N/A

0.159238s

select

Passed

N/A

0.185823s

shadow_instance

Passed

N/A

0.154255s

undefined_opt

Passed

N/A

0.153129s

usr.bin/cut/t_cut

1.268555s

basic

Passed

N/A

0.231781s

dflag

Passed

N/A

0.231363s

dsflag

Passed

N/A

0.234184s

latin1

Passed

N/A

0.161412s

sflag

Passed

N/A

0.231145s

utf8

Passed

N/A

0.173201s

usr.bin/diff/t_diff

0.421931s

mallocv

Passed

N/A

0.150308s

nomallocv

Passed

N/A

0.134553s

same

Passed

N/A

0.135219s

usr.bin/dirname/t_dirname

0.370393s

basic

Passed

N/A

0.369592s

usr.bin/find/t_find

0.793393s

emptyperm

Passed

N/A

0.517564s

exit

Passed

N/A

0.130144s

exit_status

Passed

N/A

0.143388s

usr.bin/gdb/t_regress

11.847029s

pie

Passed

N/A

3.579177s

threads

Passed

N/A

8.265040s

usr.bin/grep/t_grep

2.549783s

basic

Passed

N/A

0.192146s

begin_end

Passed

N/A

0.186092s

binary

Passed

N/A

0.144961s

context

Passed

N/A

0.256756s

context2

Passed

N/A

0.207574s

egrep

Passed

N/A

0.131663s

file_exp

Passed

N/A

0.145179s

ignore_case

Passed

N/A

0.136701s

invert

Passed

N/A

0.135297s

negative

Passed

N/A

0.134860s

nonexistent

Passed

N/A

0.124097s

recurse

Passed

N/A

0.141551s

recurse_symlink

Passed

N/A

0.152112s

whole_line

Passed

N/A

0.136180s

word_regexps

Passed

N/A

0.131733s

zgrep

Passed

N/A

0.177429s

usr.bin/gzip/t_gzip

4.296476s

concatenated

Passed

N/A

0.158951s

crcerror

Passed

N/A

0.142393s

good

Passed

N/A

0.136522s

pipe

Passed

N/A

3.715991s

truncated

Passed

N/A

0.138173s

usr.bin/id/t_groups

0.495630s

correct

Passed

N/A

0.316516s

syntax

Passed

N/A

0.176316s

usr.bin/id/t_id

4.829201s

Gflag

Passed

N/A

0.607156s

default

Passed

N/A

0.459654s

gflag

Passed

N/A

1.155221s

pflag

Passed

N/A

0.498040s

primaries

Passed

N/A

0.930439s

uflag

Passed

N/A

1.168693s

usr.bin/id/t_whoami

0.371909s

correct

Passed

N/A

0.185075s

syntax

Passed

N/A

0.184217s

usr.bin/infocmp/t_terminfo

0.684508s

basic

Passed

N/A

0.493764s

missing

Passed

N/A

0.188857s

usr.bin/jot/t_jot

0.322535s

basic

Passed

N/A

0.135123s

format

Passed

N/A

0.186005s

usr.bin/ld/t_script

5.085835s

multisec

Passed

N/A

0.710276s

order_default

Passed

N/A

0.995098s

order_merge

Passed

N/A

1.075025s

order_reorder

Passed

N/A

1.022469s

order_sort

Passed

N/A

1.267365s

usr.bin/ld/t_section

0.840873s

orphan

Passed

N/A

0.433047s

startstop

Passed

N/A

0.405344s

usr.bin/m4/t_m4

0.255116s

eof

Passed

N/A

0.253826s

usr.bin/make/t_make

42.185699s

comment

Passed

N/A

0.952314s

cond1

Passed

N/A

0.835608s

cond2

Passed

N/A

0.776199s

doterror

Passed

N/A

0.822019s

dotwait

Passed

N/A

12.129018s

error

Passed

N/A

0.782919s

escape

Expected failure

see PR toolchain/49085: atf-check failed; see the output of the test for details

0.973596s

export

Passed

N/A

0.832919s

export_all

Passed

N/A

0.836359s

export_env

Passed

N/A

0.814952s

forloop

Passed

N/A

0.960405s

forsubst

Passed

N/A

0.768204s

hash

Passed

N/A

0.816998s

impsrc

Expected failure

see PR toolchain/49085: atf-check failed; see the output of the test for details

0.883031s

misc

Passed

N/A

0.774777s

moderrs

Passed

N/A

0.868309s

modmatch

Passed

N/A

0.974698s

modmisc

Passed

N/A

0.842294s

modorder

Passed

N/A

0.878753s

modts

Passed

N/A

0.948496s

modword

Passed

N/A

1.592870s

order

Passed

N/A

0.791873s

phony_end

Expected failure

see PR toolchain/49085: atf-check failed; see the output of the test for details

0.839211s

posix

Passed

N/A

0.856941s

posix1

Expected failure

see PR toolchain/49085: atf-check failed; see the output of the test for details

1.400791s

qequals

Passed

N/A

0.785817s

suffixes

Expected failure

see PR toolchain/49085: this uses up all memory and then fails

0.532113s

sunshcmd

Passed

N/A

0.864496s

sysv

Passed

N/A

0.841029s

ternary

Passed

N/A

0.875202s

unexport

Passed

N/A

0.793846s

unexport_env

Passed

N/A

0.795902s

varcmd

Passed

N/A

0.932673s

varmisc

Passed

N/A

0.879067s

varshell

Passed

N/A

0.886040s

usr.bin/mkdep/t_mkdep

1.085640s

prefix

Passed

N/A

0.282287s

prefix_and_suffixes

Passed

N/A

0.260321s

suffixes

Passed

N/A

0.540040s

usr.bin/nbperf/t_nbperf

37.834388s

bdz

Passed

N/A

12.868838s

chm

Passed

N/A

14.459740s

chm3

Passed

N/A

10.486298s

usr.bin/netpgpverify/t_netpgpverify

6.143057s

netpgpverify_testset_1_rsa_signatures

Passed

N/A

2.213147s

netpgpverify_testset_2_dsa_signatures

Passed

N/A

3.918283s

usr.bin/pr/t_basic

0.173424s

basic

Passed

N/A

0.172694s

usr.bin/rump_server/t_disk

2.947717s

data

Passed

N/A

0.451519s

notrunc

Passed

N/A

0.357338s

offset

Passed

N/A

0.355070s

size

Passed

N/A

0.347472s

type_blk

Passed

N/A

0.353819s

type_blk_default

Passed

N/A

0.364140s

type_chr

Passed

N/A

0.354820s

type_reg

Passed

N/A

0.354625s

usr.bin/shmif_dumpbus/t_basic

3.326051s

contents

Passed

N/A

0.359627s

header

Passed

N/A

0.220048s

pcap

Passed

N/A

2.733146s

usr.bin/sdiff/t_sdiff

3.257553s

dot

Passed

N/A

0.191976s

flags

Passed

N/A

0.249648s

iflags

Passed

N/A

0.507764s

merge

Passed

N/A

1.186526s

oneline

Passed

N/A

0.199574s

same

Passed

N/A

0.149381s

short

Passed

N/A

0.165749s

stdin

Passed

N/A

0.208585s

tabends

Passed

N/A

0.228680s

tabs

Passed

N/A

0.161615s

usr.bin/sed/t_sed

1.323481s

c2048

Passed

N/A

0.141508s

emptybackref

Expected failure

PR bin/28126: atf-check failed; see the output of the test for details

0.193369s

longlines

Passed

N/A

0.187958s

preserve_leading_ws_ia

Passed

N/A

0.140416s

rangeselection

Passed

N/A

0.656022s

usr.bin/sort/t_sort

8.553922s

any_char

Passed

N/A

0.222204s

basic

Passed

N/A

0.152917s

bflag

Passed

N/A

0.224483s

cflag

Passed

N/A

0.141306s

empty_file

Passed

N/A

0.194887s

end_of_options

Passed

N/A

0.178738s

kflag_alpha

Passed

N/A

0.613648s

kflag_limits

Passed

N/A

0.153786s

kflag_many_fields

Passed

N/A

0.156963s

kflag_no_end

Passed

N/A

0.150637s

kflag_nonmonotone

Passed

N/A

0.138328s

kflag_one_field

Passed

N/A

0.158290s

kflag_outofbounds

Passed

N/A

0.140596s

kflag_two_fields

Passed

N/A

0.148833s

long_file

Passed

N/A

0.539463s

long_records

Passed

N/A

0.203458s

mflag

Passed

N/A

0.161535s

mflag_uflag

Passed

N/A

0.139410s

mflag_uflag_first

Passed

N/A

0.176770s

missing_newline

Passed

N/A

0.142184s

nflag

Passed

N/A

0.147395s

nflag_rflag

Passed

N/A

0.159920s

null_bytes

Passed

N/A

0.138383s

oflag

Passed

N/A

0.184719s

oflag_displaced

Passed

N/A

0.135071s

plus_as_path

Passed

N/A

0.144131s

plus_bad_tempfile

Passed

N/A

0.135050s

plus_no_end

Passed

N/A

0.152773s

plus_nonmonotone

Passed

N/A

0.145343s

plus_one

Passed

N/A

0.154715s

plus_one_minus_two

Passed

N/A

0.148039s

plus_rflag_invalid

Passed

N/A

0.153836s

plus_tflag

Passed

N/A

0.735135s

plus_zero

Passed

N/A

0.135717s

rflag

Passed

N/A

0.150756s

sflag

Passed

N/A

0.151256s

sflag_many_files

Passed

N/A

0.160921s

tflag

Passed

N/A

0.231761s

tflag_alphabetic

Passed

N/A

0.138763s

tflag_char_pos

Passed

N/A

0.247223s

tflag_whitespace

Passed

N/A

0.314235s

uflag

Passed

N/A

0.152769s

uflag_rflag

Passed

N/A

0.152309s

usr.bin/tmux/t_tmux

2.132772s

stdin

Passed

N/A

2.131743s

usr.bin/tr/t_basic

3.650123s

csubst

Passed

N/A

0.234811s

dopt

Passed

N/A

1.465156s

dsopt

Passed

N/A

0.656672s

sopt

Passed

N/A

0.615459s

subst

Passed

N/A

0.674627s

usr.bin/unifdef/t_basic

0.354831s

basic

Passed

N/A

0.191852s

lastline

Passed

N/A

0.161244s

usr.bin/uniq/t_uniq

0.652792s

basic

Passed

N/A

0.141834s

show_duplicates

Passed

N/A

0.129167s

show_duplicates_from_third_character

Passed

N/A

0.122294s

show_uniques

Passed

N/A

0.127187s

test_counts

Passed

N/A

0.128916s

usr.bin/vmstat/t_vmstat

0.267789s

default

Passed

N/A

0.143219s

opt_s

Passed

N/A

0.123451s

usr.bin/xlint/lint1/t_integration

6.155442s

alignof

Passed

N/A

0.278577s

c99_complex_num

Passed

N/A

0.156926s

c99_complex_split

Passed

N/A

0.158470s

c99_decls_after_stmt

Passed

N/A

0.160014s

c99_decls_after_stmt3

Passed

N/A

0.161631s

c99_for_loops

Passed

N/A

0.157834s

c99_func

Passed

N/A

0.160765s

c99_recursive_init

Passed

N/A

0.167204s

c99_struct_init

Passed

N/A

0.167218s

c99_union_init1

Passed

N/A

0.157202s

c99_union_init2

Passed

N/A

0.161233s

c99_union_init3

Passed

N/A

0.157970s

c9x_array_init

Passed

N/A

0.153243s

c9x_recursive_init

Passed

N/A

0.150822s

cast_init

Passed

N/A

0.153078s

cast_init2

Passed

N/A

0.149821s

cast_lhs

Passed

N/A

0.155728s

compound_literals1

Passed

N/A

0.156158s

compound_literals2

Passed

N/A

0.154432s

constant_conv1

Passed

N/A

0.164517s

constant_conv2

Passed

N/A

0.165669s

cvt_in_ternary

Passed

N/A

0.161904s

ellipsis_in_switch

Passed

N/A

0.158583s

gcc_compound_statements1

Passed

N/A

0.158899s

gcc_compound_statements2

Passed

N/A

0.160318s

gcc_compound_statements3

Passed

N/A

0.157249s

gcc_func

Passed

N/A

0.159122s

gcc_variable_array_init

Passed

N/A

0.164685s

incorrect_array_size

Passed

N/A

0.160300s

long_double_int

Passed

N/A

0.154544s

nested_structs

Passed

N/A

0.151489s

nolimit_init

Passed

N/A

0.150312s

packed_structs

Passed

N/A

0.149120s

shift_to_narrower_type

Passed

N/A

0.157847s

type_conv1

Passed

N/A

0.158429s

type_conv2

Passed

N/A

0.155911s

type_conv3

Passed

N/A

0.159482s

zero_sized_arrays

Passed

N/A

0.157519s

usr.sbin/mtree/t_mtree

2.675462s

mtree_check

Passed

N/A

0.168235s

mtree_convert_C

Passed

N/A

0.125437s

mtree_convert_C_S

Passed

N/A

0.121346s

mtree_convert_D

Passed

N/A

0.119098s

mtree_convert_D_S

Passed

N/A

0.118957s

mtree_create

Passed

N/A

0.159652s

mtree_ignore

Passed

N/A

0.198773s

mtree_merge

Passed

N/A

0.135141s

mtree_nonemptydir

Passed

N/A

0.162980s

netbsd6_check

Passed

N/A

0.152497s

netbsd6_convert_C

Passed

N/A

0.116672s

netbsd6_convert_C_S

Passed

N/A

0.127422s

netbsd6_convert_D

Passed

N/A

0.121051s

netbsd6_convert_D_S

Passed

N/A

0.124784s

netbsd6_create

Passed

N/A

0.169279s

netbsd6_ignore

Passed

N/A

0.206869s

netbsd6_merge

Passed

N/A

0.136666s

netbsd6_nonemptydir

Passed

N/A

0.175758s

usr.sbin/tcpdump/t_tcpdump

10.237184s

promiscuous

Passed

N/A

10.235929s

usr.sbin/traceroute/t_traceroute

2.933742s

basic

Passed

N/A

1.496904s

basic_icmp

Passed

N/A

1.430602s

usr.sbin/useradd/t_useradd

0.355424s

longname

Expected failure

PR bin/39546: atf-check failed; see the output of the test for details

0.354291s

fs/ffs/t_fifos

0.182969s

fifos

Passed

N/A

0.182288s

fs/ffs/t_snapshot

5.614746s

snapshot

Passed

N/A

0.959867s

snapshotstress

Passed

N/A

4.653376s

fs/ffs/t_snapshot_log

5.681988s

snapshot

Passed

N/A

1.112361s

snapshotstress

Passed

N/A

4.567944s

fs/ffs/t_snapshot_v2

5.523892s

snapshot

Passed

N/A

0.952764s

snapshotstress

Passed

N/A

4.569558s

fs/ffs/t_mount

0.452264s

48Kimage

Expected failure

PR kern/43573: mount failed: Invalid argument

0.128927s

fsbsizeovermaxbsize

Passed

N/A

0.157713s

fsbsizeovermaxphys

Passed

N/A

0.160033s

fs/ffs/t_quota2_1

7.092954s

quota_1000_O1_be

Passed

N/A

1.279351s

quota_1000_O1_le

Passed

N/A

1.479808s

quota_1000_O2_be

Passed

N/A

1.268536s

quota_1000_O2_le

Passed

N/A

1.471414s

quota_40_O1_be

Passed

N/A

0.254591s

quota_40_O1_le

Passed

N/A

0.268615s

quota_40_O1_log

Passed

N/A

0.275287s

quota_40_O2_be

Passed

N/A

0.268400s

quota_40_O2_le

Passed

N/A

0.255079s

quota_40_O2_log

Passed

N/A

0.250697s

fs/ffs/t_quota2_remount

0.476042s

quota_10_O1_be

Passed

N/A

0.222045s

quota_10_O1_le

Passed

N/A

0.251843s

fs/ffs/t_getquota

9.881674s

get_be_1_both

Passed

N/A

0.970908s

get_be_1_group

Passed

N/A

0.835391s

get_be_1_user

Passed

N/A

0.807599s

get_be_2_both

Passed

N/A

0.811589s

get_be_2_group

Passed

N/A

0.804660s

get_be_2_user

Passed

N/A

0.776280s

get_le_1_both

Passed

N/A

0.809964s

get_le_1_group

Passed

N/A

0.832068s

get_le_1_user

Passed

N/A

0.800878s

get_le_2_both

Passed

N/A

0.775032s

get_le_2_group

Passed

N/A

0.838025s

get_le_2_user

Passed

N/A

0.799933s

fs/ffs/t_setquota

35.805968s

set_be_1_both

Passed

N/A

1.016409s

set_be_1_group

Passed

N/A

1.019122s

set_be_1_user

Passed

N/A

0.971691s

set_be_2_both

Passed

N/A

1.013530s

set_be_2_group

Passed

N/A

1.055464s

set_be_2_user

Passed

N/A

0.959477s

set_default_be_1_both

Passed

N/A

0.877040s

set_default_be_1_group

Passed

N/A

0.829326s

set_default_be_1_user

Passed

N/A

0.851683s

set_default_be_2_both

Passed

N/A

0.834276s

set_default_be_2_group

Passed

N/A

0.822859s

set_default_be_2_user

Passed

N/A

0.807168s

set_default_le_1_both

Passed

N/A

0.839967s

set_default_le_1_group

Passed

N/A

0.822442s

set_default_le_1_user

Passed

N/A

0.827765s

set_default_le_2_both

Passed

N/A

0.858952s

set_default_le_2_group

Passed

N/A

0.836239s

set_default_le_2_user

Passed

N/A

0.852061s

set_le_1_both

Passed

N/A

0.973359s

set_le_1_group

Passed

N/A

1.020656s

set_le_1_user

Passed

N/A

0.964872s

set_le_2_both

Passed

N/A

0.969378s

set_le_2_group

Passed

N/A

0.997118s

set_le_2_user

Passed

N/A

1.006421s

set_new_be_1_both

Passed

N/A

0.836932s

set_new_be_1_both_log

Passed

N/A

0.884693s

set_new_be_1_group

Passed

N/A

0.845537s

set_new_be_1_user

Passed

N/A

0.849277s

set_new_be_2_both

Passed

N/A

0.851796s

set_new_be_2_both_log

Passed

N/A

0.855722s

set_new_be_2_group

Passed

N/A

0.855900s

set_new_be_2_user

Passed

N/A

0.864193s

set_new_le_1_both

Passed

N/A

0.864188s

set_new_le_1_both_log

Passed

N/A

0.867638s

set_new_le_1_group

Passed

N/A

0.869716s

set_new_le_1_user

Passed

N/A

0.861460s

set_new_le_2_both

Passed

N/A

0.809702s

set_new_le_2_both_log

Passed

N/A

0.871777s

set_new_le_2_group

Passed

N/A

0.865705s

set_new_le_2_user

Passed

N/A

0.857552s

fs/ffs/t_quotalimit

26.308796s

herit_defq_le_1_group

Passed

N/A

1.057161s

herit_defq_le_1_group_log

Passed

N/A

1.041147s

herit_defq_le_1_user

Passed

N/A

1.031651s

herit_defq_le_1_user_log

Passed

N/A

1.037397s

herit_idefq_le_1_group_log

Passed

N/A

1.031868s

herit_idefq_le_1_user_log

Passed

N/A

1.037184s

inolimit_le_1_group

Passed

N/A

1.009622s

inolimit_le_1_group_log

Passed

N/A

0.995078s

inolimit_le_1_user

Passed

N/A

0.977604s

inolimit_le_1_user_log

Passed

N/A

1.000375s

limit_le_1_group

Passed

N/A

0.969918s

limit_le_1_group_log

Passed

N/A

0.994623s

limit_le_1_user

Passed

N/A

0.980576s

limit_le_1_user_log

Passed

N/A

0.995970s

sinolimit_le_1_group

Passed

N/A

2.969331s

sinolimit_le_1_user

Passed

N/A

3.018541s

slimit_le_1_group

Passed

N/A

2.990792s

slimit_le_1_user

Passed

N/A

3.140378s

fs/ffs/t_clearquota

14.815954s

clear_be_1_both

Passed

N/A

0.962139s

clear_be_1_both_log

Passed

N/A

1.004909s

clear_be_1_group

Passed

N/A

0.858934s

clear_be_1_user

Passed

N/A

0.861183s

clear_be_2_both

Passed

N/A

0.954647s

clear_be_2_both_log

Passed

N/A

1.017590s

clear_be_2_group

Passed

N/A

0.863528s

clear_be_2_user

Passed

N/A

0.888059s

clear_le_1_both

Passed

N/A

1.001249s

clear_le_1_both_log

Passed

N/A

1.012746s

clear_le_1_group

Passed

N/A

0.857246s

clear_le_1_user

Passed

N/A

0.847451s

clear_le_2_both

Passed

N/A

0.962960s

clear_le_2_both_log

Passed

N/A

1.001421s

clear_le_2_group

Passed

N/A

0.867175s

clear_le_2_user

Passed

N/A

0.828176s

fs/ffs/t_miscquota

21.931106s

default_deny_user

Passed

N/A

0.845400s

default_deny_user_big

Passed

N/A

8.156221s

log_unlink

Passed

N/A

0.834689s

log_unlink_remount

Passed

N/A

0.836459s

npsnapshot_unconf_user

Passed

N/A

1.423218s

npsnapshot_user

Passed

N/A

1.462554s

psnapshot_unconf_user

Passed

N/A

1.461349s

psnapshot_user

Passed

N/A

1.473112s

walk_list_user

Passed

N/A

5.422594s

fs/fifofs/t_fifo

0.598493s

parent_child

Passed

N/A

0.597734s

fs/hfs/t_pathconvert

0.127264s

colonslash

Passed

N/A

0.124005s

fs/kernfs/t_basic

0.129660s

getdents

Passed

N/A

0.066030s

hostname

Passed

N/A

0.062272s

fs/lfs/t_pr

0.250607s

mknod

Passed

N/A

0.238591s

fs/msdosfs/t_snapshot

5.422756s

snapshot

Passed

N/A

0.969688s

snapshotstress

Passed

N/A

4.451587s

fs/nfs/t_mountd

1.222981s

mountdhup

Expected failure

PR kern/5844: op failed with EACCES

1.217828s

fs/nfs/t_rquotad

14.396088s

get_nfs_be_1_both

Passed

N/A

2.599044s

get_nfs_be_1_group

Passed

N/A

2.343849s

get_nfs_be_1_user

Passed

N/A

2.217879s

get_nfs_le_1_both

Passed

N/A

2.622952s

get_nfs_le_1_group

Passed

N/A

2.344645s

get_nfs_le_1_user

Passed

N/A

2.250493s

fs/nullfs/t_basic

0.144883s

basic

Passed

N/A

0.072973s

twistymount

Passed

N/A

0.070247s

fs/psshfs/t_psshfs

7.917984s

inode_nos

Passed

N/A

2.093398s

ls

Passed

N/A

1.754319s

pwd

Passed

N/A

1.989652s

read_empty_file

Passed

N/A

2.063805s

fs/ptyfs/t_ptyfs

0.066318s

basic

Passed

N/A

0.065564s

fs/ptyfs/t_nullpts

0.072228s

nullrevoke

Passed

N/A

0.071260s

fs/puffs/t_basic

1.546127s

inactive_basic

Passed

N/A

0.174994s

inactive_reclaim

Passed

N/A

0.159164s

mount

Passed

N/A

0.149508s

reclaim_hardlink

Passed

N/A

0.159332s

root_chrdev

Passed

N/A

0.158450s

root_fifo

Passed

N/A

0.159085s

root_lnk

Passed

N/A

0.110068s

root_reg

Passed

N/A

0.158464s

signals

Passed

N/A

0.149198s

unlink_accessible

Passed

N/A

0.159482s

fs/puffs/t_fuzz

2.015807s

mountfuzz0

Passed

N/A

0.179465s

mountfuzz1

Passed

N/A

0.176931s

mountfuzz2

Passed

N/A

0.174519s

mountfuzz3

Passed

N/A

0.176840s

mountfuzz4

Passed

N/A

0.172383s

mountfuzz5

Passed

N/A

0.167583s

mountfuzz6

Passed

N/A

0.161421s

mountfuzz7

Passed

N/A

0.174192s

mountfuzz8

Passed

N/A

0.626728s

fs/puffs/t_io

0.196523s

nocache

Passed

N/A

0.195473s

fs/tmpfs/t_renamerace

4.065144s

renamerace2

Passed

N/A

4.064184s

fs/tmpfs/t_create

1.571119s

attrs

Passed

N/A

0.847943s

create

Passed

N/A

0.347965s

kqueue

Passed

N/A

0.372201s

fs/tmpfs/t_devices

0.506504s

basic

Passed

N/A

0.505344s

fs/tmpfs/t_dots

0.733667s

nesteddir

Passed

N/A

0.369006s

topdir

Passed

N/A

0.363057s

fs/tmpfs/t_exec

0.355327s

basic

Passed

N/A

0.354094s

fs/tmpfs/t_link

1.508689s

basic

Passed

N/A

0.479954s

kqueue

Passed

N/A

0.544109s

subdirs

Passed

N/A

0.482043s

fs/tmpfs/t_mkdir

10.575078s

attrs

Passed

N/A

0.724233s

kqueue

Passed

N/A

0.441594s

many

Passed

N/A

8.704682s

nested

Passed

N/A

0.357245s

single

Passed

N/A

0.343122s

fs/tmpfs/t_mknod

2.072186s

block

Passed

N/A

0.304998s

block_kqueue

Passed

N/A

0.368216s

char

Passed

N/A

0.304620s

char_kqueue

Passed

N/A

0.375289s

pipe

Passed

N/A

0.348113s

pipe_kqueue

Passed

N/A

0.365875s

fs/tmpfs/t_mount

1.712003s

attrs

Passed

N/A

0.274575s

large

Passed

N/A

0.365256s

mntpt

Passed

N/A

0.257902s

negative

Passed

N/A

0.266682s

options

Passed

N/A

0.283748s

plain

Passed

N/A

0.257502s

fs/tmpfs/t_pipes

0.305347s

basic

Passed

N/A

0.304157s

fs/tmpfs/t_read_write

0.798024s

basic

Passed

N/A

0.340307s

kqueue

Passed

N/A

0.455632s

fs/tmpfs/t_readdir

4.440109s

caching

Passed

N/A

0.393310s

dots

Passed

N/A

0.359683s

many

Passed

N/A

3.185960s

types

Passed

N/A

0.497794s

fs/tmpfs/t_remove

1.658616s

dot

Passed

N/A

0.359812s

kqueue

Passed

N/A

0.444665s

single

Passed

N/A

0.414082s

uchg

Passed

N/A

0.436632s

fs/tmpfs/t_rename

5.028542s

basic

Passed

N/A

0.403813s

crossdev

Passed

N/A

0.398468s

dir_to_emptydir

Passed

N/A

0.488567s

dir_to_file

Passed

N/A

0.443858s

dir_to_fulldir

Passed

N/A

0.552942s

dotdot

Passed

N/A

0.920446s

dots

Passed

N/A

0.385581s

file_to_dir

Passed

N/A

0.464623s

kqueue

Passed

N/A

0.961881s

fs/tmpfs/t_rmdir

3.364971s

curdir

Passed

N/A

0.353927s

dots

Passed

N/A

0.367490s

kqueue

Passed

N/A

0.431832s

links

Passed

N/A

0.453272s

mntpt

Passed

N/A

0.298633s

nested

Passed

N/A

0.371589s

non_empty

Passed

N/A

0.455719s

non_existent

Passed

N/A

0.292134s

single

Passed

N/A

0.332328s

fs/tmpfs/t_setattr

3.555082s

chgrp

Passed

N/A

0.336257s

chgrp_kqueue

Passed

N/A

0.356958s

chmod

Passed

N/A

0.329630s

chmod_kqueue

Passed

N/A

0.371616s

chown

Passed

N/A

0.339863s

chown_kqueue

Passed

N/A

0.390323s

chowngrp

Passed

N/A

0.342336s

chowngrp_kqueue

Passed

N/A

0.362748s

chtimes

Passed

N/A

0.339288s

chtimes_kqueue

Passed

N/A

0.377174s

fs/tmpfs/t_sizes

1.919299s

big

Passed

N/A

0.445500s

overflow

Passed

N/A

0.505293s

overwrite

Passed

N/A

0.661662s

small

Passed

N/A

0.303273s

fs/tmpfs/t_sockets

0.419728s

basic

Passed

N/A

0.418884s

fs/tmpfs/t_statvfs

0.271717s

values

Passed

N/A

0.270762s

fs/tmpfs/t_symlink

1.676767s

dir

Passed

N/A

0.467561s

exec

Passed

N/A

0.388783s

file

Passed

N/A

0.384438s

kqueue

Passed

N/A

0.432194s

fs/tmpfs/t_times

6.470337s

empty

Passed

N/A

2.386410s

link

Passed

N/A

1.331712s

non_empty

Passed

N/A

1.344021s

rename

Passed

N/A

1.404602s

fs/tmpfs/t_trail_slash

0.395391s

main

Passed

N/A

0.394303s

fs/tmpfs/t_truncate

0.313654s

basic

Passed

N/A

0.312699s

fs/tmpfs/t_vnd

3.516804s

basic

Passed

N/A

3.515504s

fs/tmpfs/t_vnode_leak

21.363200s

main

Passed

N/A

21.362277s

fs/umapfs/t_basic

0.067604s

basic

Passed

N/A

0.066983s

fs/union/t_pr

0.226662s

devnull1

Passed

N/A

0.073551s

devnull2

Passed

N/A

0.074443s

multilayer

Passed

N/A

0.076949s

fs/vfs/t_full

10.054008s

ext2fs_fillfs

Passed

N/A

0.715162s

ffs_fillfs

Passed

N/A

0.428948s

ffslog_fillfs

Passed

N/A

0.410799s

lfs_fillfs

Passed

N/A

0.734000s

msdosfs_fillfs

Passed

N/A

0.444009s

nfs_fillfs

Passed

N/A

1.426030s

p2k_ffs_fillfs

Skipped

fs does not support explicit block allocation (GOP_ALLOC)

0.404052s

puffs_fillfs

Skipped

fs does not support explicit block allocation (GOP_ALLOC)

0.323522s

rumpfs_fillfs

Skipped

fs does not support explicit block allocation (GOP_ALLOC)

0.287247s

sysvbfs_fillfs

Passed

N/A

0.826515s

tmpfs_fillfs

Passed

N/A

0.351460s

udf_fillfs

Passed

N/A

0.847224s

v7fs_fillfs

Passed

N/A

2.741260s

fs/vfs/t_io

51.228502s

ext2fs_extendfile

Passed

N/A

0.321130s

ext2fs_extendfile_append

Passed

N/A

0.297386s

ext2fs_holywrite

Passed

N/A

0.319218s

ext2fs_overwrite512

Passed

N/A

0.319482s

ext2fs_overwrite64k

Passed

N/A

0.314646s

ext2fs_overwrite_trunc

Passed

N/A

0.331821s

ext2fs_read_after_unlink

Passed

N/A

0.319254s

ext2fs_read_fault

Passed

N/A

0.333587s

ext2fs_shrinkfile

Passed

N/A

0.332551s

ext2fs_wrrd_after_unlink

Passed

N/A

0.333368s

ffs_extendfile

Passed

N/A

0.346258s

ffs_extendfile_append

Passed

N/A

0.323502s

ffs_holywrite

Passed

N/A

0.345528s

ffs_overwrite512

Passed

N/A

0.343069s

ffs_overwrite64k

Passed

N/A

0.340527s

ffs_overwrite_trunc

Passed

N/A

0.328198s

ffs_read_after_unlink

Passed

N/A

0.345850s

ffs_read_fault

Passed

N/A

0.341230s

ffs_shrinkfile

Passed

N/A

0.319542s

ffs_wrrd_after_unlink

Passed

N/A

0.322258s

ffslog_extendfile

Passed

N/A

0.338696s

ffslog_extendfile_append

Passed

N/A

0.322146s

ffslog_holywrite

Passed

N/A

0.325901s

ffslog_overwrite512

Passed

N/A

0.330320s

ffslog_overwrite64k

Passed

N/A

0.331640s

ffslog_overwrite_trunc

Passed

N/A

0.356394s

ffslog_read_after_unlink

Passed

N/A

0.346491s

ffslog_read_fault

Passed

N/A

0.324400s

ffslog_shrinkfile

Passed

N/A

0.323793s

ffslog_wrrd_after_unlink

Passed

N/A

0.332049s

lfs_extendfile

Passed

N/A

0.402813s

lfs_extendfile_append

Passed

N/A

0.430081s

lfs_holywrite

Passed

N/A

0.402987s

lfs_overwrite512

Passed

N/A

0.395730s

lfs_overwrite64k

Passed

N/A

0.401715s

lfs_overwrite_trunc

Passed

N/A

0.420304s

lfs_read_after_unlink

Passed

N/A

0.408614s

lfs_read_fault

Passed

N/A

0.400575s

lfs_shrinkfile

Passed

N/A

0.427345s

lfs_wrrd_after_unlink

Passed

N/A

0.424712s

msdosfs_extendfile

Passed

N/A

0.322372s

msdosfs_extendfile_append

Passed

N/A

0.336910s

msdosfs_holywrite

Passed

N/A

0.323560s

msdosfs_overwrite512

Passed

N/A

0.329564s

msdosfs_overwrite64k

Passed

N/A

0.310001s

msdosfs_overwrite_trunc

Passed

N/A

0.317367s

msdosfs_read_after_unlink

Passed

N/A

0.304689s

msdosfs_read_fault

Passed

N/A

0.306405s

msdosfs_shrinkfile

Passed

N/A

0.300934s

msdosfs_wrrd_after_unlink

Passed

N/A

0.317859s

nfs_extendfile

Passed

N/A

0.660265s

nfs_extendfile_append

Passed

N/A

0.628915s

nfs_holywrite

Passed

N/A

0.642600s

nfs_overwrite512

Passed

N/A

0.624858s

nfs_overwrite64k

Passed

N/A

0.648053s

nfs_overwrite_trunc

Passed

N/A

0.665898s

nfs_read_after_unlink

Passed

N/A

0.672697s

nfs_read_fault

Passed

N/A

0.633513s

nfs_shrinkfile

Passed

N/A

0.633636s

nfs_wrrd_after_unlink

Passed

N/A

0.662881s

p2k_ffs_extendfile

Passed

N/A

0.465238s

p2k_ffs_extendfile_append

Passed

N/A

0.498666s

p2k_ffs_holywrite

Passed

N/A

0.458030s

p2k_ffs_overwrite512

Passed

N/A

0.467945s

p2k_ffs_overwrite64k

Passed

N/A

0.457548s

p2k_ffs_overwrite_trunc

Passed

N/A

0.488508s

p2k_ffs_read_after_unlink

Passed

N/A

0.537479s

p2k_ffs_read_fault

Passed

N/A

0.447729s

p2k_ffs_shrinkfile

Passed

N/A

0.448367s

p2k_ffs_wrrd_after_unlink

Passed

N/A

0.458640s

puffs_extendfile

Passed

N/A

0.347321s

puffs_extendfile_append

Passed

N/A

0.349577s

puffs_holywrite

Passed

N/A

0.369234s

puffs_overwrite512

Passed

N/A

0.369429s

puffs_overwrite64k

Passed

N/A

0.348960s

puffs_overwrite_trunc

Passed

N/A

0.349857s

puffs_read_after_unlink

Passed

N/A

0.378801s

puffs_read_fault

Passed

N/A

0.369007s

puffs_shrinkfile

Passed

N/A

0.369586s

puffs_wrrd_after_unlink

Passed

N/A

0.359083s

rumpfs_extendfile

Passed

N/A

0.278428s

rumpfs_extendfile_append

Passed

N/A

0.283525s

rumpfs_holywrite

Passed

N/A

0.281107s

rumpfs_overwrite512

Passed

N/A

0.295195s

rumpfs_overwrite64k

Passed

N/A

0.282721s

rumpfs_overwrite_trunc

Passed

N/A

0.279462s

rumpfs_read_after_unlink

Passed

N/A

0.307376s

rumpfs_read_fault

Passed

N/A

0.302491s

rumpfs_shrinkfile

Passed

N/A

0.301544s

rumpfs_wrrd_after_unlink

Passed

N/A

0.309631s

sysvbfs_extendfile

Passed

N/A

0.302661s

sysvbfs_extendfile_append

Passed

N/A

0.328163s

sysvbfs_holywrite

Passed

N/A

0.326280s

sysvbfs_overwrite512

Passed

N/A

0.316402s

sysvbfs_overwrite64k

Passed

N/A

0.311343s

sysvbfs_overwrite_trunc

Passed

N/A

0.341496s

sysvbfs_read_after_unlink

Passed

N/A

0.319823s

sysvbfs_read_fault

Passed

N/A

0.324973s

sysvbfs_shrinkfile

Passed

N/A

0.330048s

sysvbfs_wrrd_after_unlink

Passed

N/A

0.321892s

tmpfs_extendfile

Passed

N/A

0.285660s

tmpfs_extendfile_append

Passed

N/A

0.303786s

tmpfs_holywrite

Passed

N/A

0.299421s

tmpfs_overwrite512

Passed

N/A

0.281991s

tmpfs_overwrite64k

Passed

N/A

0.305729s

tmpfs_overwrite_trunc

Passed

N/A

0.287134s

tmpfs_read_after_unlink

Passed

N/A

0.286094s

tmpfs_read_fault

Passed

N/A

0.287303s

tmpfs_shrinkfile

Passed

N/A

0.284489s

tmpfs_wrrd_after_unlink

Passed

N/A

0.310517s

udf_extendfile

Passed

N/A

0.600181s

udf_extendfile_append

Passed

N/A

0.587599s

udf_holywrite

Passed

N/A

0.589075s

udf_overwrite512

Passed

N/A

0.578394s

udf_overwrite64k

Passed

N/A

0.597826s

udf_overwrite_trunc

Passed

N/A

0.568268s

udf_read_after_unlink

Passed

N/A

0.856937s

udf_read_fault

Passed

N/A

0.568902s

udf_shrinkfile

Passed

N/A

0.598920s

udf_wrrd_after_unlink

Passed

N/A

0.587580s

v7fs_extendfile

Passed

N/A

0.315118s

v7fs_extendfile_append

Passed

N/A

0.320084s

v7fs_holywrite

Passed

N/A

0.324253s

v7fs_overwrite512

Passed

N/A

0.324661s

v7fs_overwrite64k

Passed

N/A

0.376897s

v7fs_overwrite_trunc

Passed

N/A

0.388620s

v7fs_read_after_unlink

Passed

N/A

0.352912s

v7fs_read_fault

Passed

N/A

0.342103s

v7fs_shrinkfile

Passed

N/A

0.314465s

v7fs_wrrd_after_unlink

Passed

N/A

0.618948s

fs/vfs/t_renamerace

116.288222s

ext2fs_renamerace

Passed

N/A

5.349934s

ext2fs_renamerace_dirs

Passed

N/A

5.327335s

ffs_renamerace

Passed

N/A

5.327347s

ffs_renamerace_dirs

Passed

N/A

5.358947s

ffslog_renamerace

Passed

N/A

5.346435s

ffslog_renamerace_dirs

Passed

N/A

5.339786s

lfs_renamerace

Passed

N/A

5.772450s

lfs_renamerace_dirs

Passed

N/A

5.779258s

msdosfs_renamerace

Expected failure

PR kern/43626: unmount failed: Device busy

5.336910s

msdosfs_renamerace_dirs

Expected signal

PR kern/43626

0.678204s

nfs_renamerace

Passed

N/A

5.655639s

nfs_renamerace_dirs

Passed

N/A

5.645845s

p2k_ffs_renamerace

Passed

N/A

5.478156s

p2k_ffs_renamerace_dirs

Passed

N/A

5.446766s

puffs_renamerace

Passed

N/A

5.347537s

puffs_renamerace_dirs

Passed

N/A

5.540068s

rumpfs_renamerace

Skipped

rename not supported by file system

0.291122s

rumpfs_renamerace_dirs

Skipped

rename not supported by file system

0.271261s

sysvbfs_renamerace

Skipped

filesystem has not enough inodes

0.309167s

sysvbfs_renamerace_dirs

Skipped

directories not supported by file system

0.309856s

tmpfs_renamerace

Passed

N/A

5.306076s

tmpfs_renamerace_dirs

Passed

N/A

5.277093s

udf_renamerace

Expected failure

PR kern/49046: race did not trigger this time

5.322471s

udf_renamerace_dirs

Passed

N/A

5.565478s

v7fs_renamerace

Passed

N/A

5.392397s

v7fs_renamerace_dirs

Passed

N/A

5.367911s

fs/vfs/t_ro

29.387781s

ext2fs_attrs

Passed

N/A

0.308800s

ext2fs_create

Passed

N/A

0.323670s

ext2fs_createdir

Passed

N/A

0.322768s

ext2fs_createfifo

Passed

N/A

0.334187s

ext2fs_createlink

Passed

N/A

0.305055s

ext2fs_createsymlink

Passed

N/A

0.312371s

ext2fs_fileio

Passed

N/A

0.306281s

ext2fs_rmfile

Passed

N/A

0.318515s

ffs_attrs

Passed

N/A

0.342674s

ffs_create

Passed

N/A

0.310056s

ffs_createdir

Passed

N/A

0.312584s

ffs_createfifo

Passed

N/A

0.316606s

ffs_createlink

Passed

N/A

0.330402s

ffs_createsymlink

Passed

N/A

0.335393s

ffs_fileio

Passed

N/A

0.337231s

ffs_rmfile

Passed

N/A

0.309847s

ffslog_attrs

Passed

N/A

0.330536s

ffslog_create

Passed

N/A

0.340019s

ffslog_createdir

Passed

N/A

0.341141s

ffslog_createfifo

Passed

N/A

0.312794s

ffslog_createlink

Passed

N/A

0.345400s

ffslog_createsymlink

Passed

N/A

0.341424s

ffslog_fileio

Passed

N/A

0.341303s

ffslog_rmfile

Passed

N/A

0.352040s

msdosfs_attrs

Passed

N/A

0.321966s

msdosfs_create

Passed

N/A

0.310588s

msdosfs_createdir

Passed

N/A

0.319728s

msdosfs_createfifo

Passed

N/A

0.297049s

msdosfs_createlink

Passed

N/A

0.298898s

msdosfs_createsymlink

Passed

N/A

0.298310s

msdosfs_fileio

Passed

N/A

0.297796s

msdosfs_rmfile

Passed

N/A

0.298662s

nfs_attrs

Passed

N/A

0.667124s

nfs_create

Passed

N/A

0.648296s

nfs_createdir

Passed

N/A

0.636997s

nfs_createfifo

Passed

N/A

0.653668s

nfs_createlink

Passed

N/A

0.662019s

nfs_createsymlink

Passed

N/A

0.619116s

nfs_fileio

Passed

N/A

0.662806s

nfs_rmfile

Passed

N/A

0.630455s

nfsro_attrs

Passed

N/A

0.673532s

nfsro_create

Passed

N/A

0.629611s

nfsro_createdir

Passed

N/A

0.623897s

nfsro_createfifo

Passed

N/A

0.641380s

nfsro_createlink

Passed

N/A

0.644089s

nfsro_createsymlink

Passed

N/A

0.661621s

nfsro_fileio

Passed

N/A

0.651291s

nfsro_rmfile

Passed

N/A

0.659059s

sysvbfs_attrs

Passed

N/A

0.310340s

sysvbfs_create

Passed

N/A

0.311611s

sysvbfs_createdir

Passed

N/A

0.297808s

sysvbfs_createfifo

Passed

N/A

0.301348s

sysvbfs_createlink

Passed

N/A

0.311902s

sysvbfs_createsymlink

Passed

N/A

0.319125s

sysvbfs_fileio

Passed

N/A

0.304217s

sysvbfs_rmfile

Passed

N/A

0.299210s

udf_attrs

Passed

N/A

0.579236s

udf_create

Passed

N/A

0.313176s

udf_createdir

Passed

N/A

0.315155s

udf_createfifo

Passed

N/A

0.320149s

udf_createlink

Passed

N/A

0.574458s

udf_createsymlink

Passed

N/A

0.305210s

udf_fileio

Passed

N/A

0.562426s

udf_rmfile

Passed

N/A

0.577499s

v7fs_attrs

Passed

N/A

0.334725s

v7fs_create

Passed

N/A

0.313470s

v7fs_createdir

Passed

N/A

0.315739s

v7fs_createfifo

Passed

N/A

0.331221s

v7fs_createlink

Passed

N/A

0.338240s

v7fs_createsymlink

Passed

N/A

0.306230s

v7fs_fileio

Passed

N/A

0.319225s

v7fs_rmfile

Passed

N/A

0.316816s

fs/vfs/t_rmdirrace

125.127525s

ext2fs_race

Passed

N/A

10.331652s

ffs_race

Passed

N/A

10.336381s

ffslog_race

Passed

N/A

10.341308s

lfs_race

Passed

N/A

10.489264s

msdosfs_race

Passed

N/A

10.305734s

nfs_race

Passed

N/A

10.671348s

p2k_ffs_race

Passed

N/A

10.460577s

puffs_race

Passed

N/A

10.368015s

rumpfs_race

Passed

N/A

10.289379s

sysvbfs_race

Skipped

directories not supported by file system

0.296921s

tmpfs_race

Passed

N/A

10.292184s

udf_race

Passed

N/A

10.579302s

v7fs_race

Passed

N/A

10.329907s

fs/vfs/t_union

9.645584s

ext2fs_basic

Skipped

fs does not support VOP_WHITEOUT

0.300680s

ext2fs_whiteout

Skipped

fs does not support VOP_WHITEOUT

0.347889s

ffs_basic

Passed

N/A

0.334151s

ffs_whiteout

Passed

N/A

0.359900s

ffslog_basic

Passed

N/A

0.344727s

ffslog_whiteout

Passed

N/A

0.362222s

lfs_basic

Passed

N/A

0.432515s

lfs_whiteout

Passed

N/A

0.444264s

msdosfs_basic

Skipped

fs does not support VOP_WHITEOUT

0.308889s

msdosfs_whiteout

Skipped

fs does not support VOP_WHITEOUT

0.326883s

nfs_basic

Skipped

fs does not support VOP_WHITEOUT

0.639736s

nfs_whiteout

Skipped

fs does not support VOP_WHITEOUT

0.656147s

p2k_ffs_basic

Skipped

fs does not support VOP_WHITEOUT

0.394618s

p2k_ffs_whiteout

Skipped

fs does not support VOP_WHITEOUT

0.425962s

puffs_basic

Skipped

fs does not support VOP_WHITEOUT

0.306251s

puffs_whiteout

Skipped

fs does not support VOP_WHITEOUT

0.337872s

rumpfs_basic

Passed

N/A

0.274645s

rumpfs_whiteout

Passed

N/A

0.325450s

sysvbfs_basic

Skipped

fs does not support VOP_WHITEOUT

0.311159s

sysvbfs_whiteout

Skipped

fs does not support VOP_WHITEOUT

0.338629s

tmpfs_basic

Passed

N/A

0.278910s

tmpfs_whiteout

Passed

N/A

0.336513s

udf_basic

Skipped

fs does not support VOP_WHITEOUT

0.312865s

udf_whiteout

Skipped

fs does not support VOP_WHITEOUT

0.359594s

v7fs_basic

Skipped

fs does not support VOP_WHITEOUT

0.328599s

v7fs_whiteout

Skipped

fs does not support VOP_WHITEOUT

0.370959s

fs/vfs/t_unpriv

19.288038s

ext2fs_dirperms

Passed

N/A

0.323594s

ext2fs_flags

Passed

N/A

0.302127s

ext2fs_owner

Passed

N/A

0.311639s

ext2fs_times

Passed

N/A

0.331217s

ffs_dirperms

Passed

N/A

0.316968s

ffs_flags

Passed

N/A

0.308747s

ffs_owner

Passed

N/A

0.316943s

ffs_times

Passed

N/A

0.347956s

ffslog_dirperms

Passed

N/A

0.325855s

ffslog_flags

Passed

N/A

0.346621s

ffslog_owner

Passed

N/A

0.314940s

ffslog_times

Passed

N/A

0.334020s

lfs_dirperms

Passed

N/A

0.420852s

lfs_flags

Passed

N/A

0.413478s

lfs_owner

Passed

N/A

0.408676s

lfs_times

Passed

N/A

0.399202s

msdosfs_dirperms

Passed

N/A

0.308584s

msdosfs_flags

Passed

N/A

0.320005s

msdosfs_owner

Skipped

owner not supported by file system

0.313746s

msdosfs_times

Passed

N/A

0.321517s

nfs_dirperms

Passed

N/A

0.649008s

nfs_flags

Skipped

file flags not supported by file system

0.624023s

nfs_owner

Passed

N/A

0.634671s

nfs_times

Passed

N/A

0.654992s

p2k_ffs_dirperms

Passed

N/A

0.478559s

p2k_ffs_flags

Passed

N/A

0.467992s

p2k_ffs_owner

Passed

N/A

0.438708s

p2k_ffs_times

Passed

N/A

0.457867s

puffs_dirperms

Passed

N/A

0.366400s

puffs_flags

Skipped

file flags not supported by file system

0.309777s

puffs_owner

Passed

N/A

0.350429s

puffs_times

Passed

N/A

0.389120s

rumpfs_dirperms

Passed

N/A

0.286135s

rumpfs_flags

Passed

N/A

0.294965s

rumpfs_owner

Passed

N/A

0.293396s

rumpfs_times

Passed

N/A

0.282364s

sysvbfs_dirperms

Skipped

directories not supported by file system

0.294163s

sysvbfs_flags

Skipped

file flags not supported by file system

0.298613s

sysvbfs_owner

Passed

N/A

0.295147s

sysvbfs_times

Passed

N/A

0.297690s

tmpfs_dirperms

Passed

N/A

0.279842s

tmpfs_flags

Passed

N/A

0.283236s

tmpfs_owner

Passed

N/A

0.274655s

tmpfs_times

Passed

N/A

0.297213s

udf_dirperms

Passed

N/A

0.562683s

udf_flags

Skipped

file flags not supported by file system

0.331879s

udf_owner

Passed

N/A

0.312316s

udf_times

Passed

N/A

0.590981s

v7fs_dirperms

Passed

N/A

0.317483s

v7fs_flags

Passed

N/A

0.311052s

v7fs_owner

Passed

N/A

0.328613s

v7fs_times

Passed

N/A

0.315583s

fs/vfs/t_vfsops

27.889428s

ext2fs_tfhinval

Passed

N/A

0.300350s

ext2fs_tfhremove

Passed

N/A

0.309161s

ext2fs_tfilehandle

Passed

N/A

0.311086s

ext2fs_tmount

Passed

N/A

0.311040s

ext2fs_tstatvfs

Passed

N/A

0.301916s

ext2fs_tsync

Passed

N/A

0.306030s

ffs_tfhinval

Passed

N/A

0.307126s

ffs_tfhremove

Passed

N/A

0.313126s

ffs_tfilehandle

Passed

N/A

0.335443s

ffs_tmount

Passed

N/A

0.337814s

ffs_tstatvfs

Passed

N/A

0.310881s

ffs_tsync

Passed

N/A

0.328556s

ffslog_tfhinval

Passed

N/A

0.322454s

ffslog_tfhremove

Passed

N/A

0.325143s

ffslog_tfilehandle

Passed

N/A

0.321048s

ffslog_tmount

Passed

N/A

0.323432s

ffslog_tstatvfs

Passed

N/A

0.321114s

ffslog_tsync

Passed

N/A

0.330152s

lfs_tfhinval

Passed

N/A

0.393681s

lfs_tfhremove

Expected failure

fhopen() for removed file succeeds (PR kern/43745): /usr/src/tests/fs/vfs/t_vfsops.c:152: Expected true value in rump_sys_fhopen(fhp, fhsize, O_RDONLY) == -1

0.408732s

lfs_tfilehandle

Passed

N/A

0.419008s

lfs_tmount

Passed

N/A

0.409232s

lfs_tstatvfs

Passed

N/A

0.388064s

lfs_tsync

Passed

N/A

0.393761s

msdosfs_tfhinval

Passed

N/A

0.308947s

msdosfs_tfhremove

Passed

N/A

0.310713s

msdosfs_tfilehandle

Passed

N/A

0.297404s

msdosfs_tmount

Passed

N/A

0.320704s

msdosfs_tstatvfs

Passed

N/A

0.325015s

msdosfs_tsync

Passed

N/A

0.320861s

nfs_tfhinval

Passed

N/A

0.614752s

nfs_tfhremove

Passed

N/A

0.616220s

nfs_tfilehandle

Passed

N/A

0.627577s

nfs_tmount

Passed

N/A

0.612456s

nfs_tstatvfs

Passed

N/A

0.627465s

nfs_tsync

Passed

N/A

0.620020s

p2k_ffs_tfhinval

Passed

N/A

0.477258s

p2k_ffs_tfhremove

Passed

N/A

0.438011s

p2k_ffs_tfilehandle

Passed

N/A

0.448177s

p2k_ffs_tmount

Passed

N/A

0.447984s

p2k_ffs_tstatvfs

Passed

N/A

0.478255s

p2k_ffs_tsync

Passed

N/A

0.458138s

puffs_tfhinval

Passed

N/A

0.357588s

puffs_tfhremove

Passed

N/A

0.358919s

puffs_tfilehandle

Passed

N/A

0.369658s

puffs_tmount

Passed

N/A

0.349545s

puffs_tstatvfs

Passed

N/A

0.349159s

puffs_tsync

Passed

N/A

0.369477s

rumpfs_tfhinval

Skipped

file handles not supported

0.289845s

rumpfs_tfhremove

Skipped

file handles not supported

0.268478s

rumpfs_tfilehandle

Skipped

file handles not supported

0.291996s

rumpfs_tmount

Passed

N/A

0.276023s

rumpfs_tstatvfs

Passed

N/A

0.274452s

rumpfs_tsync

Passed

N/A

0.284682s

sysvbfs_tfhinval

Skipped

file handles not supported

0.294720s

sysvbfs_tfhremove

Skipped

file handles not supported

0.305579s

sysvbfs_tfilehandle

Skipped

file handles not supported

0.304106s

sysvbfs_tmount

Passed

N/A

0.298062s

sysvbfs_tstatvfs

Passed

N/A

0.310128s

sysvbfs_tsync

Passed

N/A

0.323030s

tmpfs_tfhinval

Passed

N/A

0.278722s

tmpfs_tfhremove

Passed

N/A

0.284558s

tmpfs_tfilehandle

Passed

N/A

0.284274s

tmpfs_tmount

Passed

N/A

0.286454s

tmpfs_tstatvfs

Passed

N/A

0.285774s

tmpfs_tsync

Passed

N/A

0.281891s

udf_tfhinval

Skipped

file handles not supported

0.301456s

udf_tfhremove

Skipped

file handles not supported

0.329119s

udf_tfilehandle

Skipped

file handles not supported

0.326370s

udf_tmount

Passed

N/A

0.304146s

udf_tstatvfs

Passed

N/A

0.305616s

udf_tsync

Passed

N/A

0.322859s

v7fs_tfhinval

Skipped

file handles not supported

0.328585s

v7fs_tfhremove

Skipped

file handles not supported

0.325937s

v7fs_tfilehandle

Skipped

file handles not supported

0.326941s

v7fs_tmount

Passed

N/A

0.331185s

v7fs_tstatvfs

Passed

N/A

0.323387s

v7fs_tsync

Passed

N/A

0.315468s

fs/vfs/t_vnops

161.750975s

ext2fs_access_simple

Passed

N/A

0.357451s

ext2fs_attrs

Passed

N/A

0.336372s

ext2fs_create_exist

Passed

N/A

0.340272s

ext2fs_create_many

Passed

N/A

2.707613s

ext2fs_create_nametoolong

Passed

N/A

0.327862s

ext2fs_create_nonalphanum

Passed

N/A

0.499491s

ext2fs_dir_notempty

Passed

N/A

0.333561s

ext2fs_dir_rmdirdotdot

Passed

N/A

0.357470s

ext2fs_dir_simple

Passed

N/A

0.348643s

ext2fs_fcntl_getlock_pids

Passed

N/A

0.340546s

ext2fs_fcntl_lock

Passed

N/A

0.349987s

ext2fs_lookup_complex

Passed

N/A

0.350897s

ext2fs_lookup_simple

Passed

N/A

0.359455s

ext2fs_lstat_symlink

Passed

N/A

0.324714s

ext2fs_read_directory

Passed

N/A

0.330054s

ext2fs_rename_dir

Passed

N/A

0.339898s

ext2fs_rename_dotdot

Passed

N/A

0.328651s

ext2fs_rename_nametoolong

Passed

N/A

0.336071s

ext2fs_rename_reg_nodir

Passed

N/A

0.342406s

ext2fs_symlink_long

Passed

N/A

0.365382s

ext2fs_symlink_root

Passed

N/A

0.333099s

ext2fs_symlink_zerolen

Passed

N/A

0.351096s

ffs_access_simple

Passed

N/A

0.358292s

ffs_attrs

Passed

N/A

0.357535s

ffs_create_exist

Passed

N/A

0.356956s

ffs_create_many

Passed

N/A

1.535660s

ffs_create_nametoolong

Passed

N/A

0.346079s

ffs_create_nonalphanum

Passed

N/A

0.497785s

ffs_dir_notempty

Passed

N/A

0.352491s

ffs_dir_rmdirdotdot

Passed

N/A

0.347435s

ffs_dir_simple

Passed

N/A

0.342153s

ffs_fcntl_getlock_pids

Passed

N/A

0.339767s

ffs_fcntl_lock

Passed

N/A

0.340764s

ffs_lookup_complex

Passed

N/A

0.360542s

ffs_lookup_simple

Passed

N/A

0.357023s

ffs_lstat_symlink

Passed

N/A

0.336094s

ffs_read_directory

Passed

N/A

0.344234s

ffs_rename_dir

Passed

N/A

0.361759s

ffs_rename_dotdot

Passed

N/A

0.358051s

ffs_rename_nametoolong

Passed

N/A

0.336667s

ffs_rename_reg_nodir

Passed

N/A

0.353622s

ffs_symlink_long

Passed

N/A

0.361142s

ffs_symlink_root

Passed

N/A

0.343869s

ffs_symlink_zerolen

Passed

N/A

0.362265s

ffslog_access_simple

Passed

N/A

0.357847s

ffslog_attrs

Passed

N/A

0.345949s

ffslog_create_exist

Passed

N/A

0.349958s

ffslog_create_many

Passed

N/A

1.326322s

ffslog_create_nametoolong

Passed

N/A

0.367606s

ffslog_create_nonalphanum

Passed

N/A

0.465870s

ffslog_dir_notempty

Passed

N/A

0.355623s

ffslog_dir_rmdirdotdot

Passed

N/A

0.345830s

ffslog_dir_simple

Passed

N/A

0.363132s

ffslog_fcntl_getlock_pids

Passed

N/A

0.349328s

ffslog_fcntl_lock

Passed

N/A

0.365478s

ffslog_lookup_complex

Passed

N/A

0.351502s

ffslog_lookup_simple

Passed

N/A

0.350526s

ffslog_lstat_symlink

Passed

N/A

0.351534s

ffslog_read_directory

Passed

N/A

0.345605s

ffslog_rename_dir

Passed

N/A

0.357376s

ffslog_rename_dotdot

Passed

N/A

0.347121s

ffslog_rename_nametoolong

Passed

N/A

0.347265s

ffslog_rename_reg_nodir

Passed

N/A

0.348743s

ffslog_symlink_long

Passed

N/A

0.356442s

ffslog_symlink_root

Passed

N/A

0.342489s

ffslog_symlink_zerolen

Passed

N/A

0.357983s

lfs_access_simple

Passed

N/A

0.423827s

lfs_attrs

Passed

N/A

0.439549s

lfs_create_exist

Passed

N/A

0.415491s

lfs_create_many

Passed

N/A

3.605555s

lfs_create_nametoolong

Passed

N/A

0.413830s

lfs_create_nonalphanum

Passed

N/A

1.480914s

lfs_dir_notempty

Passed

N/A

0.424101s

lfs_dir_rmdirdotdot

Passed

N/A

0.417702s

lfs_dir_simple

Passed

N/A

0.417543s

lfs_fcntl_getlock_pids

Passed

N/A

0.427616s

lfs_fcntl_lock

Passed

N/A

0.419744s

lfs_lookup_complex

Passed

N/A

0.441075s

lfs_lookup_simple

Passed

N/A

0.441431s

lfs_lstat_symlink

Passed

N/A

0.437696s

lfs_read_directory

Passed

N/A

0.422940s

lfs_rename_dir

Passed

N/A

0.428698s

lfs_rename_dotdot

Passed

N/A

0.411956s

lfs_rename_nametoolong

Passed

N/A

0.414460s

lfs_rename_reg_nodir

Passed

N/A

0.417664s

lfs_symlink_long

Passed

N/A

0.461523s

lfs_symlink_root

Passed

N/A

0.446401s

lfs_symlink_zerolen

Passed

N/A

0.442364s

msdosfs_access_simple

Passed

N/A

0.346488s

msdosfs_attrs

Passed

N/A

0.345160s

msdosfs_create_exist

Passed

N/A

0.352374s

msdosfs_create_many

Passed

N/A

7.877916s

msdosfs_create_nametoolong

Passed

N/A

0.327706s

msdosfs_create_nonalphanum

Passed

N/A

0.446629s

msdosfs_dir_notempty

Passed

N/A

0.350878s

msdosfs_dir_rmdirdotdot

Passed

N/A

0.346817s

msdosfs_dir_simple

Passed

N/A

0.330566s

msdosfs_fcntl_getlock_pids

Passed

N/A

0.350110s

msdosfs_fcntl_lock

Passed

N/A

0.327143s

msdosfs_lookup_complex

Passed

N/A

0.340799s

msdosfs_lookup_simple

Passed

N/A

0.319830s

msdosfs_lstat_symlink

Skipped

symlinks not supported by file system

0.311453s

msdosfs_read_directory

Passed

N/A

0.346821s

msdosfs_rename_dir

Passed

N/A

0.328888s

msdosfs_rename_dotdot

Passed

N/A

0.329498s

msdosfs_rename_nametoolong

Passed

N/A

0.350579s

msdosfs_rename_reg_nodir

Passed

N/A

0.348651s

msdosfs_symlink_long

Skipped

symlinks not supported by file system

0.322188s

msdosfs_symlink_root

Skipped

symlinks not supported by file system

0.323592s

msdosfs_symlink_zerolen

Skipped

symlinks not supported by file system

0.324458s

nfs_access_simple

Passed

N/A

0.669134s

nfs_attrs

Passed

N/A

0.650257s

nfs_create_exist

Passed

N/A

0.682287s

nfs_create_many

Passed

N/A

7.401977s

nfs_create_nametoolong

Passed

N/A

0.644713s

nfs_create_nonalphanum

Passed

N/A

1.379451s

nfs_dir_notempty

Passed

N/A

0.651385s

nfs_dir_rmdirdotdot

Passed

N/A

0.668323s

nfs_dir_simple

Passed

N/A

0.650409s

nfs_fcntl_getlock_pids

Passed

N/A

0.657132s

nfs_fcntl_lock

Passed

N/A

0.669522s

nfs_lookup_complex

Passed

N/A

0.642065s

nfs_lookup_simple

Passed

N/A

0.643770s

nfs_lstat_symlink

Passed

N/A

0.636667s

nfs_read_directory

Passed

N/A

0.638108s

nfs_rename_dir

Passed

N/A

0.682721s

nfs_rename_dotdot

Passed

N/A

0.667077s

nfs_rename_nametoolong

Passed

N/A

0.642537s

nfs_rename_reg_nodir

Passed

N/A

0.663576s

nfs_symlink_long

Passed

N/A

0.741512s

nfs_symlink_root

Passed

N/A

0.639612s

nfs_symlink_zerolen

Passed

N/A

0.680957s

p2k_ffs_access_simple

Passed

N/A

0.490223s

p2k_ffs_attrs

Passed

N/A

0.498745s

p2k_ffs_create_exist

Passed

N/A

0.487763s

p2k_ffs_create_many

Passed

N/A

5.799188s

p2k_ffs_create_nametoolong

Passed

N/A

0.493409s

p2k_ffs_create_nonalphanum

Passed

N/A

1.028479s

p2k_ffs_dir_notempty

Passed

N/A

0.493912s

p2k_ffs_dir_rmdirdotdot

Passed

N/A

0.498150s

p2k_ffs_dir_simple

Passed

N/A

0.488319s

p2k_ffs_fcntl_getlock_pids

Passed

N/A

0.468069s

p2k_ffs_fcntl_lock

Passed

N/A

0.517962s

p2k_ffs_lookup_complex

Passed

N/A

0.517954s

p2k_ffs_lookup_simple

Passed

N/A

0.477736s

p2k_ffs_lstat_symlink

Passed

N/A

0.478203s

p2k_ffs_read_directory

Passed

N/A

0.498704s

p2k_ffs_rename_dir

Passed

N/A

0.527949s

p2k_ffs_rename_dotdot

Passed

N/A

0.497621s

p2k_ffs_rename_nametoolong

Passed

N/A

0.478201s

p2k_ffs_rename_reg_nodir

Passed

N/A

0.498156s

p2k_ffs_symlink_long

Passed

N/A

0.578184s

p2k_ffs_symlink_root

Passed

N/A

0.477886s

p2k_ffs_symlink_zerolen

Passed

N/A

0.488202s

puffs_access_simple

Passed

N/A

0.387877s

puffs_attrs

Passed

N/A

0.379178s

puffs_create_exist

Passed

N/A

0.379639s

puffs_create_many

Passed

N/A

4.210299s

puffs_create_nametoolong

Passed

N/A

0.358393s

puffs_create_nonalphanum

Passed

N/A

0.679243s

puffs_dir_notempty

Passed

N/A

0.388819s

puffs_dir_rmdirdotdot

Passed

N/A

0.389415s

puffs_dir_simple

Passed

N/A

0.389721s

puffs_fcntl_getlock_pids

Passed

N/A

0.418913s

puffs_fcntl_lock

Passed

N/A

0.369405s

puffs_lookup_complex

Passed

N/A

0.399594s

puffs_lookup_simple

Passed

N/A

0.389431s

puffs_lstat_symlink

Passed

N/A

0.389045s

puffs_read_directory

Passed

N/A

0.409202s

puffs_rename_dir

Passed

N/A

0.409611s

puffs_rename_dotdot

Passed

N/A

0.359602s

puffs_rename_nametoolong

Passed

N/A

0.429018s

puffs_rename_reg_nodir

Passed

N/A

0.389520s

puffs_symlink_long

Passed

N/A

0.449189s

puffs_symlink_root

Passed

N/A

0.389263s

puffs_symlink_zerolen

Passed

N/A

0.359114s

rumpfs_access_simple

Passed

N/A

0.322103s

rumpfs_attrs

Passed

N/A

0.300675s

rumpfs_create_exist

Passed

N/A

0.297455s

rumpfs_create_many

Passed

N/A

1.392293s

rumpfs_create_nametoolong

Passed

N/A

0.301887s

rumpfs_create_nonalphanum

Passed

N/A

0.360635s

rumpfs_dir_notempty

Passed

N/A

0.320167s

rumpfs_dir_rmdirdotdot

Passed

N/A

0.317945s

rumpfs_dir_simple

Passed

N/A

0.313010s

rumpfs_fcntl_getlock_pids

Passed

N/A

0.305326s

rumpfs_fcntl_lock

Passed

N/A

0.324660s

rumpfs_lookup_complex

Passed

N/A

0.322119s

rumpfs_lookup_simple

Passed

N/A

0.300942s

rumpfs_lstat_symlink

Passed

N/A

0.317717s

rumpfs_read_directory

Passed

N/A

0.305453s

rumpfs_rename_dir

Skipped

rename not supported by file system

0.316250s

rumpfs_rename_dotdot

Skipped

rename not supported by file system

0.314679s

rumpfs_rename_nametoolong

Skipped

rename not supported by file system

0.292665s

rumpfs_rename_reg_nodir

Skipped

rename not supported by file system

0.302476s

rumpfs_symlink_long

Passed

N/A

0.307307s

rumpfs_symlink_root

Passed

N/A

0.306556s

rumpfs_symlink_zerolen

Passed

N/A

0.300619s

sysvbfs_access_simple

Passed

N/A

0.322110s

sysvbfs_attrs

Passed

N/A

0.342704s

sysvbfs_create_exist

Passed

N/A

0.347005s

sysvbfs_create_many

Passed

N/A

0.343837s

sysvbfs_create_nametoolong

Passed

N/A

0.342045s

sysvbfs_create_nonalphanum

Passed

N/A

0.355870s

sysvbfs_dir_notempty

Skipped

directories not supported by file system

0.312755s

sysvbfs_dir_rmdirdotdot

Skipped

directories not supported by file system

0.321378s

sysvbfs_dir_simple

Skipped

directories not supported by file system

0.335934s

sysvbfs_fcntl_getlock_pids

Passed

N/A

0.323382s

sysvbfs_fcntl_lock

Passed

N/A

0.342089s

sysvbfs_lookup_complex

Skipped

directories not supported by file system

0.320620s

sysvbfs_lookup_simple

Passed

N/A

0.315735s

sysvbfs_lstat_symlink

Skipped

symlinks not supported by file system

0.313708s

sysvbfs_read_directory

Passed

N/A

0.342203s

sysvbfs_rename_dir

Skipped

directories not supported by file system

0.312634s

sysvbfs_rename_dotdot

Skipped

directories not supported by file system

0.311328s

sysvbfs_rename_nametoolong

Passed

N/A

0.343931s

sysvbfs_rename_reg_nodir

Passed

N/A

0.317474s

sysvbfs_symlink_long

Skipped

symlinks not supported by file system

0.319257s

sysvbfs_symlink_root

Skipped

symlinks not supported by file system

0.337830s

sysvbfs_symlink_zerolen

Skipped

symlinks not supported by file system

0.344640s

tmpfs_access_simple

Passed

N/A

0.309837s

tmpfs_attrs

Passed

N/A

0.303391s

tmpfs_create_exist

Passed

N/A

0.331568s

tmpfs_create_many

Passed

N/A

1.047182s

tmpfs_create_nametoolong

Passed

N/A

0.308215s

tmpfs_create_nonalphanum

Passed

N/A

0.379534s

tmpfs_dir_notempty

Passed

N/A

0.302077s

tmpfs_dir_rmdirdotdot

Passed

N/A

0.300559s

tmpfs_dir_simple

Passed

N/A

0.305153s

tmpfs_fcntl_getlock_pids

Passed

N/A

0.310102s

tmpfs_fcntl_lock

Passed

N/A

0.323074s

tmpfs_lookup_complex

Passed

N/A

0.298907s

tmpfs_lookup_simple

Passed

N/A

0.300203s

tmpfs_lstat_symlink

Passed

N/A

0.297197s

tmpfs_read_directory

Passed

N/A

0.311462s

tmpfs_rename_dir

Passed

N/A

0.310117s

tmpfs_rename_dotdot

Passed

N/A

0.323279s

tmpfs_rename_nametoolong

Passed

N/A

0.328225s

tmpfs_rename_reg_nodir

Passed

N/A

0.326555s

tmpfs_symlink_long

Passed

N/A

0.335196s

tmpfs_symlink_root

Passed

N/A

0.304435s

tmpfs_symlink_zerolen

Passed

N/A

0.303277s

udf_access_simple

Passed

N/A

0.584763s

udf_attrs

Passed

N/A

0.608528s

udf_create_exist

Passed

N/A

0.587630s

udf_create_many

Passed

N/A

1.873354s

udf_create_nametoolong

Passed

N/A

0.351410s

udf_create_nonalphanum

Passed

N/A

0.679382s

udf_dir_notempty

Passed

N/A

0.588035s

udf_dir_rmdirdotdot

Passed

N/A

0.588359s

udf_dir_simple

Passed

N/A

0.598469s

udf_fcntl_getlock_pids

Passed

N/A

0.359021s

udf_fcntl_lock

Passed

N/A

0.618519s

udf_lookup_complex

Passed

N/A

0.587696s

udf_lookup_simple

Passed

N/A

0.326143s

udf_lstat_symlink

Passed

N/A

0.580833s

udf_read_directory

Passed

N/A

0.333282s

udf_rename_dir

Passed

N/A

0.592868s

udf_rename_dotdot

Passed

N/A

0.588939s

udf_rename_nametoolong

Passed

N/A

0.598728s

udf_rename_reg_nodir

Passed

N/A

0.607794s

udf_symlink_long

Passed

N/A

0.618740s

udf_symlink_root

Passed

N/A

0.328872s

udf_symlink_zerolen

Passed

N/A

0.328983s

v7fs_access_simple

Passed

N/A

0.341789s

v7fs_attrs

Passed

N/A

0.356714s

v7fs_create_exist

Passed

N/A

0.359155s

v7fs_create_many

Passed

N/A

9.189950s

v7fs_create_nametoolong

Passed

N/A

0.340539s

v7fs_create_nonalphanum

Passed

N/A

0.711337s

v7fs_dir_notempty

Passed

N/A

0.338070s

v7fs_dir_rmdirdotdot

Passed

N/A

0.341177s

v7fs_dir_simple

Passed

N/A

0.339878s

v7fs_fcntl_getlock_pids

Passed

N/A

0.346440s

v7fs_fcntl_lock

Passed

N/A

0.346490s

v7fs_lookup_complex

Passed

N/A

0.342616s

v7fs_lookup_simple

Passed

N/A

0.333581s

v7fs_lstat_symlink

Passed

N/A

0.357398s

v7fs_read_directory

Passed

N/A

0.347972s

v7fs_rename_dir

Passed

N/A

0.354973s

v7fs_rename_dotdot

Passed

N/A

0.357791s

v7fs_rename_nametoolong

Passed

N/A

0.360910s

v7fs_rename_reg_nodir

Passed

N/A

0.346675s

v7fs_symlink_long

Passed

N/A

0.372015s

v7fs_symlink_root

Passed

N/A

0.338454s

v7fs_symlink_zerolen

Passed

N/A

0.348040s

fs/cd9660/t_high_ino_big_file

0.309743s

pr_kern_48787

Skipped

not enough free disk space, have 1048344 Kbytes, need ~ 4500000 Kbytes

0.308855s

rump/rumpkern/t_copy

0.202816s

copy_efault

Passed

N/A

0.020894s

copyinstr

Passed

N/A

0.060607s

copyoutstr

Passed

N/A

0.057907s

copystr

Passed

N/A

0.060104s

rump/rumpkern/t_kern

0.561404s

lockme_DESTROYHELD

Passed

N/A

0.092908s

lockme_DOUBLEFREE

Passed

N/A

0.091719s

lockme_DOUBLEINIT

Skipped

test requires LOCKDEBUG kernel

0.020682s

lockme_MEMFREE

Skipped

test requires LOCKDEBUG kernel

0.019410s

lockme_MTX

Passed

N/A

0.096756s

lockme_RWDOUBLEX

Passed

N/A

0.095738s

lockme_RWRX

Skipped

test requires LOCKDEBUG kernel

0.020942s

lockme_RWXR

Passed

N/A

0.090713s

rump/rumpkern/t_lwproc

0.543378s

inherit

Passed

N/A

0.060510s

lwps

Passed

N/A

0.069748s

makelwp

Passed

N/A

0.063515s

nolwp

Passed

N/A

0.058266s

nolwprelease

Passed

N/A

0.092769s

nullswitch

Passed

N/A

0.064825s

proccreds

Passed

N/A

0.063981s

rfork

Passed

N/A

0.058453s

rump/rumpkern/t_modcmd

0.061823s

cmsg_modcmd

Passed

N/A

0.061162s

rump/rumpkern/t_modlinkset

0.067607s

modlinkset

Passed

N/A

0.066860s

rump/rumpkern/t_signals

0.218709s

sigignore

Passed

N/A

0.060222s

sigpanic

Passed

N/A

0.089504s

sigraise

Passed

N/A

0.060286s

rump/rumpkern/t_threads

0.152933s

kthread

Passed

N/A

0.072046s

threadjoin

Passed

N/A

0.079204s

rump/rumpkern/t_tsleep

0.194496s

tsleep

Passed

N/A

0.193654s

rump/rumpkern/t_vm

10.215301s

busypage

Passed

N/A

0.061770s

uvmwait

Passed

N/A

10.152316s

rump/rumpkern/t_sp

27.516742s

basic

Passed

N/A

0.322315s

fork_fakeauth

Passed

N/A

0.335382s

fork_pipecomm

Passed

N/A

0.333901s

fork_simple

Passed

N/A

0.338670s

reconnect

Passed

N/A

2.340943s

signal

Passed

N/A

0.341148s

sigsafe

Passed

N/A

6.005923s

stress_killer

Passed

N/A

6.295724s

stress_long

Passed

N/A

7.366520s

stress_short

Passed

N/A

3.825448s

rump/rumpnet/t_shmif

8.302684s

crossping

Passed

N/A

8.300738s

rump/rumpvfs/t_basic

0.063389s

lseekrv

Passed

N/A

0.062694s

rump/rumpvfs/t_etfs

0.569719s

key

Passed

N/A

0.063116s

large_blk

Passed

N/A

0.204573s

range_blk

Passed

N/A

0.114629s

reregister_blk

Passed

N/A

0.117028s

reregister_reg

Passed

N/A

0.065845s

rump/rumpvfs/t_p2kifs

0.064469s

makecn

Passed

N/A

0.063492s

rump/modautoload/t_modautoload

0.024431s

modautoload

Skipped

host kernel modules not supported

0.023574s

modules/t_modctl

0.684020s

cmd_load

Passed

N/A

0.053915s

cmd_load_props

Passed

N/A

0.102543s

cmd_load_recurse

Passed

N/A

0.159182s

cmd_stat

Passed

N/A

0.098714s

cmd_unload

Passed

N/A

0.265990s

modules/t_builtin

0.329190s

busydisable

Passed

N/A

0.064934s

disable

Passed

N/A

0.068825s

disabledstat

Passed

N/A

0.062250s

forcereload

Passed

N/A

0.062444s

noauto

Passed

N/A

0.067522s

modules/t_abi_uvm

0.416929s

PAGE_SIZE

Passed

N/A

0.416073s

modules/t_modload

2.408717s

bflag

Passed

N/A

0.618496s

iflag

Passed

N/A

0.762798s

plain

Passed

N/A

0.456557s

sflag

Passed

N/A

0.565992s

crypto/libcrypto/t_certs

0.139208s

x509v3

Passed

N/A

0.138644s

crypto/libcrypto/t_ciphers

4.250887s

bf

Passed

N/A

0.152436s

cast

Passed

N/A

3.087225s

des

Passed

N/A

0.154596s

evp

Passed

N/A

0.317771s

idea

Passed

N/A

0.130142s

rc2

Passed

N/A

0.134362s

rc4

Passed

N/A

0.164402s

rc5

Skipped

RC5 support not available; system built with MKCRYPTO_RC5=no

0.103640s

crypto/libcrypto/t_hashes

1.013846s

hmac

Passed

N/A

0.163268s

md2

Passed

N/A

0.132475s

md4

Passed

N/A

0.138198s

md5

Passed

N/A

0.137598s

mdc2

Passed

N/A

0.134058s

ripemd

Passed

N/A

0.138566s

sha

Passed

N/A

0.164134s

crypto/libcrypto/t_libcrypto

8.560649s

bn

Passed

N/A

7.638453s

conf

Passed

N/A

0.162393s

engine

Passed

N/A

0.240636s

lhash

Passed

N/A

0.152147s

rand

Passed

N/A

0.144836s

threads

Passed

N/A

0.218226s

crypto/libcrypto/t_pubkey

25.288851s

dh

Passed

N/A

0.400725s

dsa

Passed

N/A

0.485735s

ec

Passed

N/A

8.678079s

ecdh

Passed

N/A

1.342009s

ecdsa

Passed

N/A

8.974880s

rsa

Passed

N/A

5.120938s

srp

Passed

N/A

0.281659s

crypto/opencrypto/t_opencrypto

5.326300s

aesctr1

Passed

N/A

0.391846s

aesctr2

Passed

N/A

0.381265s

arc4

Skipped

ARC4 not implemented by swcrypto

0.268003s

camellia

Passed

N/A

0.389421s

cbcdes

Passed

N/A

0.378853s

comp

Passed

N/A

0.408813s

comp_deflate

Passed

N/A

0.393206s

comp_zlib_rnd

Passed

N/A

0.391091s

gcm

Passed

N/A

0.386903s

md5

Passed

N/A

0.382091s

md5_hmac

Passed

N/A

0.391794s

null

Passed

N/A

0.380948s

sha1_hmac

Passed

N/A

0.383833s

xcbcmac

Passed

N/A

0.379438s

ipf/t_filter_exec

16.401201s

f1

Passed

N/A

0.538264s

f10

Passed

N/A

1.048442s

f11

Passed

N/A

0.505544s

f12

Passed

N/A

0.443625s

f13

Passed

N/A

0.577418s

f14

Passed

N/A

0.526416s

f15

Passed

N/A

0.188263s

f16

Passed

N/A

0.182807s

f17

Passed

N/A

0.179996s

f18

Passed

N/A

0.176810s

f19

Passed

N/A

0.236457s

f2

Passed

N/A

0.432483s

f20

Passed

N/A

0.173664s

f24

Passed

N/A

0.166557s

f25

Passed

N/A

0.176896s

f26

Expected failure

Known to be broken: results differ

0.458104s

f27

Expected failure

Known to be broken: results differ

0.438390s

f3

Passed

N/A

0.528546s

f30

Passed

N/A

0.324593s

f4

Passed

N/A

0.535661s

f5

Passed

N/A

2.521325s

f6

Passed

N/A

2.606100s

f7

Passed

N/A

0.569036s

f8

Passed

N/A

0.443499s

f9

Passed

N/A

1.040906s

ipv6_1

Passed

N/A

0.228420s

ipv6_2

Passed

N/A

0.336317s

ipv6_3

Passed

N/A

0.219903s

ipv6_5

Passed

N/A

0.278631s

ipv6_6

Passed

N/A

0.275679s

ipf/t_filter_parse

3.833542s

i1

Passed

N/A

0.209780s

i10

Passed

N/A

0.168577s

i11

Passed

N/A

0.164853s

i12

Passed

N/A

0.153979s

i13

Passed

N/A

0.140893s

i14

Passed

N/A

0.154039s

i15

Passed

N/A

0.150710s

i16

Passed

N/A

0.149002s

i17

Expected failure

Known to be broken: atf-check failed; see the output of the test for details

0.163771s

i18

Passed

N/A

0.146177s

i19

Passed

N/A

0.307656s

i2

Passed

N/A

0.238257s

i20

Passed

N/A

0.153583s

i21

Passed

N/A

0.143779s

i22

Passed

N/A

0.146320s

i23

Passed

N/A

0.143888s

i3

Passed

N/A

0.148294s

i4

Passed

N/A

0.153612s

i5

Passed

N/A

0.149923s

i6

Passed

N/A

0.147312s

i7

Passed

N/A

0.152488s

i8

Passed

N/A

0.171317s

i9

Passed

N/A

0.150654s

ipf/t_logging

1.436332s

l1

Passed

N/A

1.434049s

ipf/t_nat_exec

10.720862s

n1

Passed

N/A

0.350751s

n10

Passed

N/A

0.332355s

n100

Passed

N/A

0.215004s

n101

Passed

N/A

0.213818s

n102

Passed

N/A

0.220408s

n103

Passed

N/A

0.225407s

n104

Passed

N/A

0.215733s

n105

Passed

N/A

0.211626s

n106

Passed

N/A

0.216495s

n11

Passed

N/A

0.340301s

n11_6

Passed

N/A

0.338969s

n12

Passed

N/A

0.215039s

n12_6

Passed

N/A

0.227400s

n13

Passed

N/A

0.221125s

n14

Passed

N/A

0.228535s

n15_6

Passed

N/A

0.274325s

n16

Passed

N/A

0.228572s

n17

Passed

N/A

0.222876s

n1_6

Passed

N/A

0.341796s

n2

Passed

N/A

0.381421s

n200

Passed

N/A

0.216651s

n2_6

Passed

N/A

0.479232s

n3

Passed

N/A

0.276912s

n4

Passed

N/A

0.489852s

n4_6

Passed

N/A

0.495709s

n5

Passed

N/A

0.535471s

n5_6

Passed

N/A

0.516273s

n6

Passed

N/A

0.430828s

n6_6

Passed

N/A

0.454277s

n7

Passed

N/A

0.337291s

n7_6

Passed

N/A

0.332448s

n8

Passed

N/A

0.207905s

n8_6

Expected failure

See PR kern/47665: results differ

0.221801s

n9

Passed

N/A

0.217448s

n9_6

Expected failure

See PR kern/47665: results differ

0.229360s

ipf/t_nat_ipf_exec

4.585081s

ni1

Passed

N/A

0.193538s

ni10

Passed

N/A

0.203223s

ni11

Passed

N/A

0.207217s

ni12

Passed

N/A

0.201520s

ni13

Passed

N/A

0.212470s

ni14

Passed

N/A

0.204850s

ni15

Passed

N/A

0.213731s

ni16

Passed

N/A

0.215571s

ni17

Passed

N/A

0.174882s

ni18

Passed

N/A

0.192186s

ni19

Passed

N/A

0.208895s

ni2

Passed

N/A

0.193892s

ni20

Passed

N/A

0.215793s

ni21

Passed

N/A

0.182079s

ni23

Passed

N/A

0.178535s

ni3

Passed

N/A

0.196201s

ni4

Passed

N/A

0.196813s

ni5

Passed

N/A

0.207511s

ni6

Passed

N/A

0.188477s

ni7

Passed

N/A

0.197489s

ni8

Passed

N/A

0.355369s

ni9

Passed

N/A

0.205866s

ipf/t_nat_parse

3.110942s

in1

Passed

N/A

0.217666s

in100

Passed

N/A

0.159215s

in100_6

Passed

N/A

0.147625s

in101

Passed

N/A

0.151526s

in101_6

Passed

N/A

0.158601s

in102

Passed

N/A

0.148617s

in102_6

Passed

N/A

0.143807s

in1_6

Passed

N/A

0.151888s

in2

Passed

N/A

0.163520s

in2_6

Passed

N/A

0.164282s

in3

Passed

N/A

0.144518s

in3_6

Passed

N/A

0.149220s

in4

Passed

N/A

0.143697s

in4_6

Passed

N/A

0.155163s

in5

Passed

N/A

0.152017s

in5_6

Passed

N/A

0.153977s

in6

Passed

N/A

0.142151s

in6_6

Passed

N/A

0.144608s

in7

Passed

N/A

0.151408s

in8_6

Passed

N/A

0.146380s

ipf/t_pools

3.002916s

f28

Passed

N/A

0.188925s

f29

Passed

N/A

0.168081s

ip1

Passed

N/A

0.217227s

ip2

Passed

N/A

0.167821s

ip3

Passed

N/A

0.154131s

p1

Passed

N/A

0.178436s

p10

Passed

N/A

0.164095s

p11

Passed

N/A

0.165027s

p12

Passed

N/A

0.169576s

p13

Passed

N/A

0.174166s

p2

Passed

N/A

0.167344s

p3

Passed

N/A

0.175274s

p4

Passed

N/A

0.185771s

p5

Passed

N/A

0.176461s

p6

Passed

N/A

0.171972s

p7

Passed

N/A

0.172925s

p9

Passed

N/A

0.178798s

share/examples/t_asm

0.374568s

hello

Skipped

Example program not implemented on this platform

0.373983s

share/mk/t_lib

2.706175s

defaults__build_and_install

Passed

N/A

2.699558s

share/mk/t_own

0.628645s

makeconf__missing

Passed

N/A

0.236730s

makeconf__ok

Passed

N/A

0.389258s

share/mk/t_prog

2.279523s

defaults__build_and_install

Passed

N/A

1.359145s

without_man__build_and_install

Passed

N/A

0.911346s

share/mk/t_test

8.633218s

one_c

Passed

N/A

1.170738s

one_cxx

Passed

N/A

6.725996s

one_sh

Passed

N/A

0.725457s

atf/atf-c/detail/dynstr_test

5.497621s

append_ap

Passed

N/A

1.153076s

append_fmt

Passed

N/A

1.145957s

clear

Passed

N/A

0.013115s

copy

Passed

N/A

0.012768s

cstring

Passed

N/A

0.012320s

equal_cstring

Passed

N/A

0.012234s

equal_dynstr

Passed

N/A

0.012551s

fini_disown

Passed

N/A

0.012236s

init

Passed

N/A

0.012156s

init_ap

Passed

N/A

0.012274s

init_fmt

Passed

N/A

0.012201s

init_raw

Passed

N/A

0.012139s

init_rep

Passed

N/A

0.404493s

init_substr

Passed

N/A

0.012586s

length

Passed

N/A

0.033928s

prepend_ap

Passed

N/A

1.305744s

prepend_fmt

Passed

N/A

1.295673s

rfind_ch

Passed

N/A

0.012867s

atf/atf-c/detail/env_test

0.048616s

get

Passed

N/A

0.011670s

has

Passed

N/A

0.011621s

set

Passed

N/A

0.011445s

unset

Passed

N/A

0.011587s

atf/atf-c/detail/fs_test

0.355047s

eaccess

Passed

N/A

0.015060s

exists

Passed

N/A

0.013617s

getcwd

Passed

N/A

0.015015s

mkdtemp_err

Passed

N/A

0.016065s

mkdtemp_ok

Passed

N/A

0.014424s

mkdtemp_umask

Passed

N/A

0.014135s

mkstemp_err

Passed

N/A

0.016619s

mkstemp_ok

Passed

N/A

0.014602s

mkstemp_umask

Passed

N/A

0.014248s

path_append

Passed

N/A

0.014901s

path_branch_path

Passed

N/A

0.015122s

path_copy

Passed

N/A

0.014639s

path_equal

Passed

N/A

0.013475s

path_is_absolute

Passed

N/A

0.014111s

path_is_root

Passed

N/A

0.014462s

path_leaf_name

Passed

N/A

0.013360s

path_normalize

Passed

N/A

0.013015s

path_to_absolute

Passed

N/A

0.013171s

rmdir_empty

Passed

N/A

0.012763s

rmdir_enotempty

Passed

N/A

0.012641s

rmdir_eperm

Passed

N/A

0.012584s

stat_mode

Passed

N/A

0.012503s

stat_perms

Passed

N/A

0.012734s

stat_type

Passed

N/A

0.012511s

atf/atf-c/detail/list_test

0.111334s

list_append

Passed

N/A

0.012494s

list_append_list

Passed

N/A

0.011699s

list_for_each

Passed

N/A

0.011886s

list_for_each_c

Passed

N/A

0.012158s

list_index

Passed

N/A

0.012055s

list_index_c

Passed

N/A

0.011771s

list_init

Passed

N/A

0.011747s

list_to_charpp_empty

Passed

N/A

0.011560s

list_to_charpp_some

Passed

N/A

0.011462s

atf/atf-c/detail/map_test

0.175552s

find

Passed

N/A

0.012197s

find_c

Passed

N/A

0.011809s

map_for_each

Passed

N/A

0.012984s

map_for_each_c

Passed

N/A

0.013067s

map_init

Passed

N/A

0.011839s

map_init_charpp_empty

Passed

N/A

0.011859s

map_init_charpp_null

Passed

N/A

0.012350s

map_init_charpp_short

Passed

N/A

0.013627s

map_init_charpp_some

Passed

N/A

0.014564s

map_insert

Passed

N/A

0.012655s

stable_keys

Passed

N/A

0.013234s

to_charpp_empty

Passed

N/A

0.015002s

to_charpp_some

Passed

N/A

0.013376s

atf/atf-c/detail/process_test

2.040248s

child_pid

Passed

N/A

0.018411s

child_wait_eintr

Passed

N/A

1.023704s

exec_failure

Passed

N/A

0.029887s

exec_list

Passed

N/A

0.021159s

exec_prehook

Passed

N/A

0.016977s

exec_success

Passed

N/A

0.020234s

fork_cookie

Passed

N/A

0.018089s

fork_out_capture_err_capture

Passed

N/A

0.017729s

fork_out_capture_err_connect

Passed

N/A

0.020874s

fork_out_capture_err_default

Passed

N/A

0.019903s

fork_out_capture_err_inherit

Passed

N/A

0.020733s

fork_out_capture_err_redirect_fd

Passed

N/A

0.019762s

fork_out_capture_err_redirect_path

Passed

N/A

0.019930s

fork_out_connect_err_capture

Passed

N/A

0.020059s

fork_out_connect_err_connect

Passed

N/A

0.020202s

fork_out_connect_err_default

Passed

N/A

0.020092s

fork_out_connect_err_inherit

Passed

N/A

0.020743s

fork_out_connect_err_redirect_fd

Passed

N/A

0.020259s

fork_out_connect_err_redirect_path

Passed

N/A

0.020149s

fork_out_default_err_capture

Passed

N/A

0.020312s

fork_out_default_err_connect

Passed

N/A

0.019446s

fork_out_default_err_default

Passed

N/A

0.018471s

fork_out_default_err_inherit

Passed

N/A

0.020565s

fork_out_default_err_redirect_fd

Passed

N/A

0.018866s

fork_out_default_err_redirect_path

Passed

N/A

0.018392s

fork_out_inherit_err_capture

Passed

N/A

0.019900s

fork_out_inherit_err_connect

Passed

N/A

0.020029s

fork_out_inherit_err_default

Passed

N/A

0.020086s

fork_out_inherit_err_inherit

Passed

N/A

0.019602s

fork_out_inherit_err_redirect_fd

Passed

N/A

0.020134s

fork_out_inherit_err_redirect_path

Passed

N/A

0.020488s

fork_out_redirect_fd_err_capture

Passed

N/A

0.020540s

fork_out_redirect_fd_err_connect

Passed

N/A

0.019913s

fork_out_redirect_fd_err_default

Passed

N/A

0.018974s

fork_out_redirect_fd_err_inherit

Passed

N/A

0.018707s

fork_out_redirect_fd_err_redirect_fd

Passed

N/A

0.020970s

fork_out_redirect_fd_err_redirect_path

Passed

N/A

0.020331s

fork_out_redirect_path_err_capture

Passed

N/A

0.020327s

fork_out_redirect_path_err_connect

Passed

N/A

0.020283s

fork_out_redirect_path_err_default

Passed

N/A

0.020481s

fork_out_redirect_path_err_inherit

Passed

N/A

0.020404s

fork_out_redirect_path_err_redirect_fd

Passed

N/A

0.020741s

fork_out_redirect_path_err_redirect_path

Passed

N/A

0.019614s

status_coredump

Passed

N/A

0.021017s

status_exited

Passed

N/A

0.020419s

status_signaled

Passed

N/A

0.019184s

stream_init_capture

Passed

N/A

0.015165s

stream_init_connect

Passed

N/A

0.015156s

stream_init_inherit

Passed

N/A

0.013923s

stream_init_redirect_fd

Passed

N/A

0.013799s

stream_init_redirect_path

Passed

N/A

0.014507s

atf/atf-c/detail/sanity_test

0.119944s

inv

Passed

N/A

0.028275s

post

Passed

N/A

0.028104s

pre

Passed

N/A

0.028052s

unreachable

Passed

N/A

0.028307s

atf/atf-c/detail/text_test

0.095313s

for_each_word

Passed

N/A

0.013621s

format

Passed

N/A

0.013049s

format_ap

Passed

N/A

0.012845s

split

Passed

N/A

0.014329s

split_delims

Passed

N/A

0.012842s

to_bool

Passed

N/A

0.012316s

to_long

Passed

N/A

0.012235s

atf/atf-c/detail/user_test

0.053074s

euid

Passed

N/A

0.011601s

is_member_of_group

Passed

N/A

0.014316s

is_root

Passed

N/A

0.012669s

is_unprivileged

Passed

N/A

0.011924s

atf/atf-c/atf_c_test

0.226106s

include

Passed

N/A

0.225120s

atf/atf-c/build_test

0.220185s

c_o

Passed

N/A

0.014967s

cpp

Passed

N/A

0.014139s

cxx_o

Passed

N/A

0.013855s

equal_arrays

Passed

N/A

0.013271s

include

Passed

N/A

0.160855s

atf/atf-c/check_test

2.498460s

build_c_o

Passed

N/A

0.281334s

build_cpp

Passed

N/A

0.399017s

build_cxx_o

Passed

N/A

1.510179s

exec_array

Passed

N/A

0.022958s

exec_cleanup

Passed

N/A

0.021776s

exec_exitstatus

Passed

N/A

0.037552s

exec_stdout_stderr

Passed

N/A

0.032110s

exec_umask

Passed

N/A

0.013356s

exec_unknown

Passed

N/A

0.017604s

include

Passed

N/A

0.154080s

atf/atf-c/config_test

0.191392s

get

Passed

N/A

0.015212s

include

Passed

N/A

0.174468s

atf/atf-c/error_test

0.441361s

error_new

Passed

N/A

0.013911s

error_new_wo_memory

Passed

N/A

0.013446s

format

Passed

N/A

0.012981s

include

Passed

N/A

0.154178s

include_fwd

Passed

N/A

0.142210s

is_error

Passed

N/A

0.013666s

libc_format

Passed

N/A

0.015502s

libc_new

Passed

N/A

0.013150s

no_error

Passed

N/A

0.013459s

no_memory_format

Passed

N/A

0.013401s

no_memory_new

Passed

N/A

0.013244s

no_memory_twice

Passed

N/A

0.013279s

atf/atf-c/macros_test

1.315042s

check

Passed

N/A

0.032091s

check_eq

Passed

N/A

0.049811s

check_errno

Passed

N/A

0.030539s

check_match

Passed

N/A

0.038486s

check_streq

Passed

N/A

0.058841s

detect_unused_tests

Expected failure

PR 49187: Build of unused_test.c passed; unused test cases are not properly detected

0.355669s

include

Passed

N/A

0.216093s

msg_embedded_fmt

Passed

N/A

0.034302s

require

Passed

N/A

0.030756s

require_eq

Passed

N/A

0.047548s

require_errno

Passed

N/A

0.030254s

require_match

Passed

N/A

0.035893s

require_streq

Passed

N/A

0.052159s

use

Passed

N/A

0.285931s

atf/atf-c/tc_test

0.223559s

config

Passed

N/A

0.013610s

include

Passed

N/A

0.167097s

init

Passed

N/A

0.013862s

init_pack

Passed

N/A

0.012950s

vars

Passed

N/A

0.012726s

atf/atf-c/tp_test

0.166675s

getopt

Passed

N/A

0.012418s

include

Passed

N/A

0.152642s

atf/atf-c/utils_test

0.664081s

cat_file__empty

Passed

N/A

0.013258s

cat_file__no_newline_eof

Passed

N/A

0.013274s

cat_file__one_line

Passed

N/A

0.015055s

cat_file__several_lines

Passed

N/A

0.019066s

compare_file__empty__match

Passed

N/A

0.012570s

compare_file__empty__not_match

Passed

N/A

0.012309s

compare_file__long__match

Passed

N/A

0.014328s

compare_file__long__not_match

Passed

N/A

0.013051s

compare_file__short__match

Passed

N/A

0.012468s

compare_file__short__not_match

Passed

N/A

0.012369s

copy_file__empty

Passed

N/A

0.012347s

copy_file__some_contents

Passed

N/A

0.012450s

create_file

Passed

N/A

0.013887s

file_exists

Passed

N/A

0.012983s

fork

Passed

N/A

0.016132s

free_charpp__empty

Passed

N/A

0.012583s

free_charpp__some

Passed

N/A

0.012406s

grep_file

Passed

N/A

0.014616s

grep_string

Passed

N/A

0.012873s

include

Passed

N/A

0.195643s

readline__none

Passed

N/A

0.012844s

readline__some

Passed

N/A

0.013404s

redirect__other

Passed

N/A

0.012230s

redirect__stderr

Passed

N/A

0.013866s

redirect__stdout

Passed

N/A

0.017984s

wait__invalid_exitstatus

Passed

N/A

0.019085s

wait__invalid_stderr

Passed

N/A

0.019359s

wait__invalid_stdout

Passed

N/A

0.019446s

wait__ok

Passed

N/A

0.019541s

wait__save_stderr

Passed

N/A

0.019151s

wait__save_stdout

Passed

N/A

0.019088s

atf/atf-c/pkg_config_test

0.003529s

build

Skipped

Required program 'pkg-config' not found in the PATH

0.001691s

version

Skipped

Required program 'pkg-config' not found in the PATH

0.001747s

atf/atf-c++/detail/application_test

0.023544s

getopt

Passed

N/A

0.022981s

atf/atf-c++/detail/auto_array_test

0.213859s

auto_array_access

Passed

N/A

0.022922s

auto_array_assign

Passed

N/A

0.022884s

auto_array_assign_ref

Passed

N/A

0.023055s

auto_array_copy

Passed

N/A

0.023164s

auto_array_copy_ref

Passed

N/A

0.023229s

auto_array_get

Passed

N/A

0.023366s

auto_array_release

Passed

N/A

0.023490s

auto_array_reset

Passed

N/A

0.023343s

auto_array_scope

Passed

N/A

0.023050s

atf/atf-c++/detail/env_test

0.074498s

has_get

Passed

N/A

0.023270s

set

Passed

N/A

0.022720s

unset

Passed

N/A

0.026184s

atf/atf-c++/detail/exceptions_test

0.119854s

throw_atf_error_libc

Passed

N/A

0.039811s

throw_atf_error_no_memory

Passed

N/A

0.038979s

throw_atf_error_unknown

Passed

N/A

0.038828s

atf/atf-c++/detail/fs_test

0.492777s

directory_file_info

Passed

N/A

0.026947s

directory_names

Passed

N/A

0.027073s

directory_read

Passed

N/A

0.024682s

exists

Passed

N/A

0.024825s

file_info_perms

Passed

N/A

0.031661s

file_info_stat

Passed

N/A

0.023978s

is_executable

Passed

N/A

0.024313s

path_branch_path

Passed

N/A

0.025861s

path_compare_different

Passed

N/A

0.023707s

path_compare_equal

Passed

N/A

0.023404s

path_concat

Passed

N/A

0.023509s

path_is_absolute

Passed

N/A

0.023373s

path_is_root

Passed

N/A

0.023495s

path_leaf_name

Passed

N/A

0.025931s

path_normalize

Passed

N/A

0.025947s

path_op_less

Passed

N/A

0.026735s

path_to_absolute

Passed

N/A

0.027290s

remove

Passed

N/A

0.041086s

atf/atf-c++/detail/process_test

0.265395s

argv_array_assign

Passed

N/A

0.023472s

argv_array_copy

Passed

N/A

0.026020s

argv_array_exec_argv

Passed

N/A

0.026278s

argv_array_init_carray

Passed

N/A

0.025453s

argv_array_init_col

Passed

N/A

0.023250s

argv_array_init_empty

Passed

N/A

0.024151s

argv_array_init_varargs

Passed

N/A

0.023144s

argv_array_iter

Passed

N/A

0.022818s

exec_failure

Passed

N/A

0.030225s

exec_success

Passed

N/A

0.033176s

atf/atf-c++/detail/sanity_test

0.023478s

nothing

Passed

N/A

0.022663s

atf/atf-c++/detail/text_test

0.329611s

duplicate

Passed

N/A

0.026274s

join

Passed

N/A

0.028503s

match

Passed

N/A

0.038661s

split

Passed

N/A

0.026936s

split_delims

Passed

N/A

0.026256s

to_bool

Passed

N/A

0.040584s

to_bytes

Passed

N/A

0.041572s

to_string

Passed

N/A

0.026501s

to_type

Passed

N/A

0.041029s

trim

Passed

N/A

0.026086s

atf/atf-c++/atf_c++_test

1.812381s

include

Passed

N/A

1.811257s

atf/atf-c++/build_test

0.962620s

c_o

Passed

N/A

0.027716s

cpp

Passed

N/A

0.026569s

cxx_o

Passed

N/A

0.027169s

equal_argvs

Passed

N/A

0.025599s

include

Passed

N/A

0.852288s

atf/atf-c++/check_test

3.194009s

build_c_o

Passed

N/A

0.301175s

build_cpp

Passed

N/A

0.188285s

build_cxx_o

Passed

N/A

1.484556s

exec_cleanup

Passed

N/A

0.034949s

exec_exitstatus

Passed

N/A

0.048579s

exec_stdout_stderr

Passed

N/A

0.047914s

exec_unknown

Passed

N/A

0.034664s

include

Passed

N/A

1.045166s

atf/atf-c++/config_test

1.069628s

get

Passed

N/A

0.029450s

get_all

Passed

N/A

0.025449s

has

Passed

N/A

0.025163s

include

Passed

N/A

0.986782s

atf/atf-c++/macros_test

6.978083s

check_errno

Passed

N/A

0.053608s

detect_unused_tests

Expected failure

PR 49187: Build of unused_test.cpp passed; unused test cases are not properly detected

2.339180s

fail

Passed

N/A

0.030791s

include

Passed

N/A

1.808762s

pass

Passed

N/A

0.030119s

require

Passed

N/A

0.058322s

require_eq

Passed

N/A

0.053524s

require_errno

Passed

N/A

0.045624s

require_in

Passed

N/A

0.064418s

require_match

Passed

N/A

0.038513s

require_not_in

Passed

N/A

0.064353s

require_throw

Passed

N/A

0.072328s

require_throw_re

Passed

N/A

0.098060s

skip

Passed

N/A

0.030432s

use

Passed

N/A

2.173678s

atf/atf-c++/tests_test

1.049103s

atf_tp_writer

Passed

N/A

0.025800s

include

Passed

N/A

1.021506s

atf/atf-c++/utils_test

1.654780s

cat_file__empty

Passed

N/A

0.026508s

cat_file__no_newline_eof

Passed

N/A

0.024437s

cat_file__one_line

Passed

N/A

0.026502s

cat_file__several_lines

Passed

N/A

0.026849s

compare_file__empty__match

Passed

N/A

0.025544s

compare_file__empty__not_match

Passed

N/A

0.025019s

compare_file__long__match

Passed

N/A

0.025146s

compare_file__long__not_match

Passed

N/A

0.025853s

compare_file__short__match

Passed

N/A

0.026393s

compare_file__short__not_match

Passed

N/A

0.024031s

copy_file__empty

Passed

N/A

0.025107s

copy_file__some_contents

Passed

N/A

0.026356s

create_file

Passed

N/A

0.025079s

file_exists

Passed

N/A

0.025449s

fork

Passed

N/A

0.029336s

grep_collection__set

Passed

N/A

0.025378s

grep_collection__vector

Passed

N/A

0.024162s

grep_file

Passed

N/A

0.025340s

grep_string

Passed

N/A

0.025946s

include

Passed

N/A

0.832352s

redirect__other

Passed

N/A

0.024846s

redirect__stderr

Passed

N/A

0.026883s

redirect__stdout

Passed

N/A

0.026592s

wait__invalid_exitstatus

Passed

N/A

0.038947s

wait__invalid_stderr

Passed

N/A

0.037843s

wait__invalid_stdout

Passed

N/A

0.038063s

wait__ok

Passed

N/A

0.036792s

wait__save_stderr

Passed

N/A

0.040296s

wait__save_stdout

Passed

N/A

0.039271s

atf/atf-c++/pkg_config_test

0.002953s

build

Skipped

Required program 'pkg-config' not found in the PATH

0.001333s

version

Skipped

Required program 'pkg-config' not found in the PATH

0.001533s

atf/atf-sh/atf-check_test

6.537889s

eflag_empty

Passed

N/A

0.199508s

eflag_file

Passed

N/A

0.297008s

eflag_ignore

Passed

N/A

0.196724s

eflag_inline

Passed

N/A

0.513013s

eflag_match

Passed

N/A

0.334287s

eflag_multiple

Passed

N/A

0.280423s

eflag_negated

Passed

N/A

0.281125s

eflag_save

Passed

N/A

0.153889s

invalid_umask

Passed

N/A

0.142795s

oflag_empty

Passed

N/A

0.203687s

oflag_file

Passed

N/A

0.296696s

oflag_ignore

Passed

N/A

0.196632s

oflag_inline

Passed

N/A

0.474507s

oflag_match

Passed

N/A

0.319372s

oflag_multiple

Passed

N/A

0.278574s

oflag_negated

Passed

N/A

0.275395s

oflag_save

Passed

N/A

0.148731s

sflag_eq_ne

Passed

N/A

0.441588s

sflag_exit

Passed

N/A

0.549947s

sflag_ignore

Passed

N/A

0.210259s

sflag_signal

Passed

N/A

0.383624s

stdin

Passed

N/A

0.139949s

xflag

Passed

N/A

0.195320s

atf/atf-sh/atf_check_test

12.377920s

equal

Passed

N/A

0.631171s

experr_mismatch

Passed

N/A

0.318944s

expout_mismatch

Passed

N/A

0.317277s

flush_stdout_on_timeout

Passed

N/A

10.130568s

info_ok

Passed

N/A

0.417872s

null_stderr

Passed

N/A

0.279736s

null_stdout

Passed

N/A

0.275600s

atf/atf-sh/config_test

0.949861s

get

Passed

N/A

0.462950s

has

Passed

N/A

0.485301s

atf/atf-sh/integration_test

0.531251s

arguments

Passed

N/A

0.236055s

missing_script

Passed

N/A

0.147985s

no_args

Passed

N/A

0.144676s

atf/atf-sh/normalize_test

0.276742s

main

Passed

N/A

0.275973s

atf/atf-sh/tc_test

0.748547s

default_status

Passed

N/A

0.530173s

missing_body

Passed

N/A

0.216776s

atf/atf-sh/tp_test

0.263823s

srcdir

Passed

N/A

0.262345s

atf/test-programs/config_test

1.385470s

vflag

Passed

N/A

1.384551s

atf/test-programs/expect_test

4.580247s

expect_death

Passed

N/A

0.880155s

expect_exit

Passed

N/A

0.925750s

expect_fail

Passed

N/A

0.775058s

expect_pass

Passed

N/A

0.746986s

expect_signal

Passed

N/A

0.882173s

expect_timeout

Passed

N/A

0.366337s

atf/test-programs/meta_data_test

3.732855s

no_descr

Passed

N/A

1.819003s

no_head

Passed

N/A

1.912608s

atf/test-programs/result_test

2.272781s

atf_run_warnings

Passed

N/A

0.283750s

result_exception

Passed

N/A

0.163267s

result_on_stdout

Passed

N/A

0.599041s

result_to_file

Passed

N/A

0.902257s

result_to_file_fail

Passed

N/A

0.317647s

atf/test-programs/srcdir_test

4.083917s

default

Passed

N/A

0.634653s

libtool

Passed

N/A

0.605351s

relative

Passed

N/A

2.037282s

sflag

Passed

N/A

0.795715s

atf/tools/application_test

0.025091s

getopt

Passed

N/A

0.024524s

atf/tools/atffile_test

0.514953s

atffile_1

Passed

N/A

0.025553s

atffile_2

Passed

N/A

0.023874s

atffile_3

Passed

N/A

0.025662s

atffile_4

Passed

N/A

0.024027s

atffile_5

Passed

N/A

0.024603s

atffile_50

Passed

N/A

0.037780s

atffile_51

Passed

N/A

0.038959s

atffile_52

Passed

N/A

0.039881s

atffile_53

Passed

N/A

0.038558s

atffile_54

Passed

N/A

0.038154s

atffile_6

Passed

N/A

0.024646s

atffile_getters

Passed

N/A

0.023888s

read_missing_test_program

Passed

N/A

0.038863s

read_missing_test_suite

Passed

N/A

0.041177s

read_ok_simple

Passed

N/A

0.027398s

read_ok_some_globs

Passed

N/A

0.028987s

atf/tools/auto_array_test

0.236037s

auto_array_access

Passed

N/A

0.026665s

auto_array_assign

Passed

N/A

0.026442s

auto_array_assign_ref

Passed

N/A

0.025694s

auto_array_copy

Passed

N/A

0.026595s

auto_array_copy_ref

Passed

N/A

0.026309s

auto_array_get

Passed

N/A

0.025161s

auto_array_release

Passed

N/A

0.026232s

auto_array_reset

Passed

N/A

0.024806s

auto_array_scope

Passed

N/A

0.023468s

atf/tools/config_file_test

0.446052s

config_1

Passed

N/A

0.027693s

config_2

Passed

N/A

0.026144s

config_3

Passed

N/A

0.025077s

config_4

Passed

N/A

0.025585s

config_50

Passed

N/A

0.040286s

config_51

Passed

N/A

0.040033s

config_52

Passed

N/A

0.039324s

config_53

Passed

N/A

0.041011s

config_54

Passed

N/A

0.038843s

merge_configs_both_empty

Passed

N/A

0.026723s

merge_configs_lower_empty

Passed

N/A

0.026407s

merge_configs_mixed

Passed

N/A

0.026572s

merge_configs_upper_empty

Passed

N/A

0.026276s

read_config_files_none

Passed

N/A

0.026885s

atf/tools/config_test

0.082770s

get

Passed

N/A

0.031210s

get_all

Passed

N/A

0.024526s

has

Passed

N/A

0.024814s

atf/tools/env_test

0.074799s

has_get

Passed

N/A

0.024591s

set

Passed

N/A

0.023568s

unset

Passed

N/A

0.024140s

atf/tools/expand_test

0.153999s

expand_glob_base

Passed

N/A

0.026745s

expand_glob_tps

Passed

N/A

0.025733s

is_glob

Passed

N/A

0.023200s

matches_glob_plain

Passed

N/A

0.025998s

matches_glob_question

Passed

N/A

0.024857s

matches_glob_star

Passed

N/A

0.023165s

atf/tools/fs_test

0.757906s

change_directory

Passed

N/A

0.049822s

cleanup

Passed

N/A

0.042138s

cleanup_eacces_on_root

Passed

N/A

0.026649s

cleanup_eacces_on_subdir

Passed

N/A

0.039503s

directory_file_info

Passed

N/A

0.024841s

directory_names

Passed

N/A

0.027181s

directory_read

Passed

N/A

0.027177s

exists

Passed

N/A

0.039961s

file_info_perms

Passed

N/A

0.026828s

file_info_stat

Passed

N/A

0.026587s

get_current_dir

Passed

N/A

0.025206s

is_executable

Passed

N/A

0.040254s

path_branch_path

Passed

N/A

0.026164s

path_compare_different

Passed

N/A

0.026067s

path_compare_equal

Passed

N/A

0.026582s

path_concat

Passed

N/A

0.025712s

path_is_absolute

Passed

N/A

0.024317s

path_is_root

Passed

N/A

0.024883s

path_leaf_name

Passed

N/A

0.025618s

path_normalize

Passed

N/A

0.026415s

path_op_less

Passed

N/A

0.024559s

path_to_absolute

Passed

N/A

0.026236s

remove

Passed

N/A

0.040308s

temp_dir_raii

Passed

N/A

0.038718s

atf/tools/io_test

4.171180s

file_handle_copy

Passed

N/A

0.024911s

file_handle_ctor

Passed

N/A

0.025396s

file_handle_get

Passed

N/A

0.025539s

file_handle_posix_remap

Passed

N/A

0.024205s

muxer_large_buffer

Passed

N/A

2.669714s

muxer_small_buffer

Passed

N/A

1.213889s

pistream

Passed

N/A

0.025662s

systembuf_long_read

Passed

N/A

0.052141s

systembuf_long_write

Passed

N/A

0.048503s

systembuf_short_read

Passed

N/A

0.026736s

systembuf_short_write

Passed

N/A

0.026137s

atf/tools/parser_test

0.805058s

headers_1

Passed

N/A

0.044959s

headers_10

Passed

N/A

0.040107s

headers_11

Passed

N/A

0.039855s

headers_12

Passed

N/A

0.042863s

headers_2

Passed

N/A

0.040973s

headers_3

Passed

N/A

0.040655s

headers_4

Passed

N/A

0.041007s

headers_5

Passed

N/A

0.040149s

headers_6

Passed

N/A

0.040003s

headers_7

Passed

N/A

0.040125s

headers_8

Passed

N/A

0.040806s

headers_9

Passed

N/A

0.040536s

parse_error_to_string

Passed

N/A

0.026022s

parse_errors_what

Passed

N/A

0.025874s

token_getters

Passed

N/A

0.025576s

tokenizer_delims_nows

Passed

N/A

0.026375s

tokenizer_delims_ws

Passed

N/A

0.026391s

tokenizer_keywords_nows

Passed

N/A

0.038188s

tokenizer_keywords_ws

Passed

N/A

0.025098s

tokenizer_minimal_nows

Passed

N/A

0.024941s

tokenizer_minimal_ws

Passed

N/A

0.025252s

tokenizer_quotes_nows

Passed

N/A

0.026441s

tokenizer_quotes_ws

Passed

N/A

0.025749s

atf/tools/process_test

0.276663s

argv_array_assign

Passed

N/A

0.026517s

argv_array_copy

Passed

N/A

0.024712s

argv_array_exec_argv

Passed

N/A

0.024671s

argv_array_init_carray

Passed

N/A

0.025004s

argv_array_init_col

Passed

N/A

0.025758s

argv_array_init_empty

Passed

N/A

0.023628s

argv_array_init_varargs

Passed

N/A

0.024897s

argv_array_iter

Passed

N/A

0.025881s

exec_failure

Passed

N/A

0.036958s

exec_success

Passed

N/A

0.031132s

atf/tools/reader_test

0.849737s

tps_1

Passed

N/A

0.026770s

tps_2

Passed

N/A

0.024466s

tps_3

Passed

N/A

0.026231s

tps_4

Passed

N/A

0.027068s

tps_5

Passed

N/A

0.024617s

tps_50

Passed

N/A

0.039186s

tps_51

Passed

N/A

0.038865s

tps_52

Passed

N/A

0.038055s

tps_53

Passed

N/A

0.040544s

tps_54

Passed

N/A

0.043590s

tps_55

Passed

N/A

0.043503s

tps_56

Passed

N/A

0.041616s

tps_57

Passed

N/A

0.039707s

tps_58

Passed

N/A

0.040412s

tps_59

Passed

N/A

0.040139s

tps_6

Passed

N/A

0.027217s

tps_60

Passed

N/A

0.038739s

tps_61

Passed

N/A

0.038490s

tps_62

Passed

N/A

0.038574s

tps_63

Passed

N/A

0.040151s

tps_64

Passed

N/A

0.039940s

tps_65

Passed

N/A

0.039930s

tps_66

Passed

N/A

0.038585s

atf/tools/requirements_test

0.946945s

require_arch_many_fail

Passed

N/A

0.025314s

require_arch_many_ok

Passed

N/A

0.026365s

require_arch_one_fail

Passed

N/A

0.026354s

require_arch_one_ok

Passed

N/A

0.023753s

require_config_many_fail

Passed

N/A

0.025375s

require_config_many_ok

Passed

N/A

0.025438s

require_config_one_fail

Passed

N/A

0.026352s

require_config_one_ok

Passed

N/A

0.024051s

require_files_many_fail

Passed

N/A

0.040300s

require_files_many_missing

Passed

N/A

0.040437s

require_files_many_ok

Passed

N/A

0.025070s

require_files_one_fail

Passed

N/A

0.040908s

require_files_one_missing

Passed

N/A

0.038050s

require_files_one_ok

Passed

N/A

0.024269s

require_machine_many_fail

Passed

N/A

0.025949s

require_machine_many_ok

Passed

N/A

0.024852s

require_machine_one_fail

Passed

N/A

0.024403s

require_machine_one_ok

Passed

N/A

0.026467s

require_memory_fail

Passed

N/A

0.039716s

require_memory_not_enough

Passed

N/A

0.025652s

require_memory_ok

Passed

N/A

0.024011s

require_progs_many_fail

Passed

N/A

0.038128s

require_progs_many_missing

Passed

N/A

0.039876s

require_progs_many_ok

Passed

N/A

0.038046s

require_progs_one_fail

Passed

N/A

0.040244s

require_progs_one_missing

Passed

N/A

0.039566s

require_progs_one_ok

Passed

N/A

0.037853s

require_user_fail

Passed

N/A

0.038080s

require_user_root

Passed

N/A

0.023877s

require_user_unprivileged

Passed

N/A

0.026876s

atf/tools/signals_test

0.158373s

reset

Passed

N/A

0.028932s

signal_holder_destructor

Passed

N/A

0.023514s

signal_holder_preserve

Passed

N/A

0.025446s

signal_holder_process

Passed

N/A

0.025177s

signal_programmer_preserve

Passed

N/A

0.024267s

signal_programmer_program

Passed

N/A

0.025985s

atf/tools/test_program_test

1.411096s

atf_tps_writer

Passed

N/A

0.104701s

get_metadata_bad

Passed

N/A

0.065220s

get_metadata_several_tcs

Passed

N/A

0.046073s

get_metadata_zero_tcs

Passed

N/A

0.058370s

parse_test_case_result_expected_death

Passed

N/A

0.040176s

parse_test_case_result_expected_exit

Passed

N/A

0.041845s

parse_test_case_result_expected_failure

Passed

N/A

0.040753s

parse_test_case_result_expected_signal

Passed

N/A

0.040351s

parse_test_case_result_expected_timeout

Passed

N/A

0.041499s

parse_test_case_result_failed

Passed

N/A

0.041535s

parse_test_case_result_passed

Passed

N/A

0.041334s

parse_test_case_result_skipped

Passed

N/A

0.041858s

parse_test_case_result_unknown

Passed

N/A

0.042454s

read_test_case_result_empty_file

Passed

N/A

0.040279s

read_test_case_result_failed

Passed

N/A

0.024662s

read_test_case_result_invalid

Passed

N/A

0.040828s

read_test_case_result_multiline

Passed

N/A

0.024735s

read_test_case_result_no_file

Passed

N/A

0.037714s

read_test_case_result_skipped

Passed

N/A

0.026342s

tp_1

Passed

N/A

0.028077s

tp_2

Passed

N/A

0.027319s

tp_3

Passed

N/A

0.027584s

tp_4

Passed

N/A

0.025514s

tp_50

Passed

N/A

0.040771s

tp_51

Passed

N/A

0.040975s

tp_52

Passed

N/A

0.027298s

tp_53

Passed

N/A

0.041491s

tp_54

Passed

N/A

0.039945s

tp_55

Passed

N/A

0.040569s

tp_56

Passed

N/A

0.040795s

tp_57

Passed

N/A

0.040682s

tp_58

Passed

N/A

0.041058s

tp_59

Passed

N/A

0.041789s

tp_60

Passed

N/A

0.041494s

atf/tools/text_test

0.312299s

duplicate

Passed

N/A

0.023551s

join

Passed

N/A

0.025372s

match

Passed

N/A

0.039960s

split

Passed

N/A

0.029027s

split_delims

Passed

N/A

0.023315s

to_bool

Passed

N/A

0.038124s

to_bytes

Passed

N/A

0.037926s

to_string

Passed

N/A

0.025042s

to_type

Passed

N/A

0.038947s

trim

Passed

N/A

0.024323s

atf/tools/ui_test

0.159423s

paragraphs

Passed

N/A

0.031570s

w_tag_col

Passed

N/A

0.024157s

w_tag_no_repeat

Passed

N/A

0.023927s

w_tag_repeat

Passed

N/A

0.025574s

wo_tag

Passed

N/A

0.026422s

wo_tag_col

Passed

N/A

0.023824s

atf/tools/user_test

0.095039s

euid

Passed

N/A

0.024089s

is_member_of_group

Passed

N/A

0.023078s

is_root

Passed

N/A

0.022708s

is_unprivileged

Passed

N/A

0.022840s

atf/tools/atf-config_test

12.085312s

list_all

Passed

N/A

0.643125s

override_env

Passed

N/A

5.352875s

query_mixture

Passed

N/A

1.602700s

query_multiple

Passed

N/A

0.175403s

query_one

Passed

N/A

1.319172s

query_one_terse

Passed

N/A

2.840853s

query_unknown

Passed

N/A

0.145483s

atf/tools/atf-report_test

6.687860s

default

Passed

N/A

0.628840s

expect

Passed

N/A

2.673657s

oflag

Passed

N/A

1.157944s

output_csv

Passed

N/A

0.568801s

output_ticker

Passed

N/A

0.571575s

output_xml

Passed

N/A

0.544361s

output_xml_space

Passed

N/A

0.371112s

too_many_args

Passed

N/A

0.153181s

atf/tools/atf-run_test

62.573127s

atffile

Passed

N/A

2.760415s

atffile_recursive

Passed

N/A

1.446884s

broken_results

Passed

N/A

0.838979s

broken_tp_list

Passed

N/A

0.747654s

cleanup_curdir

Passed

N/A

0.811702s

cleanup_fail

Passed

N/A

0.811133s

cleanup_mount

Passed

N/A

1.128735s

cleanup_pass

Passed

N/A

0.805109s

cleanup_signal

Passed

N/A

0.112686s

cleanup_skip

Passed

N/A

0.798135s

cleanup_symlink

Passed

N/A

1.180489s

config

Passed

N/A

2.821732s

exit_codes

Passed

N/A

0.824447s

expect

Passed

N/A

1.951450s

fds

Passed

N/A

0.768162s

hooks

Passed

N/A

2.449309s

ignore_deprecated_use_fs

Passed

N/A

0.775478s

isolation_env

Passed

N/A

1.349272s

isolation_home

Passed

N/A

0.774795s

isolation_stdin

Passed

N/A

0.793787s

isolation_umask

Passed

N/A

0.781057s

missing_results

Passed

N/A

0.821742s

mux_streams

Passed

N/A

6.513391s

no_warnings

Passed

N/A

0.767292s

require_arch

Passed

N/A

5.930978s

require_config

Passed

N/A

2.005984s

require_files

Passed

N/A

3.302561s

require_machine

Passed

N/A

5.915215s

require_progs

Passed

N/A

3.247457s

require_user_bad

Passed

N/A

0.738656s

require_user_root

Passed

N/A

0.792781s

require_user_unprivileged

Passed

N/A

0.742020s

signaled

Passed

N/A

0.904724s

timeout

Passed

N/A

1.767198s

timeout_forkexit

Passed

N/A

0.785109s

vflag

Passed

N/A

2.788347s

zero_tcs

Passed

N/A

0.764898s

Failed test cases summary

Test case

Result

Reason

Duration

bin/ps/t_ps

3.042039s

override_heading_some_null

Failed

heading [-o holdcnt -o holdcnt -o holdcnt]: expected [^HOLDCNT HOLDCNT HOLDCNT$], got [ HOLDCNT HOLDCNT HOLDCNT]

0.328667s

dev/audio/t_pad

0.510280s

pad_output

Failed

atf-check failed; see the output of the test for details

0.509262s

kernel/t_ptrace_wait

0.976334s

fpregs2

Failed

/usr/src/tests/kernel/t_ptrace_wait.c:3894: ptrace(PT_SETFPREGS, child, &r, 0) != -1 not met

0.019163s

kernel/t_ptrace_wait3

0.979410s

fpregs2

Failed

/usr/src/tests/kernel/t_ptrace_wait.c:3894: ptrace(PT_SETFPREGS, child, &r, 0) != -1 not met

0.020026s

kernel/t_ptrace_wait4

1.252874s

fork1

Failed

/usr/src/tests/kernel/t_ptrace_wait.h:295: Reported exited process

0.022405s

fpregs2

Failed

/usr/src/tests/kernel/t_ptrace_wait.c:3894: ptrace(PT_SETFPREGS, child, &r, 0) != -1 not met

0.021609s

kernel/t_ptrace_wait6

1.228445s

fork1

Failed

/usr/src/tests/kernel/t_ptrace_wait.h:295: Reported exited process

0.021926s

fpregs2

Failed

/usr/src/tests/kernel/t_ptrace_wait.c:3894: ptrace(PT_SETFPREGS, child, &r, 0) != -1 not met

0.021008s

kernel/t_ptrace_waitid

301.217720s

fork1

Failed

/usr/src/tests/kernel/t_ptrace_wait.c:1152: ptrace(PT_GET_PROCESS_STATE, child2, &state, slen) != -1 not met

0.022906s

fpregs2

Failed

/usr/src/tests/kernel/t_ptrace_wait.c:3894: ptrace(PT_SETFPREGS, child, &r, 0) != -1 not met

0.020432s

vfork1

Failed

Test case timed out after 300 seconds

300.006887s

kernel/t_ptrace_waitpid

1.208224s

fork1

Failed

/usr/src/tests/kernel/t_ptrace_wait.h:295: Reported exited process

0.022325s

fpregs2

Failed

/usr/src/tests/kernel/t_ptrace_wait.c:3894: ptrace(PT_SETFPREGS, child, &r, 0) != -1 not met

0.019857s

lib/libc/sys/t_mprotect

0.078317s

mprotect_pax

Failed

non-executable mapping made executable

0.013864s

lib/libpthread/t_mutex

53.124204s

mutex6

Failed

/usr/src/tests/lib/libpthread/t_mutex.c:524: start != 1

21.219681s

net/npf/t_npf

2.111180s

npf_table

Failed

atf-check failed; see the output of the test for details

0.369341s

sbin/gpt/t_gpt

4.483416s

migrate_disklabel

Failed

atf-check failed; see the output of the test for details

0.254026s

recover_backup

Failed

atf-check failed; see the output of the test for details

0.309564s

Expected failures summary

Test case

Result

Reason

Duration

include/t_errno

0.013095s

errno_constants

Expected failure

PR standards/44921: 2 checks failed as expected; see output for more details

0.012240s

include/t_netdb

0.013632s

netdb_constants

Expected failure

PR standards/44777: 2 checks failed as expected; see output for more details

0.012493s

kernel/t_ptrace_wait4

1.252874s

vfork1

Expected failure

PR kern/51630: /usr/src/tests/kernel/t_ptrace_wait.h:305: WSTOPSIG(status) != expected: Unexpected stop signal received [Child exited] != [Trace/BPT trap]

0.022861s

kernel/t_ptrace_wait6

1.228445s

vfork1

Expected failure

PR kern/51630: /usr/src/tests/kernel/t_ptrace_wait.h:305: WSTOPSIG(status) != expected: Unexpected stop signal received [Child exited] != [Trace/BPT trap]

0.021167s

kernel/t_ptrace_waitpid

1.208224s

vfork1

Expected failure

PR kern/51630: /usr/src/tests/kernel/t_ptrace_wait.h:305: WSTOPSIG(status) != expected: Unexpected stop signal received [Child exited] != [Trace/BPT trap]

0.019765s

lib/libc/c063/t_fexecve

0.019417s

fexecve

Expected failure

fexecve not implemented: /usr/src/tests/lib/libc/c063/t_fexecve.c:85: access("test", F_OK) == 0 not met

0.018392s

lib/libc/regex/t_regex_att

0.141474s

leftassoc

Expected failure

Reason for breakage unknown: /usr/src/tests/lib/libc/regex/t_regex_att.c:377: res != matches ((0,4)(0,2)(2,3)(3,4) != (0,4)(0,1)(1,4)(4,4)): at line 3

0.012634s

lib/libc/sys/t_getrusage

2.636802s

getrusage_utime_back

Expected failure

PR kern/30115: user time went backwards

2.595181s

getrusage_utime_zero

Expected failure

PR kern/30115: zero user time from getrusage(2)

0.014940s

lib/libtre/t_regex_att

0.217090s

rightassoc

Expected failure

Reason for breakage unknown: /usr/src/tests/lib/libtre/../libc/regex/t_regex_att.c:377: res != matches ((0,4)(0,1)(1,4)(4,4) != (0,4)(0,2)(2,3)(3,4)): at line 3

0.014476s

lib/libusbhid/t_usbhid

0.094900s

check_hid_get_data

Expected failure

only the 32-bit opcode works, 8 and 16-bit is broken: 4 checks failed as expected; see output for more details

0.013560s

check_hid_logical_range

Expected failure

only the 32-bit opcode works, 8 and 16-bit is broken: 4 checks failed as expected; see output for more details

0.013594s

check_hid_physical_range

Expected failure

only the 32-bit opcode works, 8 and 16-bit is broken: 4 checks failed as expected; see output for more details

0.013685s

lib/librumphijack/t_tcpip

4.473843s

ssh

Expected failure

PR lib/50174: atf-check failed; see the output of the test for details

1.452227s

net/if/t_compat

0.187326s

OOSIOCGIFBRDADDR

Expected failure

PR kern/51610: rump does not include COMPAT_43: /usr/src/tests/net/if/t_compat.c:72: rump_sys_ioctl(fd, ((((unsigned long)0x80000000|(unsigned long)0x40000000)) | (((sizeof(struct oifreq)) & 0x1fff) << 16) | ((('i')) << 8) | ((18))), &ifreq): Inappropriate ioctl for device

0.184503s

sbin/resize_ffs/t_shrink

38.886152s

shrink_24M_16M_v2_4096

Expected failure

PR bin/44205: atf-check failed; see the output of the test for details

11.191052s

sbin/resize_ffs/t_shrink_swapped

40.456461s

shrink_24M_16M_v2_16384

Expected failure

PR bin/44205: atf-check failed; see the output of the test for details

11.441811s

usr.bin/make/t_make

42.185699s

escape

Expected failure

see PR toolchain/49085: atf-check failed; see the output of the test for details

0.973596s

impsrc

Expected failure

see PR toolchain/49085: atf-check failed; see the output of the test for details

0.883031s

phony_end

Expected failure

see PR toolchain/49085: atf-check failed; see the output of the test for details

0.839211s

posix1

Expected failure

see PR toolchain/49085: atf-check failed; see the output of the test for details

1.400791s

suffixes

Expected failure

see PR toolchain/49085: this uses up all memory and then fails

0.532113s

usr.bin/sed/t_sed

1.323481s

emptybackref

Expected failure

PR bin/28126: atf-check failed; see the output of the test for details

0.193369s

usr.sbin/useradd/t_useradd

0.355424s

longname

Expected failure

PR bin/39546: atf-check failed; see the output of the test for details

0.354291s

fs/ffs/t_mount

0.452264s

48Kimage

Expected failure

PR kern/43573: mount failed: Invalid argument

0.128927s

fs/nfs/t_mountd

1.222981s

mountdhup

Expected failure

PR kern/5844: op failed with EACCES

1.217828s

fs/vfs/t_renamerace

116.288222s

msdosfs_renamerace

Expected failure

PR kern/43626: unmount failed: Device busy

5.336910s

msdosfs_renamerace_dirs

Expected signal

PR kern/43626

0.678204s

udf_renamerace

Expected failure

PR kern/49046: race did not trigger this time

5.322471s

fs/vfs/t_vfsops

27.889428s

lfs_tfhremove

Expected failure

fhopen() for removed file succeeds (PR kern/43745): /usr/src/tests/fs/vfs/t_vfsops.c:152: Expected true value in rump_sys_fhopen(fhp, fhsize, O_RDONLY) == -1

0.408732s

ipf/t_filter_exec

16.401201s

f26

Expected failure

Known to be broken: results differ

0.458104s

f27

Expected failure

Known to be broken: results differ

0.438390s

ipf/t_filter_parse

3.833542s

i17

Expected failure

Known to be broken: atf-check failed; see the output of the test for details

0.163771s

ipf/t_nat_exec

10.720862s

n8_6

Expected failure

See PR kern/47665: results differ

0.221801s

n9_6

Expected failure

See PR kern/47665: results differ

0.229360s

atf/atf-c/macros_test

1.315042s

detect_unused_tests

Expected failure

PR 49187: Build of unused_test.c passed; unused test cases are not properly detected

0.355669s

atf/atf-c++/macros_test

6.978083s

detect_unused_tests

Expected failure

PR 49187: Build of unused_test.cpp passed; unused test cases are not properly detected

2.339180s

Skipped test cases summary

Test case

Result

Reason

Duration

include/t_paths

0.012816s

paths

Skipped

PR port-sparc/45580

0.011960s

kernel/t_ptrace

0.069548s

attach_pid1_securelevel

Skipped

Test must be run with securelevel >= 1

0.012304s

lib/libc/gen/exect/t_exect

0.014119s

t_exect_null

Skipped

exect(3) misdesigned and hangs - PR port-amd64/51700

0.013290s

lib/libc/string/t_popcount

0.026654s

popcount_basic

Skipped

config variable "run_popcount" not set to YES/TRUE

0.012838s

popcountll_basic

Skipped

config variable "run_popcount" not set to YES/TRUE

0.012720s

lib/libc/sys/t_kevent

0.098323s

kqueue_desc_passing

Skipped

PR kern/46523

0.014202s

lib/libc/sys/t_mmap

0.182714s

mmap_block

Skipped

The test case causes a panic (PR kern/38889, kern/46592)

0.011638s

lib/libc/sys/t_mprotect

0.078317s

mprotect_exec

Skipped

Execute protection callback check not implemented

0.011443s

lib/librumphijack/t_tcpip

4.473843s

nfs_autoload

Skipped

test currently valid only on i386

0.233091s

sbin/gpt/t_gpt

4.483416s

bootable_2part

Skipped

Required file '/usr/mdec/gptmbr.bin' not found

0.000393s

fs/vfs/t_full

10.054008s

p2k_ffs_fillfs

Skipped

fs does not support explicit block allocation (GOP_ALLOC)

0.404052s

puffs_fillfs

Skipped

fs does not support explicit block allocation (GOP_ALLOC)

0.323522s

rumpfs_fillfs

Skipped

fs does not support explicit block allocation (GOP_ALLOC)

0.287247s

fs/vfs/t_renamerace

116.288222s

rumpfs_renamerace

Skipped

rename not supported by file system

0.291122s

rumpfs_renamerace_dirs

Skipped

rename not supported by file system

0.271261s

sysvbfs_renamerace

Skipped

filesystem has not enough inodes

0.309167s

sysvbfs_renamerace_dirs

Skipped

directories not supported by file system

0.309856s

fs/vfs/t_rmdirrace

125.127525s

sysvbfs_race

Skipped

directories not supported by file system

0.296921s

fs/vfs/t_union

9.645584s

ext2fs_basic

Skipped

fs does not support VOP_WHITEOUT

0.300680s

ext2fs_whiteout

Skipped

fs does not support VOP_WHITEOUT

0.347889s

msdosfs_basic

Skipped

fs does not support VOP_WHITEOUT

0.308889s

msdosfs_whiteout

Skipped

fs does not support VOP_WHITEOUT

0.326883s

nfs_basic

Skipped

fs does not support VOP_WHITEOUT

0.639736s

nfs_whiteout

Skipped

fs does not support VOP_WHITEOUT

0.656147s

p2k_ffs_basic

Skipped

fs does not support VOP_WHITEOUT

0.394618s

p2k_ffs_whiteout

Skipped

fs does not support VOP_WHITEOUT

0.425962s

puffs_basic

Skipped

fs does not support VOP_WHITEOUT

0.306251s

puffs_whiteout

Skipped

fs does not support VOP_WHITEOUT

0.337872s

sysvbfs_basic

Skipped

fs does not support VOP_WHITEOUT

0.311159s

sysvbfs_whiteout

Skipped

fs does not support VOP_WHITEOUT

0.338629s

udf_basic

Skipped

fs does not support VOP_WHITEOUT

0.312865s

udf_whiteout

Skipped

fs does not support VOP_WHITEOUT

0.359594s

v7fs_basic

Skipped

fs does not support VOP_WHITEOUT

0.328599s

v7fs_whiteout

Skipped

fs does not support VOP_WHITEOUT

0.370959s

fs/vfs/t_unpriv

19.288038s

msdosfs_owner

Skipped

owner not supported by file system

0.313746s

nfs_flags

Skipped

file flags not supported by file system

0.624023s

puffs_flags

Skipped

file flags not supported by file system

0.309777s

sysvbfs_dirperms

Skipped

directories not supported by file system

0.294163s

sysvbfs_flags

Skipped

file flags not supported by file system

0.298613s

udf_flags

Skipped

file flags not supported by file system

0.331879s

fs/vfs/t_vfsops

27.889428s

rumpfs_tfhinval

Skipped

file handles not supported

0.289845s

rumpfs_tfhremove

Skipped

file handles not supported

0.268478s

rumpfs_tfilehandle

Skipped

file handles not supported

0.291996s

sysvbfs_tfhinval

Skipped

file handles not supported

0.294720s

sysvbfs_tfhremove

Skipped

file handles not supported

0.305579s

sysvbfs_tfilehandle

Skipped

file handles not supported

0.304106s

udf_tfhinval

Skipped

file handles not supported

0.301456s

udf_tfhremove

Skipped

file handles not supported

0.329119s

udf_tfilehandle

Skipped

file handles not supported

0.326370s

v7fs_tfhinval

Skipped

file handles not supported

0.328585s

v7fs_tfhremove

Skipped

file handles not supported

0.325937s

v7fs_tfilehandle

Skipped

file handles not supported

0.326941s

fs/vfs/t_vnops

161.750975s

msdosfs_lstat_symlink

Skipped

symlinks not supported by file system

0.311453s

msdosfs_symlink_long

Skipped

symlinks not supported by file system

0.322188s

msdosfs_symlink_root

Skipped

symlinks not supported by file system

0.323592s

msdosfs_symlink_zerolen

Skipped

symlinks not supported by file system

0.324458s

rumpfs_rename_dir

Skipped

rename not supported by file system

0.316250s

rumpfs_rename_dotdot

Skipped

rename not supported by file system

0.314679s

rumpfs_rename_nametoolong

Skipped

rename not supported by file system

0.292665s

rumpfs_rename_reg_nodir

Skipped

rename not supported by file system

0.302476s

sysvbfs_dir_notempty

Skipped

directories not supported by file system

0.312755s

sysvbfs_dir_rmdirdotdot

Skipped

directories not supported by file system

0.321378s

sysvbfs_dir_simple

Skipped

directories not supported by file system

0.335934s

sysvbfs_lookup_complex

Skipped

directories not supported by file system

0.320620s

sysvbfs_lstat_symlink

Skipped

symlinks not supported by file system

0.313708s

sysvbfs_rename_dir

Skipped

directories not supported by file system

0.312634s

sysvbfs_rename_dotdot

Skipped

directories not supported by file system

0.311328s

sysvbfs_symlink_long

Skipped

symlinks not supported by file system

0.319257s

sysvbfs_symlink_root

Skipped

symlinks not supported by file system

0.337830s

sysvbfs_symlink_zerolen

Skipped

symlinks not supported by file system

0.344640s

fs/cd9660/t_high_ino_big_file

0.309743s

pr_kern_48787

Skipped

not enough free disk space, have 1048344 Kbytes, need ~ 4500000 Kbytes

0.308855s

rump/rumpkern/t_kern

0.561404s

lockme_DOUBLEINIT

Skipped

test requires LOCKDEBUG kernel

0.020682s

lockme_MEMFREE

Skipped

test requires LOCKDEBUG kernel

0.019410s

lockme_RWRX

Skipped

test requires LOCKDEBUG kernel

0.020942s

rump/modautoload/t_modautoload

0.024431s

modautoload

Skipped

host kernel modules not supported

0.023574s

crypto/libcrypto/t_ciphers

4.250887s

rc5

Skipped

RC5 support not available; system built with MKCRYPTO_RC5=no

0.103640s

crypto/opencrypto/t_opencrypto

5.326300s

arc4

Skipped

ARC4 not implemented by swcrypto

0.268003s

share/examples/t_asm

0.374568s

hello

Skipped

Example program not implemented on this platform

0.373983s

atf/atf-c/pkg_config_test

0.003529s

build

Skipped

Required program 'pkg-config' not found in the PATH

0.001691s

version

Skipped

Required program 'pkg-config' not found in the PATH

0.001747s

atf/atf-c++/pkg_config_test

0.002953s

build

Skipped

Required program 'pkg-config' not found in the PATH

0.001333s

version

Skipped

Required program 'pkg-config' not found in the PATH

0.001533s

Execution details

Environment variables

Test case: bin/ps/t_ps/override_heading_some_null

Duration: 0.328667 seconds

Termination reason

FAILED: heading [-o holdcnt -o holdcnt -o holdcnt]: expected [^HOLDCNT HOLDCNT HOLDCNT$], got [ HOLDCNT HOLDCNT HOLDCNT]

Test case: dev/audio/t_pad/pad_output

Duration: 0.509262 seconds

Termination reason

FAILED: atf-check failed; see the output of the test for details

Standard output stream

Executing command [ uudecode /usr/tests/dev/audio/t_pad_output.bz2.uue ]
Executing command [ bunzip2 t_pad_output.bz2 ]
Executing command [ /usr/tests/dev/audio/h_pad ]

Standard error stream

Fail: stdout does not match golden output
Binary files t_pad_output and /tmp/check.yv4fyr/stdout differ
Error while running diff(3)

Test case: include/t_errno/errno_constants

Duration: 0.012240 seconds

Termination reason

XFAIL: PR standards/44921: 2 checks failed as expected; see output for more details

Standard error stream

*** Expected check failure: PR standards/44921: ENOTRECOVERABLE not defined
*** Expected check failure: PR standards/44921: EOWNERDEAD not defined

Test case: include/t_netdb/netdb_constants

Duration: 0.012493 seconds

Termination reason

XFAIL: PR standards/44777: 2 checks failed as expected; see output for more details

Standard error stream

*** Expected check failure: PR standards/44777: AI_V4MAPPED not defined
*** Expected check failure: PR standards/44777: AI_ALL not defined

Test case: include/t_paths/paths

Duration: 0.011960 seconds

Termination reason

SKIPPED: PR port-sparc/45580

Test case: kernel/t_ptrace/attach_pid1_securelevel

Duration: 0.012304 seconds

Termination reason

SKIPPED: Test must be run with securelevel >= 1

Test case: kernel/t_ptrace_wait/fpregs2

Duration: 0.019163 seconds

Termination reason

FAILED: /usr/src/tests/kernel/t_ptrace_wait.c:3894: ptrace(PT_SETFPREGS, child, &r, 0) != -1 not met

Standard output stream

Before forking process PID=11017
Parent process PID=11017, child's PID=20690
Before calling wait() for the child
Before calling PT_TRACE_ME from child 20690
Before raising Stopped (signal) from child
Call GETFPREGS for the child process
Call SETFPREGS for the child (without changed regs)

Test case: kernel/t_ptrace_wait3/fpregs2

Duration: 0.020026 seconds

Termination reason

FAILED: /usr/src/tests/kernel/t_ptrace_wait.c:3894: ptrace(PT_SETFPREGS, child, &r, 0) != -1 not met

Standard output stream

Before forking process PID=11446
Parent process PID=11446, child's PID=22027
Before calling wait3() for the child
Before calling PT_TRACE_ME from child 22027
Before raising Stopped (signal) from child
Call GETFPREGS for the child process
Call SETFPREGS for the child (without changed regs)

Test case: kernel/t_ptrace_wait4/fork1

Duration: 0.022405 seconds

Termination reason

FAILED: /usr/src/tests/kernel/t_ptrace_wait.h:295: Reported exited process

Standard output stream

Before forking process PID=21421
Parent process PID=21421, child's PID=23854
Before calling wait4() for the child
Before calling PT_TRACE_ME from child 23854
Before raising Stopped (signal) from child
Enable PTRACE_FORK in EVENT_MASK for the child 23854
Before resuming the child process where it left off and without signal to be sent
Before calling wait4() for the child 23854
Reported PTRACE_FORK event with forkee 21066
Before calling wait4() for the forkee 21066 of the child 23854

Test case: kernel/t_ptrace_wait4/fpregs2

Duration: 0.021609 seconds

Termination reason

FAILED: /usr/src/tests/kernel/t_ptrace_wait.c:3894: ptrace(PT_SETFPREGS, child, &r, 0) != -1 not met

Standard output stream

Before forking process PID=11337
Parent process PID=11337, child's PID=10908
Before calling wait4() for the child
Before calling PT_TRACE_ME from child 10908
Before raising Stopped (signal) from child
Call GETFPREGS for the child process
Call SETFPREGS for the child (without changed regs)

Test case: kernel/t_ptrace_wait4/vfork1

Duration: 0.022861 seconds

Termination reason

XFAIL: PR kern/51630: /usr/src/tests/kernel/t_ptrace_wait.h:305: WSTOPSIG(status) != expected: Unexpected stop signal received [Child exited] != [Trace/BPT trap]

Standard output stream

Before forking process PID=23982
Parent process PID=23982, child's PID=11450
Before calling wait4() for the child
Before calling PT_TRACE_ME from child 11450
Before raising Stopped (signal) from child
Enable PTRACE_VFORK in EVENT_MASK for the child 11450
Before resuming the child process where it left off and without signal to be sent
Before calling wait4() for the child 11450

Test case: kernel/t_ptrace_wait6/fork1

Duration: 0.021926 seconds

Termination reason

FAILED: /usr/src/tests/kernel/t_ptrace_wait.h:295: Reported exited process

Standard output stream

Before forking process PID=11295
Parent process PID=11295, child's PID=23074
Before calling wait6() for the child
Before calling PT_TRACE_ME from child 23074
Before raising Stopped (signal) from child
Enable PTRACE_FORK in EVENT_MASK for the child 23074
Before resuming the child process where it left off and without signal to be sent
Before calling wait6() for the child 23074
Reported PTRACE_FORK event with forkee 11855
Before calling wait6() for the forkee 11855 of the child 23074

Test case: kernel/t_ptrace_wait6/fpregs2

Duration: 0.021008 seconds

Termination reason

FAILED: /usr/src/tests/kernel/t_ptrace_wait.c:3894: ptrace(PT_SETFPREGS, child, &r, 0) != -1 not met

Standard output stream

Before forking process PID=21258
Parent process PID=21258, child's PID=21613
Before calling wait6() for the child
Before calling PT_TRACE_ME from child 21613
Before raising Stopped (signal) from child
Call GETFPREGS for the child process
Call SETFPREGS for the child (without changed regs)

Test case: kernel/t_ptrace_wait6/vfork1

Duration: 0.021167 seconds

Termination reason

XFAIL: PR kern/51630: /usr/src/tests/kernel/t_ptrace_wait.h:305: WSTOPSIG(status) != expected: Unexpected stop signal received [Child exited] != [Trace/BPT trap]

Standard output stream

Before forking process PID=23202
Parent process PID=23202, child's PID=18907
Before calling wait6() for the child
Before calling PT_TRACE_ME from child 18907
Before raising Stopped (signal) from child
Enable PTRACE_VFORK in EVENT_MASK for the child 18907
Before resuming the child process where it left off and without signal to be sent
Before calling wait6() for the child 18907

Test case: kernel/t_ptrace_waitid/fork1

Duration: 0.022906 seconds

Termination reason

FAILED: /usr/src/tests/kernel/t_ptrace_wait.c:1152: ptrace(PT_GET_PROCESS_STATE, child2, &state, slen) != -1 not met

Standard output stream

Before forking process PID=21354
Before calling PT_TRACE_ME from child 24014
Parent process PID=21354, child's PID=24014
Before raising Stopped (signal) from child
Before calling waitid() for the child
Enable PTRACE_FORK in EVENT_MASK for the child 24014
Before resuming the child process where it left off and without signal to be sent
Before calling waitid() for the child 24014
Reported PTRACE_FORK event with forkee 11361
Before calling waitid() for the forkee 11361 of the child 24014

Test case: kernel/t_ptrace_waitid/fpregs2

Duration: 0.020432 seconds

Termination reason

FAILED: /usr/src/tests/kernel/t_ptrace_wait.c:3894: ptrace(PT_SETFPREGS, child, &r, 0) != -1 not met

Standard output stream

Before forking process PID=12047
Parent process PID=12047, child's PID=11487
Before calling waitid() for the child
Before calling PT_TRACE_ME from child 11487
Before raising Stopped (signal) from child
Call GETFPREGS for the child process
Call SETFPREGS for the child (without changed regs)

Test case: kernel/t_ptrace_waitid/vfork1

Duration: 300.006887 seconds

Termination reason

FAILED: Test case timed out after 300 seconds

Standard output stream

Before forking process PID=24142
Parent process PID=24142, child's PID=11788
Before calling waitid() for the child
Before calling PT_TRACE_ME from child 11788
Before raising Stopped (signal) from child
Enable PTRACE_VFORK in EVENT_MASK for the child 11788
Before resuming the child process where it left off and without signal to be sent
Before calling waitid() for the child 11788
Reported PTRACE_VFORK event with forkee 0
Before calling waitid() for the forkee 0 of the child 11788

Test case: kernel/t_ptrace_waitpid/fork1

Duration: 0.022325 seconds

Termination reason

FAILED: /usr/src/tests/kernel/t_ptrace_wait.h:295: Reported exited process

Standard output stream

Before forking process PID=11553
Parent process PID=11553, child's PID=21546
Before calling waitpid() for the child
Before calling PT_TRACE_ME from child 21546
Before raising Stopped (signal) from child
Enable PTRACE_FORK in EVENT_MASK for the child 21546
Before resuming the child process where it left off and without signal to be sent
Before calling waitpid() for the child 21546
Reported PTRACE_FORK event with forkee 4180
Before calling waitpid() for the forkee 4180 of the child 21546

Test case: kernel/t_ptrace_waitpid/fpregs2

Duration: 0.019857 seconds

Termination reason