ATF Tests Results

Execution summary

Item

Value

ATF

Version

Automated Testing Framework 0.20 (atf-0.20)

Timings

Start time of tests

Wed Dec 7 17:11:31 CET 2016

End time of tests

Wed Dec 7 17:33:54 CET 2016

System information

Host name

thirdstage.duskware.de

Operating system

NetBSD

Operating system release

7.99.43

Operating system version

NetBSD 7.99.43 (MODULAR) #576: Wed Dec 7 16:06:52 CET 2016 martin@thirdstage.duskware.de:/usr/src/sys/arch/sparc64/compile/MODULAR

Platform

sparc64

Tests results

Root

/usr/tests

Test programs

674

Bogus test programs

0

Test cases

4780

Passed test cases

4644

Failed test cases

16

Expected failures

39

Skipped test cases

81

See more execution details

Test cases summary

Test case

Result

Reason

Duration

bin/cat/t_cat

0.477332s

align

Passed

N/A

0.209789s

nonexistent

Passed

N/A

0.131942s

se_output

Passed

N/A

0.133763s

bin/cp/t_cp

2.503175s

dir_to_dir

Passed

N/A

0.497013s

dir_to_file

Passed

N/A

0.167420s

file_over_link

Passed

N/A

0.158031s

file_to_file

Passed

N/A

0.590763s

file_to_link

Passed

N/A

0.147507s

file_to_linkdir

Passed

N/A

0.204815s

files_to_dir

Passed

N/A

0.174331s

link_over_file

Passed

N/A

0.165109s

link_to_file

Passed

N/A

0.184151s

linkdir_to_file

Passed

N/A

0.194048s

bin/dd/t_dd

0.996422s

io

Passed

N/A

0.499188s

length

Passed

N/A

0.193950s

seek

Passed

N/A

0.300625s

bin/df/t_df

0.309050s

hflag

Passed

N/A

0.158051s

normal

Passed

N/A

0.149229s

bin/expr/t_expr

2.073384s

arithmetic_ops

Passed

N/A

0.153472s

basic_functional

Passed

N/A

0.131497s

basic_math

Passed

N/A

0.110347s

colon_vs_math

Passed

N/A

0.119725s

compare_ops

Passed

N/A

0.240290s

compare_ops_precedence

Passed

N/A

0.108442s

gtkmm

Passed

N/A

0.163335s

lang

Passed

N/A

0.206594s

math_precedence

Passed

N/A

0.113430s

multiply

Passed

N/A

0.123060s

negative

Passed

N/A

0.149935s

overflow

Passed

N/A

0.231844s

precedence

Passed

N/A

0.109817s

regex

Passed

N/A

0.103140s

bin/pax/t_pax

0.280914s

append

Passed

N/A

0.279703s

bin/ps/t_ps

3.050292s

default_columns

Passed

N/A

0.873612s

duplicate_column

Passed

N/A

0.231141s

minus_O

Passed

N/A

0.305384s

minus_o

Passed

N/A

0.365770s

override_heading_all_null

Passed

N/A

0.272964s

override_heading_embedded_specials

Passed

N/A

0.319165s

override_heading_simple

Passed

N/A

0.316697s

override_heading_some_null

Failed

heading [-o holdcnt -o holdcnt -o holdcnt]: expected [^HOLDCNT HOLDCNT HOLDCNT$], got [ HOLDCNT HOLDCNT HOLDCNT]

0.359592s

bin/sh/dotcmd/t_dotcmd

38.393259s

case_break_case

Passed

N/A

0.212723s

case_break_compound

Passed

N/A

0.194096s

case_break_file

Passed

N/A

0.188232s

case_break_for

Passed

N/A

0.192677s

case_break_func

Passed

N/A

0.188388s

case_break_subshell

Passed

N/A

0.201597s

case_break_until

Passed

N/A

0.198051s

case_break_while

Passed

N/A

0.197094s

case_continue_case

Passed

N/A

0.197836s

case_continue_compound

Passed

N/A

0.198549s

case_continue_file

Passed

N/A

0.196919s

case_continue_for

Passed

N/A

0.198918s

case_continue_func

Passed

N/A

0.202761s

case_continue_subshell

Passed

N/A

0.201164s

case_continue_until

Passed

N/A

0.201191s

case_continue_while

Passed

N/A

0.197098s

case_return_case

Passed

N/A

0.204454s

case_return_compound

Passed

N/A

0.196608s

case_return_file

Passed

N/A

0.201255s

case_return_for

Passed

N/A

0.196465s

case_return_func

Passed

N/A

0.196325s

case_return_subshell

Passed

N/A

0.215824s

case_return_until

Passed

N/A

0.199183s

case_return_while

Passed

N/A

0.196578s

compound_break_case

Passed

N/A

0.188471s

compound_break_compound

Passed

N/A

0.191619s

compound_break_file

Passed

N/A

0.203423s

compound_break_for

Passed

N/A

0.191097s

compound_break_func

Passed

N/A

0.189356s

compound_break_subshell

Passed

N/A

0.192513s

compound_break_until

Passed

N/A

0.198697s

compound_break_while

Passed

N/A

0.195053s

compound_continue_case

Passed

N/A

0.188940s

compound_continue_compound

Passed

N/A

0.189048s

compound_continue_file

Passed

N/A

0.189435s

compound_continue_for

Passed

N/A

0.189275s

compound_continue_func

Passed

N/A

0.191416s

compound_continue_subshell

Passed

N/A

0.192023s

compound_continue_until

Passed

N/A

0.202450s

compound_continue_while

Passed

N/A

0.195889s

compound_return_case

Passed

N/A

0.187531s

compound_return_compound

Passed

N/A

0.209950s

compound_return_file

Passed

N/A

0.188421s

compound_return_for

Passed

N/A

0.188912s

compound_return_func

Passed

N/A

0.189333s

compound_return_subshell

Passed

N/A

0.192559s

compound_return_until

Passed

N/A

0.198695s

compound_return_while

Passed

N/A

0.210941s

file_break_case

Passed

N/A

0.191042s

file_break_compound

Passed

N/A

0.196667s

file_break_file

Passed

N/A

0.200164s

file_break_for

Passed

N/A

0.186217s

file_break_func

Passed

N/A

0.195001s

file_break_subshell

Passed

N/A

0.194838s

file_break_until

Passed

N/A

0.196092s

file_break_while

Passed

N/A

0.199850s

file_continue_case

Passed

N/A

0.200473s

file_continue_compound

Passed

N/A

0.197025s

file_continue_file

Passed

N/A

0.197297s

file_continue_for

Passed

N/A

0.201935s

file_continue_func

Passed

N/A

0.196325s

file_continue_subshell

Passed

N/A

0.204497s

file_continue_until

Passed

N/A

0.194081s

file_continue_while

Passed

N/A

0.199726s

file_return_case

Passed

N/A

0.206317s

file_return_compound

Passed

N/A

0.196024s

file_return_file

Passed

N/A

0.193470s

file_return_for

Passed

N/A

0.195503s

file_return_func

Passed

N/A

0.190770s

file_return_subshell

Passed

N/A

0.192363s

file_return_until

Passed

N/A

0.191689s

file_return_while

Passed

N/A

0.188584s

for_break_case

Passed

N/A

0.190723s

for_break_compound

Passed

N/A

0.187962s

for_break_file

Passed

N/A

0.188219s

for_break_for

Passed

N/A

0.188763s

for_break_func

Passed

N/A

0.192701s

for_break_subshell

Passed

N/A

0.200178s

for_break_until

Passed

N/A

0.193009s

for_break_while

Passed

N/A

0.199335s

for_continue_case

Passed

N/A

0.188668s

for_continue_compound

Passed

N/A

0.191169s

for_continue_file

Passed

N/A

0.197923s

for_continue_for

Passed

N/A

0.196966s

for_continue_func

Passed

N/A

0.195004s

for_continue_subshell

Passed

N/A

0.203054s

for_continue_until

Passed

N/A

0.200881s

for_continue_while

Passed

N/A

0.201821s

for_return_case

Passed

N/A

0.187455s

for_return_compound

Passed

N/A

0.189528s

for_return_file

Passed

N/A

0.188843s

for_return_for

Passed

N/A

0.194782s

for_return_func

Passed

N/A

0.188932s

for_return_subshell

Passed

N/A

0.207011s

for_return_until

Passed

N/A

0.186859s

for_return_while

Passed

N/A

0.188921s

func_break_case

Passed

N/A

0.189114s

func_break_compound

Passed

N/A

0.192036s

func_break_file

Passed

N/A

0.254430s

func_break_for

Passed

N/A

0.206549s

func_break_func

Passed

N/A

0.188908s

func_break_subshell

Passed

N/A

0.196898s

func_break_until

Passed

N/A

0.189914s

func_break_while

Passed

N/A

0.189904s

func_continue_case

Passed

N/A

0.188766s

func_continue_compound

Passed

N/A

0.188793s

func_continue_file

Passed

N/A

0.197407s

func_continue_for

Passed

N/A

0.194974s

func_continue_func

Passed

N/A

0.197023s

func_continue_subshell

Passed

N/A

0.200398s

func_continue_until

Passed

N/A

0.198193s

func_continue_while

Passed

N/A

0.213534s

func_return_case

Passed

N/A

0.198200s

func_return_compound

Passed

N/A

0.201473s

func_return_file

Passed

N/A

0.197259s

func_return_for

Passed

N/A

0.206413s

func_return_func

Passed

N/A

0.204210s

func_return_subshell

Passed

N/A

0.208193s

func_return_until

Passed

N/A

0.204402s

func_return_while

Passed

N/A

0.188787s

subshell_break_case

Passed

N/A

0.203934s

subshell_break_compound

Passed

N/A

0.202491s

subshell_break_file

Passed

N/A

0.196862s

subshell_break_for

Passed

N/A

0.198141s

subshell_break_func

Passed

N/A

0.208320s

subshell_break_subshell

Passed

N/A

0.203474s

subshell_break_until

Passed

N/A

0.206485s

subshell_break_while

Passed

N/A

0.201152s

subshell_continue_case

Passed

N/A

0.200972s

subshell_continue_compound

Passed

N/A

0.203011s

subshell_continue_file

Passed

N/A

0.201661s

subshell_continue_for

Passed

N/A

0.204235s

subshell_continue_func

Passed

N/A

0.199545s

subshell_continue_subshell

Passed

N/A

0.208438s

subshell_continue_until

Passed

N/A

0.199153s

subshell_continue_while

Passed

N/A

0.201073s

subshell_return_case

Passed

N/A

0.202455s

subshell_return_compound

Passed

N/A

0.202584s

subshell_return_file

Passed

N/A

0.200045s

subshell_return_for

Passed

N/A

0.203746s

subshell_return_func

Passed

N/A

0.199311s

subshell_return_subshell

Passed

N/A

0.204340s

subshell_return_until

Passed

N/A

0.202509s

subshell_return_while

Passed

N/A

0.204791s

until_break_case

Passed

N/A

0.201847s

until_break_compound

Passed

N/A

0.198792s

until_break_file

Passed

N/A

0.198714s

until_break_for

Passed

N/A

0.199353s

until_break_func

Passed

N/A

0.415751s

until_break_subshell

Passed

N/A

0.215486s

until_break_until

Passed

N/A

0.205843s

until_break_while

Passed

N/A

0.197676s

until_continue_case

Passed

N/A

0.199736s

until_continue_compound

Passed

N/A

0.202047s

until_continue_file

Passed

N/A

0.211371s

until_continue_for

Passed

N/A

0.200053s

until_continue_func

Passed

N/A

0.203326s

until_continue_subshell

Passed

N/A

0.204556s

until_continue_until

Passed

N/A

0.198485s

until_continue_while

Passed

N/A

0.198634s

until_return_case

Passed

N/A

0.199512s

until_return_compound

Passed

N/A

0.198329s

until_return_file

Passed

N/A

0.202723s

until_return_for

Passed

N/A

0.200720s

until_return_func

Passed

N/A

0.204193s

until_return_subshell

Passed

N/A

0.202562s

until_return_until

Passed

N/A

0.199785s

until_return_while

Passed

N/A

0.197421s

while_break_case

Passed

N/A

0.203688s

while_break_compound

Passed

N/A

0.199777s

while_break_file

Passed

N/A

0.190495s

while_break_for

Passed

N/A

0.194484s

while_break_func

Passed

N/A

0.190475s

while_break_subshell

Passed

N/A

0.199070s

while_break_until

Passed

N/A

0.200711s

while_break_while

Passed

N/A

0.191118s

while_continue_case

Passed

N/A

0.198722s

while_continue_compound

Passed

N/A

0.193212s

while_continue_file

Passed

N/A

0.203725s

while_continue_for

Passed

N/A

0.191934s

while_continue_func

Passed

N/A

0.204802s

while_continue_subshell

Passed

N/A

0.208268s

while_continue_until

Passed

N/A

0.199440s

while_continue_while

Passed

N/A

0.199515s

while_return_case

Passed

N/A

0.197769s

while_return_compound

Passed

N/A

0.198428s

while_return_file

Passed

N/A

0.198775s

while_return_for

Passed

N/A

0.200896s

while_return_func

Passed

N/A

0.197580s

while_return_subshell

Passed

N/A

0.203953s

while_return_until

Passed

N/A

0.196917s

while_return_while

Passed

N/A

0.199697s

bin/sh/t_arith

12.713995s

constants

Passed

N/A

0.747678s

do_unary_minus

Passed

N/A

0.401566s

do_unary_not

Passed

N/A

0.330746s

do_unary_plus

Passed

N/A

0.331928s

do_unary_tilde

Passed

N/A

0.283583s

elementary_add

Passed

N/A

0.504305s

elementary_div

Passed

N/A

0.492689s

elementary_eq

Passed

N/A

0.604289s

elementary_ge

Passed

N/A

0.300414s

elementary_gt

Passed

N/A

0.554091s

elementary_le

Passed

N/A

0.458226s

elementary_lt

Passed

N/A

0.427451s

elementary_mul

Passed

N/A

0.553765s

elementary_ne

Passed

N/A

0.521090s

elementary_rem

Passed

N/A

0.681406s

elementary_shl

Passed

N/A

0.408828s

elementary_shr

Passed

N/A

0.525957s

elementary_sub

Passed

N/A

0.488973s

fiddle_bits_and

Passed

N/A

0.393234s

fiddle_bits_or

Passed

N/A

0.380911s

fiddle_bits_xor

Passed

N/A

0.379234s

logical_and

Passed

N/A

0.347771s

logical_or

Passed

N/A

0.348650s

make_selection

Passed

N/A

0.349677s

operator_precedence

Passed

N/A

0.975776s

parentheses

Passed

N/A

0.902921s

bin/sh/t_cmdsub

7.509227s

a_basic_cmdsub

Passed

N/A

0.596344s

b_basic_backticks

Passed

N/A

0.606005s

c_nested_cmdsub

Passed

N/A

0.225646s

d_nested_backticks

Passed

N/A

0.227034s

e_perverse_mixing

Passed

N/A

0.305823s

f_redirect_in_cmdsub

Passed

N/A

0.343856s

g_redirect_in_backticks

Passed

N/A

0.348668s

h_vars_in_cmdsub

Passed

N/A

0.458155s

i_vars_in_backticks

Passed

N/A

0.422246s

j_cmdsub_in_varexpand

Passed

N/A

0.239003s

k_backticks_in_varexpand

Passed

N/A

0.242743s

l_arithmetic_in_cmdsub

Passed

N/A

0.211182s

m_arithmetic_in_backticks

Passed

N/A

0.207405s

n_cmdsub_in_arithmetic

Passed

N/A

0.222443s

o_backticks_in_arithmetic

Passed

N/A

0.214298s

p_cmdsub_in_heredoc

Passed

N/A

0.155369s

q_backticks_in_heredoc

Passed

N/A

0.158235s

r_heredoc_in_cmdsub

Passed

N/A

0.247953s

s_heredoc_in_backticks

Passed

N/A

0.194688s

t_nested_cmdsubs_in_heredoc

Passed

N/A

0.275604s

u_nested_backticks_in_heredoc

Passed

N/A

0.281584s

v_cmdsub_paren_tests

Passed

N/A

0.629822s

w_heredoc_outside_cmdsub

Passed

N/A

0.244474s

x_heredoc_outside_backticks

Passed

N/A

0.188005s

z_absurd_heredoc_cmdsub_combos

Passed

N/A

0.240292s

bin/sh/t_evaltested

0.111052s

evaltested

Passed

N/A

0.110085s

bin/sh/t_exit

2.313449s

background

Passed

N/A

0.157102s

function

Passed

N/A

0.134826s

readout

Passed

N/A

0.127829s

simple_exit

Passed

N/A

0.626911s

subshell_background

Passed

N/A

0.156036s

subshell_exit

Passed

N/A

0.689369s

trap_subshell

Passed

N/A

0.148095s

trap_zero__explicit_exit

Passed

N/A

0.132733s

trap_zero__implicit_exit

Passed

N/A

0.133771s

bin/sh/t_expand

2.449751s

arithmetic

Passed

N/A

0.196663s

dollar_at

Passed

N/A

0.217951s

dollar_at_with_text

Passed

N/A

0.504901s

iteration_on_null_or_missing_parameter

Passed

N/A

0.135115s

iteration_on_null_or_null_parameter

Passed

N/A

0.130663s

iteration_on_null_parameter

Passed

N/A

0.125106s

iteration_on_quoted_null_parameter

Passed

N/A

0.125801s

shell_params

Passed

N/A

0.409738s

strip

Passed

N/A

0.468628s

varpattern_backslashes

Passed

N/A

0.127375s

bin/sh/t_fsplit

3.327703s

default_val

Passed

N/A

0.716584s

dollar_at

Passed

N/A

0.628591s

for

Passed

N/A

0.127472s

ifs

Passed

N/A

0.304099s

ifs_alpha

Passed

N/A

0.216559s

quote

Passed

N/A

0.168134s

replacement_val

Passed

N/A

0.962530s

var_length

Passed

N/A

0.197227s

bin/sh/t_here

10.804155s

do_simple

Passed

N/A

0.820137s

end_markers

Passed

N/A

7.935293s

incomplete

Passed

N/A

0.524824s

lineends

Passed

N/A

0.442264s

multiple

Passed

N/A

0.267671s

nested

Passed

N/A

0.209722s

quoting

Passed

N/A

0.243716s

side_effects

Passed

N/A

0.140125s

vicious

Passed

N/A

0.213107s

bin/sh/t_option

6.963811s

Option_switching

Passed

N/A

1.496294s

restore_local_opts

Passed

N/A

0.190139s

set_C

Passed

N/A

0.436375s

set_a

Passed

N/A

0.269423s

set_e

Passed

N/A

0.270703s

set_f

Passed

N/A

0.265735s

set_n

Passed

N/A

2.441763s

set_u

Passed

N/A

0.582220s

set_v

Passed

N/A

0.317211s

set_x

Passed

N/A

0.269411s

vi_emacs_VE_toggle

Passed

N/A

0.286038s

xx_bogus

Passed

N/A

0.125908s

bin/sh/t_redir

32.157818s

basic_test_method_test

Passed

N/A

0.427695s

do_input_redirections

Passed

N/A

0.709109s

do_output_redirections

Passed

N/A

0.703420s

fd_redirections

Passed

N/A

1.150728s

incorrect_redirections

Passed

N/A

0.569181s

local_redirections

Passed

N/A

0.284390s

named_fd_redirections

Passed

N/A

0.370510s

redir_here_doc

Passed

N/A

0.150633s

redir_in_case

Passed

N/A

0.228746s

subshell_redirections

Passed

N/A

0.314087s

ulimit_redirection_interaction

Passed

N/A

0.285752s

validate_fn_redirects

Passed

N/A

26.934989s

bin/sh/t_redircloexec

1.172222s

compound_redir_open

Passed

N/A

0.136547s

exec_redir_closed

Passed

N/A

0.298481s

exec_redir_open

Passed

N/A

0.294794s

loop_redir_open

Passed

N/A

0.136539s

simple_redir_open

Passed

N/A

0.144181s

subshell_redir_open

Passed

N/A

0.157865s

bin/sh/t_set_e

2.481716s

all

Passed

N/A

2.480985s

bin/sh/t_shift

1.666635s

basic_shift_test

Passed

N/A

0.495548s

excessive_shift

Passed

N/A

0.403906s

function_shift

Passed

N/A

0.094286s

non_numeric_shift

Passed

N/A

0.395971s

too_many_args

Passed

N/A

0.274013s

bin/sh/t_ulimit

0.196947s

limits

Passed

N/A

0.196053s

bin/sh/t_varquote

0.411147s

all

Passed

N/A

0.117886s

default_assignment_with_arith

Passed

N/A

0.161041s

nested_quotes_multiword

Passed

N/A

0.129842s

bin/sh/t_varval

4.763418s

aaa

Passed

N/A

0.291370s

assignment

Passed

N/A

0.993707s

cmdline

Passed

N/A

1.008706s

read

Passed

N/A

1.110384s

redirect

Passed

N/A

1.250531s

bin/sh/t_wait

21.728658s

basic_wait

Passed

N/A

6.264487s

individual

Passed

N/A

3.117164s

jobs

Passed

N/A

7.169831s

kill

Passed

N/A

5.173152s

bin/sleep/t_sleep

2.170204s

fraction

Passed

N/A

0.814966s

hex

Passed

N/A

1.139437s

nonnumeric

Passed

N/A

0.213558s

bin/tar/t_tar

0.249795s

append

Passed

N/A

0.248048s

dev/cgd/t_cgd_3des

0.296736s

cgd_3des_cbc_192_encblkno1

Passed

N/A

0.218017s

cgd_3des_cbc_192_encblkno8

Passed

N/A

0.077057s

dev/cgd/t_cgd_aes

0.615447s

cgd_aes_cbc_128_encblkno1

Passed

N/A

0.075528s

cgd_aes_cbc_128_encblkno8

Passed

N/A

0.074313s

cgd_aes_cbc_192_encblkno1

Passed

N/A

0.077051s

cgd_aes_cbc_192_encblkno8

Passed

N/A

0.080147s

cgd_aes_cbc_256_encblkno1

Passed

N/A

0.074473s

cgd_aes_cbc_256_encblkno8

Passed

N/A

0.076643s

cgd_aes_xts_256

Expected failure

aes-xts implementation not committed yet: /usr/src/tests/dev/cgd/t_cgd_aes.c:3522: configure_cgd(cgdfd, dkpath, "aes-xts", "encblkno1", aes_xts_256_key, sizeof(aes_xts_256_key)): Invalid argument

0.079276s

cgd_aes_xts_512

Expected failure

aes-xts implementation not committed yet: /usr/src/tests/dev/cgd/t_cgd_aes.c:3576: configure_cgd(cgdfd, dkpath, "aes-xts", "encblkno1", aes_xts_512_key, sizeof(aes_xts_512_key)): Invalid argument

0.071124s

dev/cgd/t_cgd_blowfish

0.482034s

cgd_bf_cbc_128_encblkno1

Passed

N/A

0.075153s

cgd_bf_cbc_128_encblkno8

Passed

N/A

0.074895s

cgd_bf_cbc_256_encblkno1

Passed

N/A

0.082695s

cgd_bf_cbc_256_encblkno8

Passed

N/A

0.079055s

cgd_bf_cbc_448_encblkno1

Passed

N/A

0.082844s

cgd_bf_cbc_448_encblkno8

Passed

N/A

0.082750s

dev/cgd/t_cgd

2.949290s

basic

Passed

N/A

0.664442s

unaligned_write

Passed

N/A

1.634156s

wrongpass

Passed

N/A

0.646819s

dev/clock_subr/t_clock_subr

0.026003s

secs_to_ymdhms

Passed

N/A

0.012596s

ymdhms_to_secs

Passed

N/A

0.011870s

dev/fss/t_fss

0.542791s

basic

Passed

N/A

0.538401s

dev/raidframe/t_raid

19.660580s

raid1_comp0fail

Passed

N/A

3.758070s

raid1_compfail

Passed

N/A

3.814543s

raid1_normal

Passed

N/A

3.771865s

raid5_compfail

Passed

N/A

3.816047s

raid5_normal

Passed

N/A

3.767719s

smalldisk

Passed

N/A

0.412469s

dev/audio/t_pad

0.983230s

pad_output

Passed

N/A

0.982058s

dev/md/t_md

0.524200s

basic

Passed

N/A

0.523399s

dev/scsipi/t_cd

0.090152s

noisyeject

Passed

N/A

0.089545s

dev/sysmon/t_swwdog

5.515137s

disarm

Passed

N/A

2.490511s

panic

Passed

N/A

1.541000s

reboot

Passed

N/A

1.476177s

dev/sysmon/t_swsensor

121.161550s

alarm_sensor

Passed

N/A

28.385305s

entropy_interrupt_sensor

Passed

N/A

16.783754s

entropy_polled_sensor

Passed

N/A

32.172453s

limit_sensor

Passed

N/A

27.022577s

simple_sensor

Passed

N/A

16.771865s

dev/usb/t_hid

0.102662s

khid

Passed

N/A

0.047473s

khid_parse_just_pop

Passed

N/A

0.053911s

games/t_factor

0.724655s

loop1

Passed

N/A

0.218304s

loop2

Passed

N/A

0.172815s

overflow1

Passed

N/A

0.166225s

overflow2

Passed

N/A

0.163233s

include/machine/t_bswap

0.083761s

bswap16_basic

Passed

N/A

0.013675s

bswap16_unconst

Passed

N/A

0.013214s

bswap32_basic

Passed

N/A

0.012936s

bswap32_unconst

Passed

N/A

0.012983s

bswap64_basic

Passed

N/A

0.012918s

bswap64_unconst

Passed

N/A

0.012981s

include/sys/t_bitops

0.087004s

bitmap_basic

Passed

N/A

0.015438s

fast_divide32

Passed

N/A

0.014369s

ffsfls

Passed

N/A

0.012885s

ilog2_32bit

Passed

N/A

0.012809s

ilog2_64bit

Passed

N/A

0.012576s

ilog2_const

Passed

N/A

0.014487s

include/sys/t_bootblock

0.027966s

mbr_partition

Passed

N/A

0.013492s

mbr_sector

Passed

N/A

0.012733s

include/sys/t_cdefs

0.110540s

sissigned

Passed

N/A

0.013552s

stypefit

Passed

N/A

0.012981s

stypemask

Passed

N/A

0.012890s

stypeminmax

Passed

N/A

0.012841s

uissigned

Passed

N/A

0.012365s

utypefit

Passed

N/A

0.013063s

utypemask

Passed

N/A

0.013021s

utypeminmax

Passed

N/A

0.013042s

include/sys/t_pslist

0.012649s

misc

Passed

N/A

0.011960s

include/sys/t_tree

0.505421s

tree_rbstress

Passed

N/A

0.504653s

include/sys/t_types

0.037104s

types_limits

Passed

N/A

0.011935s

types_signed

Passed

N/A

0.011729s

types_unsigned

Passed

N/A

0.011525s

include/sys/t_socket

0.234072s

cmsg_sendfd

Passed

N/A

0.078510s

cmsg_sendfd_bounds

Passed

N/A

0.077584s

sock_cloexec

Passed

N/A

0.076269s

include/t_bitstring

0.245222s

bits_27

Passed

N/A

0.062956s

bits_32

Passed

N/A

0.031445s

bits_49

Passed

N/A

0.045645s

bits_64

Passed

N/A

0.032387s

bits_67

Passed

N/A

0.035808s

bits_8

Passed

N/A

0.032346s

include/t_errno

0.013046s

errno_constants

Expected failure

PR standards/44921: 2 checks failed as expected; see output for more details

0.012186s

include/t_glob

0.012532s

glob_types

Passed

N/A

0.011713s

include/t_inttypes

0.013180s

int_fmtio

Passed

N/A

0.012349s

include/t_limits

0.039894s

char

Passed

N/A

0.012819s

posix

Passed

N/A

0.012378s

short

Passed

N/A

0.012444s

include/t_netdb

0.014260s

netdb_constants

Expected failure

PR standards/44777: 2 checks failed as expected; see output for more details

0.013498s

include/t_paths

0.013820s

paths

Skipped

PR port-sparc/45580

0.012989s

include/t_stdint

0.026804s

int16

Passed

N/A

0.012798s

int8

Passed

N/A

0.012464s

kernel/kqueue/read/t_fifo

0.014303s

fifo

Passed

N/A

0.013392s

kernel/kqueue/read/t_file

6.068318s

file

Passed

N/A

6.067444s

kernel/kqueue/read/t_file2

0.014032s

file2

Passed

N/A

0.013080s

kernel/kqueue/read/t_pipe

0.013723s

pipe

Passed

N/A

0.013057s

kernel/kqueue/read/t_ttypty

2.044701s

master

Passed

N/A

1.024190s

slave

Passed

N/A

1.019358s

kernel/kqueue/write/t_fifo

0.017188s

fifo

Passed

N/A

0.016428s

kernel/kqueue/write/t_pipe

0.099839s

pipe1

Passed

N/A

0.068305s

pipe2

Passed

N/A

0.016898s

pipe3

Passed

N/A

0.012841s

kernel/kqueue/write/t_ttypty

2.043141s

master

Passed

N/A

1.022585s

slave

Passed

N/A

1.019384s

kernel/kqueue/t_ioctl

0.027122s

kfilter_byfilter

Passed

N/A

0.012946s

kfilter_byname

Passed

N/A

0.013079s

kernel/kqueue/t_proc1

2.035137s

proc1

Passed

N/A

2.034489s

kernel/kqueue/t_proc2

2.058256s

proc2

Passed

N/A

2.057575s

kernel/kqueue/t_proc3

0.015377s

proc3

Passed

N/A

0.014730s

kernel/kqueue/t_sig

12.070563s

sig

Passed

N/A

12.069909s

kernel/kqueue/t_vnode

0.459775s

dir_no_note_link_create_file_in

Passed

N/A

0.026778s

dir_no_note_link_delete_file_in

Passed

N/A

0.024459s

dir_no_note_link_mv_dir_within

Passed

N/A

0.024343s

dir_no_note_link_mv_file_within

Passed

N/A

0.023933s

dir_note_link_create_dir_in

Passed

N/A

0.024003s

dir_note_link_delete_dir_in

Passed

N/A

0.023804s

dir_note_link_mv_dir_in

Passed

N/A

0.024085s

dir_note_link_mv_dir_out

Passed

N/A

0.023813s

dir_note_write_create_dir_in

Passed

N/A

0.024263s

dir_note_write_create_file_in

Passed

N/A

0.024026s

dir_note_write_delete_dir_in

Passed

N/A

0.024159s

dir_note_write_delete_file_in

Passed

N/A

0.024026s

dir_note_write_mv_dir_in

Passed

N/A

0.024175s

dir_note_write_mv_dir_out

Passed

N/A

0.023968s

dir_note_write_mv_dir_within

Passed

N/A

0.027405s

dir_note_write_mv_file_in

Passed

N/A

0.026697s

dir_note_write_mv_file_out

Passed

N/A

0.026654s

dir_note_write_mv_file_within

Passed

N/A

0.026541s

kernel/tty/t_pr

0.203996s

client_first

Passed

N/A

0.068267s

master_first

Passed

N/A

0.065514s

ptyioctl

Passed

N/A

0.067108s

kernel/t_lock

1.010112s

lock

Passed

N/A

1.009337s

kernel/t_lockf

61.059227s

deadlock

Passed

N/A

1.021973s

randlock

Passed

N/A

60.035436s

kernel/t_ptrace

0.071614s

attach_chroot

Passed

N/A

0.015397s

attach_pid0

Passed

N/A

0.012562s

attach_pid1

Passed

N/A

0.015055s

attach_pid1_securelevel

Skipped

Test must be run with securelevel >= 1

0.012193s

attach_self

Passed

N/A

0.011867s

kernel/t_ptrace_wait

0.956014s

attach3

Passed

N/A

0.021907s

attach4

Passed

N/A

0.016938s

eventmask1

Passed

N/A

0.018885s

eventmask2

Passed

N/A

0.018532s

fork2

Passed

N/A

0.021752s

fpregs1

Passed

N/A

0.021826s

fpregs2

Failed

/usr/src/tests/kernel/t_ptrace_wait.c:3894: ptrace(PT_SETFPREGS, child, &r, 0) != -1 not met

0.019197s

io_read_d1

Passed

N/A

0.018552s

io_read_d2

Passed

N/A

0.018966s

io_read_d3

Passed

N/A

0.018716s

io_read_d4

Passed

N/A

0.018627s

io_read_d_write_d_handshake1

Passed

N/A

0.018529s

io_read_d_write_d_handshake2

Passed

N/A

0.019850s

io_read_i1

Passed

N/A

0.019570s

io_read_i2

Passed

N/A

0.019424s

io_read_i3

Passed

N/A

0.019508s

io_read_i4

Passed

N/A

0.019479s

io_write_d1

Passed

N/A

0.019627s

io_write_d2

Passed

N/A

0.019381s

io_write_d3

Passed

N/A

0.019843s

io_write_d4

Passed

N/A

0.019402s

kill1

Passed

N/A

0.019818s

kill2

Passed

N/A

0.018929s

lwpinfo1

Passed

N/A

0.018809s

read_d1

Passed

N/A

0.018908s

read_d2

Passed

N/A

0.018671s

read_d3

Passed

N/A

0.018887s

read_d4

Passed

N/A

0.018613s

read_d_write_d_handshake1

Passed

N/A

0.018883s

read_d_write_d_handshake2

Passed

N/A

0.018913s

read_i1

Passed

N/A

0.019185s

read_i2

Passed

N/A

0.018394s

read_i3

Passed

N/A

0.018615s

read_i4

Passed

N/A

0.018559s

regs1

Passed

N/A

0.018594s

regs2

Passed

N/A

0.018508s

regs3

Passed

N/A

0.019546s

regs4

Passed

N/A

0.019391s

regs5

Passed

N/A

0.019728s

traceme1

Passed

N/A

0.019507s

traceme2

Passed

N/A

0.018960s

traceme3

Passed

N/A

0.018606s

traceme4

Passed

N/A

0.020769s

vfork2

Passed

N/A

0.020122s

write_d1

Passed

N/A

0.018806s

write_d2

Passed

N/A

0.018859s

write_d3

Passed

N/A

0.019463s

write_d4

Passed

N/A

0.018907s

kernel/t_ptrace_wait3

0.975666s

attach3

Passed

N/A

0.021000s

attach4

Passed

N/A

0.017291s

eventmask1

Passed

N/A

0.018567s

eventmask2

Passed

N/A

0.018342s

fork2

Passed

N/A

0.021477s

fpregs1

Passed

N/A

0.030252s

fpregs2

Failed

/usr/src/tests/kernel/t_ptrace_wait.c:3894: ptrace(PT_SETFPREGS, child, &r, 0) != -1 not met

0.019350s

io_read_d1

Passed

N/A

0.018456s

io_read_d2

Passed

N/A

0.020049s

io_read_d3

Passed

N/A

0.019656s

io_read_d4

Passed

N/A

0.019439s

io_read_d_write_d_handshake1

Passed

N/A

0.019936s

io_read_d_write_d_handshake2

Passed

N/A

0.018923s

io_read_i1

Passed

N/A

0.018868s

io_read_i2

Passed

N/A

0.019122s

io_read_i3

Passed

N/A

0.018673s

io_read_i4

Passed

N/A

0.018673s

io_write_d1

Passed

N/A

0.019189s

io_write_d2

Passed

N/A

0.018393s

io_write_d3

Passed

N/A

0.018466s

io_write_d4

Passed

N/A

0.018288s

kill1

Passed

N/A

0.018469s

kill2

Passed

N/A

0.018813s

lwpinfo1

Passed

N/A

0.020493s

read_d1

Passed

N/A

0.020056s

read_d2

Passed

N/A

0.019331s

read_d3

Passed

N/A

0.018101s

read_d4

Passed

N/A

0.019561s

read_d_write_d_handshake1

Passed

N/A

0.019631s

read_d_write_d_handshake2

Passed

N/A

0.019628s

read_i1

Passed

N/A

0.019535s

read_i2

Passed

N/A

0.019556s

read_i3

Passed

N/A

0.019617s

read_i4

Passed

N/A

0.018878s

regs1

Passed

N/A

0.019222s

regs2

Passed

N/A

0.019319s

regs3

Passed

N/A

0.019418s

regs4

Passed

N/A

0.019482s

regs5

Passed

N/A

0.019523s

traceme1

Passed

N/A

0.019337s

traceme2

Passed

N/A

0.019660s

traceme3

Passed

N/A

0.019534s

traceme4

Passed

N/A

0.020084s

vfork2

Passed

N/A

0.020020s

write_d1

Passed

N/A

0.019657s

write_d2

Passed

N/A

0.019525s

write_d3

Passed

N/A

0.021138s

write_d4

Passed

N/A

0.019768s

kernel/t_ptrace_wait4

1.231071s

attach1

Passed

N/A

0.036170s

attach2

Passed

N/A

0.021785s

attach3

Passed

N/A

0.022058s

attach4

Passed

N/A

0.017967s

attach5

Passed

N/A

0.034394s

attach6

Passed

N/A

0.038424s

attach7

Passed

N/A

0.022756s

eventmask1

Passed

N/A

0.021040s

eventmask2

Passed

N/A

0.021012s

fork1

Failed

/usr/src/tests/kernel/t_ptrace_wait.h:295: Reported exited process

0.023915s

fork2

Passed

N/A

0.023600s

fpregs1

Passed

N/A

0.021435s

fpregs2

Failed

/usr/src/tests/kernel/t_ptrace_wait.c:3894: ptrace(PT_SETFPREGS, child, &r, 0) != -1 not met

0.022138s

io_read_d1

Passed

N/A

0.021426s

io_read_d2

Passed

N/A

0.020827s

io_read_d3

Passed

N/A

0.021065s

io_read_d4

Passed

N/A

0.020830s

io_read_d_write_d_handshake1

Passed

N/A

0.021637s

io_read_d_write_d_handshake2

Passed

N/A

0.020495s

io_read_i1

Passed

N/A

0.021466s

io_read_i2

Passed

N/A

0.020676s

io_read_i3

Passed

N/A

0.021101s

io_read_i4

Passed

N/A

0.020765s

io_write_d1

Passed

N/A

0.020664s

io_write_d2

Passed

N/A

0.020788s

io_write_d3

Passed

N/A

0.019781s

io_write_d4

Passed

N/A

0.019985s

kill1

Passed

N/A

0.019856s

kill2

Passed

N/A

0.019229s

lwpinfo1

Passed

N/A

0.020009s

lwpinfo2

Passed

N/A

0.020777s

read_d1

Passed

N/A

0.020608s

read_d2

Passed

N/A

0.020169s

read_d3

Passed

N/A

0.019922s

read_d4

Passed

N/A

0.019610s

read_d_write_d_handshake1

Passed

N/A

0.020063s

read_d_write_d_handshake2

Passed

N/A

0.019852s

read_i1

Passed

N/A

0.019826s

read_i2

Passed

N/A

0.020038s

read_i3

Passed

N/A

0.019017s

read_i4

Passed

N/A

0.019132s

regs1

Passed

N/A

0.019452s

regs2

Passed

N/A

0.019051s

regs3

Passed

N/A

0.021091s

regs4

Passed

N/A

0.019654s

regs5

Passed

N/A

0.018921s

traceme1

Passed

N/A

0.018695s

traceme2

Passed

N/A

0.019187s

traceme3

Passed

N/A

0.019002s

traceme4

Passed

N/A

0.020323s

vfork1

Expected failure

PR kern/51630: /usr/src/tests/kernel/t_ptrace_wait.h:305: WSTOPSIG(status) != expected: Unexpected stop signal received [Child exited] != [Trace/BPT trap]

0.019925s

vfork2

Passed

N/A

0.019540s

write_d1

Passed

N/A

0.019346s

write_d2

Passed

N/A

0.019415s

write_d3

Passed

N/A

0.019509s

write_d4

Passed

N/A

0.020528s

kernel/t_ptrace_wait6

1.287691s

attach1

Passed

N/A

0.034725s

attach2

Passed

N/A

0.038464s

attach3

Passed

N/A

0.019827s

attach4

Passed

N/A

0.018179s

attach5

Passed

N/A

0.038984s

attach6

Passed

N/A

0.038600s

attach7

Passed

N/A

0.022323s

eventmask1

Passed

N/A

0.019911s

eventmask2

Passed

N/A

0.020696s

fork1

Failed

/usr/src/tests/kernel/t_ptrace_wait.h:295: Reported exited process

0.023701s

fork2

Passed

N/A

0.023681s

fpregs1

Passed

N/A

0.019860s

fpregs2

Failed

/usr/src/tests/kernel/t_ptrace_wait.c:3894: ptrace(PT_SETFPREGS, child, &r, 0) != -1 not met

0.020256s

io_read_d1

Passed

N/A

0.019920s

io_read_d2

Passed

N/A

0.022276s

io_read_d3

Passed

N/A

0.020651s

io_read_d4

Passed

N/A

0.019613s

io_read_d_write_d_handshake1

Passed

N/A

0.023806s

io_read_d_write_d_handshake2

Passed

N/A

0.020572s

io_read_i1

Passed

N/A

0.021020s

io_read_i2

Passed

N/A

0.020593s

io_read_i3

Passed

N/A

0.021499s

io_read_i4

Passed

N/A

0.021529s

io_write_d1

Passed

N/A

0.021408s

io_write_d2

Passed

N/A

0.021498s

io_write_d3

Passed

N/A

0.021365s

io_write_d4

Passed

N/A

0.021566s

kill1

Passed

N/A

0.020575s

kill2

Passed

N/A

0.020468s

lwpinfo1

Passed

N/A

0.020608s

lwpinfo2

Passed

N/A

0.033757s

read_d1

Passed

N/A

0.020512s

read_d2

Passed

N/A

0.021438s

read_d3

Passed

N/A

0.021438s

read_d4

Passed

N/A

0.020646s

read_d_write_d_handshake1

Passed

N/A

0.019846s

read_d_write_d_handshake2

Passed

N/A

0.019882s

read_i1

Passed

N/A

0.018520s

read_i2

Passed

N/A

0.020368s

read_i3

Passed

N/A

0.019882s

read_i4

Passed

N/A

0.022640s

regs1

Passed

N/A

0.020095s

regs2

Passed

N/A

0.019948s

regs3

Passed

N/A

0.020082s

regs4

Passed

N/A

0.020566s

regs5

Passed

N/A

0.020108s

traceme1

Passed

N/A

0.019598s

traceme2

Passed

N/A

0.019738s

traceme3

Passed

N/A

0.022299s

traceme4

Passed

N/A

0.022553s

vfork1

Expected failure

PR kern/51630: /usr/src/tests/kernel/t_ptrace_wait.h:305: WSTOPSIG(status) != expected: Unexpected stop signal received [Child exited] != [Trace/BPT trap]

0.023031s

vfork2

Passed

N/A

0.021237s

write_d1

Passed

N/A

0.020110s

write_d2

Passed

N/A

0.020310s

write_d3

Passed

N/A

0.020172s

write_d4

Passed

N/A

0.020885s

kernel/t_ptrace_waitid

301.241683s

attach1

Passed

N/A

0.037882s

attach2

Passed

N/A

0.021525s

attach3

Passed

N/A

0.017773s

attach4

Passed

N/A

0.018185s

attach5

Passed

N/A

0.038406s

attach6

Passed

N/A

0.038910s

attach7

Passed

N/A

0.038731s

eventmask1

Passed

N/A

0.018106s

eventmask2

Passed

N/A

0.019433s

fork1

Failed

/usr/src/tests/kernel/t_ptrace_wait.c:1152: ptrace(PT_GET_PROCESS_STATE, child2, &state, slen) != -1 not met

0.029708s

fork2

Passed

N/A

0.021431s

fpregs1

Passed

N/A

0.018170s

fpregs2

Failed

/usr/src/tests/kernel/t_ptrace_wait.c:3894: ptrace(PT_SETFPREGS, child, &r, 0) != -1 not met

0.018456s

io_read_d1

Passed

N/A

0.018878s

io_read_d2

Passed

N/A

0.019012s

io_read_d3

Passed

N/A

0.018497s

io_read_d4

Passed

N/A

0.020176s

io_read_d_write_d_handshake1

Passed

N/A

0.020053s

io_read_d_write_d_handshake2

Passed

N/A

0.019827s

io_read_i1

Passed

N/A

0.020370s

io_read_i2

Passed

N/A

0.020333s

io_read_i3

Passed

N/A

0.020568s

io_read_i4

Passed

N/A

0.020371s

io_write_d1

Passed

N/A

0.020984s

io_write_d2

Passed

N/A

0.020904s

io_write_d3

Passed

N/A

0.018758s

io_write_d4

Passed

N/A

0.021483s

kill1

Passed

N/A

0.020486s

kill2

Passed

N/A

0.020476s

lwpinfo1

Passed

N/A

0.021461s

lwpinfo2

Passed

N/A

0.035450s

read_d1

Passed

N/A

0.019145s

read_d2

Passed

N/A

0.018294s

read_d3

Passed

N/A

0.018293s

read_d4

Passed

N/A

0.018355s

read_d_write_d_handshake1

Passed

N/A

0.019135s

read_d_write_d_handshake2

Passed

N/A

0.021110s

read_i1

Passed

N/A

0.021294s

read_i2

Passed

N/A

0.021271s

read_i3

Passed

N/A

0.020224s

read_i4

Passed

N/A

0.020344s

regs1

Passed

N/A

0.020418s

regs2

Passed

N/A

0.020171s

regs3

Passed

N/A

0.020010s

regs4

Passed

N/A

0.019974s

regs5

Passed

N/A

0.020010s

traceme1

Passed

N/A

0.019945s

traceme2

Passed

N/A

0.020426s

traceme3

Passed

N/A

0.018958s

traceme4

Passed

N/A

0.018263s

vfork1

Failed

Test case timed out after 300 seconds

300.013148s

vfork2

Passed

N/A

0.018880s

write_d1

Passed

N/A

0.018372s

write_d2

Passed

N/A

0.019028s

write_d3

Passed

N/A

0.019159s

write_d4

Passed

N/A

0.021524s

kernel/t_ptrace_waitpid

1.226875s

attach1

Passed

N/A

0.037445s

attach2

Passed

N/A

0.038573s

attach3

Passed

N/A

0.018185s

attach4

Passed

N/A

0.016748s

attach5

Passed

N/A

0.031561s

attach6

Passed

N/A

0.038911s

attach7

Passed

N/A

0.022728s

eventmask1

Passed

N/A

0.019597s

eventmask2

Passed

N/A

0.019419s

fork1

Failed

/usr/src/tests/kernel/t_ptrace_wait.h:295: Reported exited process

0.022961s

fork2

Passed

N/A

0.021751s

fpregs1

Passed

N/A

0.019415s

fpregs2

Failed

/usr/src/tests/kernel/t_ptrace_wait.c:3894: ptrace(PT_SETFPREGS, child, &r, 0) != -1 not met

0.019971s

io_read_d1

Passed

N/A

0.020062s

io_read_d2

Passed

N/A

0.019454s

io_read_d3

Passed

N/A

0.019406s

io_read_d4

Passed

N/A

0.019445s

io_read_d_write_d_handshake1

Passed

N/A

0.019957s

io_read_d_write_d_handshake2

Passed

N/A

0.020037s

io_read_i1

Passed

N/A

0.019557s

io_read_i2

Passed

N/A

0.019388s

io_read_i3

Passed

N/A

0.019419s

io_read_i4

Passed

N/A

0.019647s

io_write_d1

Passed

N/A

0.019673s

io_write_d2

Passed

N/A

0.019478s

io_write_d3

Passed

N/A

0.019531s

io_write_d4

Passed

N/A

0.019487s

kill1

Passed

N/A

0.019311s

kill2

Passed

N/A

0.019268s

lwpinfo1

Passed

N/A

0.019332s

lwpinfo2

Passed

N/A

0.021550s

read_d1

Passed

N/A

0.019716s

read_d2

Passed

N/A

0.019923s

read_d3

Passed

N/A

0.020574s

read_d4

Passed

N/A

0.018730s

read_d_write_d_handshake1

Passed

N/A

0.018637s

read_d_write_d_handshake2

Passed

N/A

0.019302s

read_i1

Passed

N/A

0.019466s

read_i2

Passed

N/A

0.020409s

read_i3

Passed

N/A

0.019858s

read_i4

Passed

N/A

0.020863s

regs1

Passed

N/A

0.020157s

regs2

Passed

N/A

0.021594s

regs3

Passed

N/A

0.021694s

regs4

Passed

N/A

0.021225s

regs5

Passed

N/A

0.020421s

traceme1

Passed

N/A

0.020401s

traceme2

Passed

N/A

0.021728s

traceme3

Passed

N/A

0.021433s

traceme4

Passed

N/A

0.022328s

vfork1

Expected failure

PR kern/51630: /usr/src/tests/kernel/t_ptrace_wait.h:305: WSTOPSIG(status) != expected: Unexpected stop signal received [Child exited] != [Trace/BPT trap]

0.020983s

vfork2

Passed

N/A

0.019125s

write_d1

Passed

N/A

0.018331s

write_d2

Passed

N/A

0.018486s

write_d3

Passed

N/A

0.018544s

write_d4

Passed

N/A

0.018753s

kernel/t_pty

6.074384s

pty_no_queue

Passed

N/A

3.033735s

pty_queue

Passed

N/A

3.039416s

kernel/t_mqueue

0.014519s

mqueue

Passed

N/A

0.013611s

kernel/t_sysv

1.115899s

msg

Passed

N/A

0.030674s

sem

Passed

N/A

1.052709s

shm

Passed

N/A

0.030051s

kernel/t_subr_prf

0.052131s

snprintf_count

Passed

N/A

0.012739s

snprintf_count_overflow

Passed

N/A

0.012443s

snprintf_print

Passed

N/A

0.012281s

snprintf_print_overflow

Passed

N/A

0.012347s

kernel/t_kauth_pr_47598

0.407712s

kauth_curtain

Passed

N/A

0.407070s

kernel/t_sysctl

0.016403s

bufsize

Passed

N/A

0.015626s

kernel/t_extattrctl

0.062554s

extattrctl_namei

Passed

N/A

0.061655s

kernel/t_filedesc

13.523896s

getfilerace

Passed

N/A

13.522967s

kernel/t_rnd

0.193569s

RNDADDDATA

Passed

N/A

0.063845s

RNDADDDATA2

Passed

N/A

0.064257s

read_random

Passed

N/A

0.062967s

kernel/t_extent

0.152447s

bound1

Passed

N/A

0.013132s

bound2

Passed

N/A

0.012399s

bound3

Passed

N/A

0.012236s

bound4

Passed

N/A

0.012294s

bound5

Passed

N/A

0.014278s

coalesce

Passed

N/A

0.013403s

free

Passed

N/A

0.013324s

subregion1

Passed

N/A

0.013316s

subregion2

Passed

N/A

0.013315s

subregion3

Passed

N/A

0.013277s

subregion4

Passed

N/A

0.013365s

kernel/t_umount

0.828162s

umount

Passed

N/A

0.822580s

kernel/t_umountstress

2.793306s

fileop

Passed

N/A

1.014987s

mountlist

Passed

N/A

1.767951s

kernel/t_ps_strings

0.909529s

update

Passed

N/A

0.779138s

validate

Passed

N/A

0.128651s

lib/csu/t_crt0

0.580064s

initfini1

Passed

N/A

0.141879s

initfini2

Passed

N/A

0.139660s

initfini3

Passed

N/A

0.139829s

initfini4

Passed

N/A

0.155283s

lib/libbluetooth/t_bluetooth

0.026019s

check_bt_aton

Passed

N/A

0.012511s

check_bt_ntoa

Passed

N/A

0.012176s

lib/libbluetooth/t_sdp_data

0.027596s

check_sdp_data_size

Passed

N/A

0.013876s

check_sdp_data_type

Passed

N/A

0.012398s

lib/libbluetooth/t_sdp_get

0.133166s

check_sdp_get_alt

Passed

N/A

0.012746s

check_sdp_get_attr

Passed

N/A

0.012536s

check_sdp_get_bool

Passed

N/A

0.012504s

check_sdp_get_data

Passed

N/A

0.012375s

check_sdp_get_int

Passed

N/A

0.012316s

check_sdp_get_seq

Passed

N/A

0.012478s

check_sdp_get_str

Passed

N/A

0.012274s

check_sdp_get_uint

Passed

N/A

0.012385s

check_sdp_get_url

Passed

N/A

0.012423s

check_sdp_get_uuid

Passed

N/A

0.014808s

lib/libbluetooth/t_sdp_match

0.015050s

check_sdp_match_uuid16

Passed

N/A

0.014119s

lib/libbluetooth/t_sdp_put

0.291100s

check_sdp_put_alt

Passed

N/A

0.013399s

check_sdp_put_attr

Passed

N/A

0.012754s

check_sdp_put_bool

Passed

N/A

0.012771s

check_sdp_put_data

Passed

N/A

0.012886s

check_sdp_put_int

Passed

N/A

0.012724s

check_sdp_put_int16

Passed

N/A

0.012756s

check_sdp_put_int32

Passed

N/A

0.012758s

check_sdp_put_int64

Passed

N/A

0.012852s

check_sdp_put_int8

Passed

N/A

0.012715s

check_sdp_put_seq

Passed

N/A

0.012735s

check_sdp_put_str

Passed

N/A

0.012564s

check_sdp_put_uint

Passed

N/A

0.012727s

check_sdp_put_uint16

Passed

N/A

0.012526s

check_sdp_put_uint32

Passed

N/A

0.012673s

check_sdp_put_uint64

Passed

N/A

0.012810s

check_sdp_put_uint8

Passed

N/A

0.014537s

check_sdp_put_url

Passed

N/A

0.014316s

check_sdp_put_uuid

Passed

N/A

0.014208s

check_sdp_put_uuid128

Passed

N/A

0.014179s

check_sdp_put_uuid16

Passed

N/A

0.014034s

check_sdp_put_uuid32

Passed

N/A

0.013950s

lib/libbluetooth/t_sdp_set

0.071522s

check_sdp_set_alt

Passed

N/A

0.014204s

check_sdp_set_bool

Passed

N/A

0.013481s

check_sdp_set_int

Passed

N/A

0.013079s

check_sdp_set_seq

Passed

N/A

0.013817s

check_sdp_set_uint

Passed

N/A

0.013134s

lib/libc/c063/t_faccessat

0.093145s

faccessat_fd

Passed

N/A

0.012304s

faccessat_fdcwd

Passed

N/A

0.012050s

faccessat_fdcwderr

Passed

N/A

0.011953s

faccessat_fderr1

Passed

N/A

0.011756s

faccessat_fderr2

Passed

N/A

0.012070s

faccessat_fderr3

Passed

N/A

0.011646s

faccessat_fdlink

Passed

N/A

0.013966s

lib/libc/c063/t_fchmodat

0.101301s

fchmodat_fd

Passed

N/A

0.013880s

fchmodat_fdcwd

Passed

N/A

0.013498s

fchmodat_fdcwderr

Passed

N/A

0.013207s

fchmodat_fderr1

Passed

N/A

0.013175s

fchmodat_fderr2

Passed

N/A

0.013407s

fchmodat_fderr3

Passed

N/A

0.013232s

fchmodat_fdlink

Passed

N/A

0.012312s

lib/libc/c063/t_fchownat

0.108937s

fchownat_fd

Passed

N/A

0.013811s

fchownat_fdcwd

Passed

N/A

0.013248s

fchownat_fdcwderr

Passed

N/A

0.013188s

fchownat_fderr1

Passed

N/A

0.014483s

fchownat_fderr2

Passed

N/A

0.015386s

fchownat_fderr3

Passed

N/A

0.015072s

fchownat_fdlink

Passed

N/A

0.015230s

lib/libc/c063/t_fexecve

0.018895s

fexecve

Expected failure

fexecve not implemented: /usr/src/tests/lib/libc/c063/t_fexecve.c:85: access("test", F_OK) == 0 not met

0.018306s

lib/libc/c063/t_fstatat

0.097830s

fstatat_fd

Passed

N/A

0.013412s

fstatat_fdcwd

Passed

N/A

0.013016s

fstatat_fdcwderr

Passed

N/A

0.012869s

fstatat_fderr1

Passed

N/A

0.013046s

fstatat_fderr2

Passed

N/A

0.013046s

fstatat_fderr3

Passed

N/A

0.012858s

fstatat_fdlink

Passed

N/A

0.012865s

lib/libc/c063/t_linkat

0.087184s

linkat_fd

Passed

N/A

0.013043s

linkat_fdcwd

Passed

N/A

0.012923s

linkat_fdcwderr

Passed

N/A

0.012966s

linkat_fderr

Passed

N/A

0.012955s

linkat_fdlink1

Passed

N/A

0.013037s

linkat_fdlink2

Passed

N/A

0.013453s

lib/libc/c063/t_mkdirat

0.055676s

mkdirat_fd

Passed

N/A

0.013272s

mkdirat_fdcwd

Passed

N/A

0.012865s

mkdirat_fdcwderr

Passed

N/A

0.012792s

mkdirat_fderr

Passed

N/A

0.012893s

lib/libc/c063/t_mkfifoat

0.055509s

mkfifoat_fd

Passed

N/A

0.013260s

mkfifoat_fdcwd

Passed

N/A

0.013028s

mkfifoat_fdcwderr

Passed

N/A

0.012829s

mkfifoat_fderr

Passed

N/A

0.012795s

lib/libc/c063/t_mknodat

0.055841s

mknodat_fd

Passed

N/A

0.013533s

mknodat_fdcwd

Passed

N/A

0.012940s

mknodat_fdcwderr

Passed

N/A

0.012872s

mknodat_fderr

Passed

N/A

0.012885s

lib/libc/c063/t_o_search

0.045897s

o_search_notdir

Passed

N/A

0.013249s

o_search_perm1

Passed

N/A

0.014602s

o_search_perm2

Passed

N/A

0.014233s

lib/libc/c063/t_openat

0.083730s

openat_fd

Passed

N/A

0.013541s

openat_fdcwd

Passed

N/A

0.013166s

openat_fdcwderr

Passed

N/A

0.012958s

openat_fderr1

Passed

N/A

0.012834s

openat_fderr2

Passed

N/A

0.012817s

openat_fderr3

Passed

N/A

0.012572s

lib/libc/c063/t_readlinkat

0.069480s

readlinkat_fd

Passed

N/A

0.012352s

readlinkat_fdcwd

Passed

N/A

0.013960s

readlinkat_fdcwderr

Passed

N/A

0.013650s

readlinkat_fderr1

Passed

N/A

0.012003s

readlinkat_fderr2

Passed

N/A

0.011970s

lib/libc/c063/t_renameat

0.057777s

renameat_fd

Passed

N/A

0.012372s

renameat_fdcwd

Passed

N/A

0.012103s

renameat_fdcwderr

Passed

N/A

0.013667s

renameat_fderr

Passed

N/A

0.013454s

lib/libc/c063/t_symlinkat

0.057753s

symlinkat_fd

Passed

N/A

0.012291s

symlinkat_fdcwd

Passed

N/A

0.013387s

symlinkat_fdcwderr

Passed

N/A

0.013265s

symlinkat_fderr

Passed

N/A

0.013143s

lib/libc/c063/t_unlinkat

0.097043s

unlinkat_dir

Passed

N/A

0.012217s

unlinkat_fd

Passed

N/A

0.013407s

unlinkat_fdcwd

Passed

N/A

0.012377s

unlinkat_fdcwderr

Passed

N/A

0.011862s

unlinkat_fderr1

Passed

N/A

0.012867s

unlinkat_fderr2

Passed

N/A

0.013909s

unlinkat_fderr3

Passed

N/A

0.013561s

lib/libc/c063/t_utimensat

0.093372s

utimensat_fd

Passed

N/A

0.012227s

utimensat_fdcwd

Passed

N/A

0.012156s

utimensat_fdcwderr

Passed

N/A

0.011987s

utimensat_fderr1

Passed

N/A

0.011924s

utimensat_fderr2

Passed

N/A

0.011942s

utimensat_fderr3

Passed

N/A

0.011831s

utimensat_fdlink

Passed

N/A

0.013731s

lib/libc/db/t_db_hash_seq

0.066710s

test_hash_del_all

Passed

N/A

0.016900s

test_hash_del_alt

Passed

N/A

0.015776s

test_hash_del_every_7

Passed

N/A

0.015644s

test_hash_del_none

Passed

N/A

0.015004s

lib/libc/db/t_db

373.778960s

alternate_recno

Passed

N/A

0.261116s

big_btree

Passed

N/A

0.858616s

big_hash

Passed

N/A

0.404918s

big_recno

Passed

N/A

0.830926s

bsize_ffactor

Passed

N/A

41.475998s

bsize_torture

Passed

N/A

289.767442s

btree_byteswap_unaligned_access_bksd

Passed

N/A

0.204422s

btree_byteswap_unaligned_access_skbd

Passed

N/A

0.197168s

btree_known_byte_order

Passed

N/A

0.281395s

btree_recursive_traversal

Passed

N/A

2.366486s

btree_tricky_page_split

Passed

N/A

0.445731s

btree_weird_page_split

Passed

N/A

29.640595s

byte_orders_btree

Passed

N/A

0.320335s

byte_orders_hash

Passed

N/A

0.319554s

cursor_flags_btree

Passed

N/A

0.274444s

cursor_flags_recno

Passed

N/A

0.273416s

delete_btree

Passed

N/A

0.238291s

delete_recno

Passed

N/A

0.226204s

duplicate_btree

Passed

N/A

0.211192s

four_char_hash

Passed

N/A

0.152674s

medium_btree

Passed

N/A

0.191887s

medium_hash

Passed

N/A

0.185698s

medium_recno

Passed

N/A

0.177750s

random_recno

Passed

N/A

0.307040s

repeated_btree

Passed

N/A

0.241189s

repeated_hash

Passed

N/A

0.276670s

reverse_order_recno

Passed

N/A

0.213187s

reverse_recno

Passed

N/A

0.259281s

small_btree

Passed

N/A

0.193689s

small_hash

Passed

N/A

0.191723s

small_page_btree

Passed

N/A

2.520840s

small_recno

Passed

N/A

0.190085s

lib/libc/gen/execve/t_execve

0.014022s

t_execve_null

Passed

N/A

0.013315s

lib/libc/gen/posix_spawn/t_spawn

0.107547s

t_spawn_child

Passed

N/A

0.028095s

t_spawn_ls

Passed

N/A

0.012928s

t_spawn_missing

Passed

N/A

0.012039s

t_spawn_nonexec

Passed

N/A

0.020438s

t_spawn_zero

Passed

N/A

0.016140s

t_spawnp_ls

Passed

N/A

0.013113s

lib/libc/gen/posix_spawn/t_fileactions

0.114821s

t_spawn_empty_fileactions

Passed

N/A

0.018818s

t_spawn_fileactions

Passed

N/A

0.019092s

t_spawn_open_nonexistent

Passed

N/A

0.013603s

t_spawn_open_nonexistent_diag

Passed

N/A

0.012795s

t_spawn_openmode

Passed

N/A

0.028044s

t_spawn_reopen

Passed

N/A

0.017117s

lib/libc/gen/posix_spawn/t_spawnattr

0.018996s

t_spawnattr

Passed

N/A

0.018153s

lib/libc/gen/t_alarm

1.042139s

alarm_basic

Passed

N/A

1.014848s

alarm_fork

Passed

N/A

0.013349s

alarm_previous

Passed

N/A

0.011587s

lib/libc/gen/t_assert

0.038352s

assert_false

Passed

N/A

0.015772s

assert_true

Passed

N/A

0.020049s

lib/libc/gen/t_basedirname

0.027057s

basename_posix

Passed

N/A

0.012793s

dirname_posix

Passed

N/A

0.012756s

lib/libc/gen/t_closefrom

0.079547s

closefrom_basic

Passed

N/A

0.024626s

closefrom_buffer

Passed

N/A

0.024672s

closefrom_err

Passed

N/A

0.012646s

closefrom_one

Passed

N/A

0.014672s

lib/libc/gen/t_cpuset

0.038179s

cpuset_err

Passed

N/A

0.012208s

cpuset_set

Passed

N/A

0.011800s

cpuset_size

Passed

N/A

0.011808s

lib/libc/gen/t_dir

0.049954s

seekdir_basic

Passed

N/A

0.013903s

telldir_leak

Passed

N/A

0.033681s

lib/libc/gen/t_floatunditf

0.013266s

floatunditf

Passed

N/A

0.012308s

lib/libc/gen/t_fmtcheck

0.014351s

fmtcheck_basic

Passed

N/A

0.013532s

lib/libc/gen/t_fnmatch

0.090959s

fnmatch_backslashes

Passed

N/A

0.013897s

fnmatch_casefold

Passed

N/A

0.012474s

fnmatch_initialbracket

Passed

N/A

0.011791s

fnmatch_leadingdir

Passed

N/A

0.011854s

fnmatch_noescape

Passed

N/A

0.011708s

fnmatch_pathname

Passed

N/A

0.011787s

fnmatch_period

Passed

N/A

0.011853s

lib/libc/gen/t_fpclassify

0.029512s

fpclassify_double

Passed

N/A

0.013983s

fpclassify_float

Passed

N/A

0.014025s

lib/libc/gen/t_fpsetmask

0.091436s

fpsetmask_basic

Passed

N/A

0.012589s

fpsetmask_masked_double

Passed

N/A

0.012073s

fpsetmask_masked_float

Passed

N/A

0.011891s

fpsetmask_masked_long_double

Passed

N/A

0.012031s

fpsetmask_unmasked_double

Passed

N/A

0.012044s

fpsetmask_unmasked_float

Passed

N/A

0.011902s

fpsetmask_unmasked_long_double

Passed

N/A

0.013468s

lib/libc/gen/t_fpsetround

0.015594s

fpsetround_basic

Passed

N/A

0.014776s

lib/libc/gen/t_ftok

0.039698s

ftok_err

Passed

N/A

0.013144s

ftok_link

Passed

N/A

0.024921s

lib/libc/gen/t_getcwd

1.333959s

getcwd_err

Passed

N/A

0.012160s

getcwd_fts

Passed

N/A

1.319969s

lib/libc/gen/t_getgrent

0.150319s

getgrent_loop

Passed

N/A

0.016060s

getgrent_setgid

Passed

N/A

0.132802s

lib/libc/gen/t_glob

0.027967s

glob_star

Passed

N/A

0.013285s

glob_star_not

Passed

N/A

0.013136s

lib/libc/gen/t_humanize_number

0.027607s

humanize_number_basic

Passed

N/A

0.013279s

humanize_number_big

Passed

N/A

0.012820s

lib/libc/gen/t_isnan

0.027821s

isinf_basic

Passed

N/A

0.013431s

isnan_basic

Passed

N/A

0.012839s

lib/libc/gen/t_nice

0.110119s

nice_err

Passed

N/A

0.016725s

nice_priority

Passed

N/A

0.060373s

nice_root

Passed

N/A

0.014700s

nice_thread

Passed

N/A

0.015058s

lib/libc/gen/t_pause

3.045045s

pause_basic

Passed

N/A

1.014182s

pause_kill

Passed

N/A

2.029316s

lib/libc/gen/t_raise

1.260411s

raise_err

Passed

N/A

0.013346s

raise_ret

Passed

N/A

1.013987s

raise_sig

Passed

N/A

0.109424s

raise_stress

Passed

N/A

0.120800s

lib/libc/gen/t_randomid

0.374892s

randomid_basic

Passed

N/A

0.374168s

lib/libc/gen/t_realpath

0.042243s

realpath_basic

Passed

N/A

0.013768s

realpath_huge

Passed

N/A

0.012945s

realpath_symlink

Passed

N/A

0.013333s

lib/libc/gen/t_setdomainname

0.078329s

setdomainname_basic

Passed

N/A

0.025821s

setdomainname_limit

Passed

N/A

0.024532s

setdomainname_perm

Passed

N/A

0.025304s

lib/libc/gen/t_sethostname

0.072572s

sethostname_basic

Passed

N/A

0.022748s

sethostname_limit

Passed

N/A

0.022445s

sethostname_perm

Passed

N/A

0.024799s

lib/libc/gen/t_siginfo

3.158929s

sigalarm

Passed

N/A

1.020902s

sigbus_adraln

Passed

N/A

0.014613s

sigchild_dump

Passed

N/A

1.029774s

sigchild_kill

Passed

N/A

0.016163s

sigchild_normal

Passed

N/A

1.027541s

sigfpe_flt

Passed

N/A

0.014776s

sigfpe_int

Passed

N/A

0.014610s

sigsegv

Passed

N/A

0.014800s

lib/libc/gen/t_sleep

166.030197s

kevent

Passed

N/A

26.598320s

nanosleep

Passed

N/A

36.789874s

poll

Passed

N/A

36.789628s

select

Passed

N/A

36.789797s

sleep

Passed

N/A

29.059455s

lib/libc/gen/t_syslog

0.016654s

syslog_pthread

Passed

N/A

0.015817s

lib/libc/gen/t_time

10.132418s

time_copy

Passed

N/A

0.012084s

time_mono

Passed

N/A

10.105595s

time_timeofday

Passed

N/A

0.012438s

lib/libc/gen/t_ttyname

0.060439s

ttyname_err

Passed

N/A

0.015789s

ttyname_r_err

Passed

N/A

0.015243s

ttyname_r_stdin

Passed

N/A

0.013023s

ttyname_stdin

Passed

N/A

0.012977s

lib/libc/gen/t_vis

0.101933s

strunvis_hex

Passed

N/A

0.013601s

strvis_basic

Passed

N/A

0.016023s

strvis_empty

Passed

N/A

0.013211s

strvis_locale

Passed

N/A

0.043403s

strvis_null

Passed

N/A

0.011948s

lib/libc/hash/t_sha2

0.042434s

t_sha256

Passed

N/A

0.013070s

t_sha384

Passed

N/A

0.013336s

t_sha512

Passed

N/A

0.013532s

lib/libc/hash/t_hmac

3.005356s

t_hmac

Passed

N/A

3.004362s

lib/libc/hash/t_hash

1.418574s

md5

Passed

N/A

0.160606s

sha1

Passed

N/A

1.256459s

lib/libc/inet/t_inet_addr

0.027042s

inet_addr_basic

Passed

N/A

0.012833s

inet_addr_err

Passed

N/A

0.012934s

lib/libc/inet/t_inet_network

0.028326s

inet_network_basic

Passed

N/A

0.013680s

inet_network_err

Passed

N/A

0.012881s

lib/libc/locale/t_mbrtowc

0.132784s

mbrtowc_internal

Passed

N/A

0.112084s

mbrtowc_object

Passed

N/A

0.019681s

lib/libc/locale/t_mbstowcs

0.031576s

mbstowcs_basic

Passed

N/A

0.031032s

lib/libc/locale/t_mbsnrtowcs

0.015857s

mbsnrtowcs

Passed

N/A

0.015224s

lib/libc/locale/t_mbtowc

0.138547s

mbtowc

Passed

N/A

0.137972s

lib/libc/locale/t_wcscspn

0.013793s

wcscspn

Passed

N/A

0.013167s

lib/libc/locale/t_wcspbrk

0.012496s

wcspbrk

Passed

N/A

0.011629s

lib/libc/locale/t_wcsspn

0.014374s

wcsspn

Passed

N/A

0.013465s

lib/libc/locale/t_wcstod

0.249108s

wcstod

Passed

N/A

0.248471s

lib/libc/locale/t_wctomb

0.044188s

wcrtomb

Passed

N/A

0.014099s

wcrtomb_state

Passed

N/A

0.014220s

wctomb

Passed

N/A

0.014080s

lib/libc/locale/t_io

0.082941s

bad_big5_getwc

Passed

N/A

0.013625s

bad_big5_swprintf

Passed

N/A

0.013265s

bad_big5_wprintf

Passed

N/A

0.013047s

good_big5_getwc

Passed

N/A

0.013423s

good_big5_swprintf

Passed

N/A

0.012885s

good_big5_wprintf

Passed

N/A

0.013099s

lib/libc/net/getaddrinfo/t_getaddrinfo

1.136087s

basic

Passed

N/A

0.230322s

empty_hostname

Passed

N/A

0.200111s

empty_servname

Passed

N/A

0.161731s

scopeaddr

Passed

N/A

0.115239s

sock_raw

Passed

N/A

0.159883s

specific

Passed

N/A

0.151631s

unsupported_family

Passed

N/A

0.111270s

lib/libc/net/t_getprotoent

0.103683s

endprotoent_rewind

Passed

N/A

0.012724s

getprotobyname_basic

Passed

N/A

0.014192s

getprotobyname_err

Passed

N/A

0.019236s

getprotobynumber_basic

Passed

N/A

0.013974s

getprotobynumber_err

Passed

N/A

0.014745s

getprotoent_next

Passed

N/A

0.012390s

setprotoent_rewind

Passed

N/A

0.012131s

lib/libc/net/t_ether_aton

0.011998s

tc_ether_aton

Passed

N/A

0.011279s

lib/libc/net/t_nsdispatch

0.138300s

recurse

Passed

N/A

0.137358s

lib/libc/net/t_protoent

0.184682s

protoent

Passed

N/A

0.183392s

lib/libc/net/t_servent

1.421556s

servent

Passed

N/A

1.417940s

lib/libc/net/t_hostent

4.319646s

dnsbyaddrlookup4

Passed

N/A

0.481549s

dnsbyaddrlookup6

Passed

N/A

0.467834s

dnsbynamelookup4

Passed

N/A

0.463153s

dnsbynamelookup6

Passed

N/A

0.469655s

gethostbyaddr4

Passed

N/A

0.471823s

gethostbyaddr6

Passed

N/A

0.473812s

gethostbyname4

Passed

N/A

0.458225s

gethostbyname6

Passed

N/A

0.456129s

hostsbyaddrlookup4

Passed

N/A

0.142600s

hostsbyaddrlookup6

Passed

N/A

0.140524s

hostsbynamelookup4

Passed

N/A

0.135786s

hostsbynamelookup6

Passed

N/A

0.140759s

lib/libc/regex/t_regex_att

0.153907s

basic

Passed

N/A

0.040635s

categorization

Passed

N/A

0.021797s

forcedassoc

Passed

N/A

0.021999s

leftassoc

Expected failure

Reason for breakage unknown: /usr/src/tests/lib/libc/regex/t_regex_att.c:377: res != matches ((0,4)(0,2)(2,3)(3,4) != (0,4)(0,1)(1,4)(4,4)): at line 3

0.014114s

nullsubexpr

Passed

N/A

0.016859s

repetition

Passed

N/A

0.020235s

rightassoc

Passed

N/A

0.014112s

lib/libc/regex/t_exhaust

0.459889s

regcomp_too_big

Passed

N/A

0.459227s

lib/libc/regex/t_regex

4.352127s

anchor

Passed

N/A

0.229596s

backref

Passed

N/A

0.225796s

basic

Passed

N/A

0.219297s

bracket

Passed

N/A

0.253923s

c_comments

Passed

N/A

0.222180s

complex

Passed

N/A

0.215588s

error

Passed

N/A

0.259487s

meta

Passed

N/A

0.238496s

nospec

Passed

N/A

0.221884s

paren

Passed

N/A

0.225914s

regress

Passed

N/A

0.221292s

repet_bounded

Passed

N/A

0.279385s

repet_multi

Passed

N/A

0.231943s

repet_ordinary

Passed

N/A

0.217091s

startend

Passed

N/A

0.210539s

subexp

Passed

N/A

0.220633s

subtle

Passed

N/A

0.211154s

word_bound

Passed

N/A

0.213616s

zero

Passed

N/A

0.220094s

lib/libc/rpc/t_xdr

0.013258s

xdr

Passed

N/A

0.012351s

lib/libc/rpc/t_rpc

4.208131s

get_svc_addr_tcp

Passed

N/A

0.028253s

get_svc_addr_udp

Passed

N/A

0.021903s

raw

Passed

N/A

0.017857s

tcp

Passed

N/A

1.027694s

tcp_poll

Passed

N/A

1.036861s

udp

Passed

N/A

1.034170s

udp_poll

Passed

N/A

1.029311s

lib/libc/setjmp/t_setjmp

0.048931s

_setjmp

Passed

N/A

0.011752s

setjmp

Passed

N/A

0.011692s

sigsetjmp_nosave

Passed

N/A

0.011594s

sigsetjmp_save

Passed

N/A

0.011754s

lib/libc/setjmp/t_threadjmp

0.054706s

_setjmp

Passed

N/A

0.013112s

setjmp

Passed

N/A

0.013294s

sigsetjmp_nosave

Passed

N/A

0.013430s

sigsetjmp_save

Passed

N/A

0.012714s

lib/libc/stdlib/t_abs

0.048612s

abs_basic

Passed

N/A

0.011768s

imaxabs_basic

Passed

N/A

0.011629s

labs_basic

Passed

N/A

0.011742s

llabs_basic

Passed

N/A

0.011340s

lib/libc/stdlib/t_atoi

0.050012s

atof_strtod

Passed

N/A

0.012576s

atoi_strtol

Passed

N/A

0.011705s

atol_strtol

Passed

N/A

0.011836s

atoll_strtoll

Passed

N/A

0.011740s

lib/libc/stdlib/t_div

0.038553s

div_basic

Passed

N/A

0.011922s

ldiv_basic

Passed

N/A

0.011669s

lldiv_basic

Passed

N/A

0.013319s

lib/libc/stdlib/t_getenv

17.910430s

clearenv_basic

Passed

N/A

0.062857s

getenv_basic

Passed

N/A

0.011631s

putenv_basic

Passed

N/A

0.013151s

setenv_basic

Passed

N/A

17.808106s

setenv_mixed

Passed

N/A

0.012025s

lib/libc/stdlib/t_getenv_thread

39.947230s

getenv_r_thread

Passed

N/A

9.946454s

putenv_thread

Passed

N/A

9.999453s

setenv_thread

Passed

N/A

9.999376s

unsetenv_thread

Passed

N/A

9.999314s

lib/libc/stdlib/t_exit

0.087584s

exit_atexit

Passed

N/A

0.015208s

exit_basic

Passed

N/A

0.015502s

exit_status

Passed

N/A

0.035390s

exit_tmpfile

Passed

N/A

0.018395s

lib/libc/stdlib/t_hsearch

0.109632s

hsearch_basic

Passed

N/A

0.013511s

hsearch_duplicate

Passed

N/A

0.013026s

hsearch_nonexistent

Passed

N/A

0.012968s

hsearch_r_basic

Passed

N/A

0.012916s

hsearch_r_duplicate

Passed

N/A

0.012939s

hsearch_r_nonexistent

Passed

N/A

0.012858s

hsearch_r_two

Passed

N/A

0.013113s

hsearch_two

Passed

N/A

0.012554s

lib/libc/stdlib/t_mi_vector_hash

0.012812s

mi_vector_hash_basic

Passed

N/A

0.012018s

lib/libc/stdlib/t_posix_memalign

0.028154s

aligned_alloc_basic

Passed

N/A

0.013597s

posix_memalign_basic

Passed

N/A

0.013148s

lib/libc/stdlib/t_random

0.018199s

random_same

Passed

N/A

0.017413s

lib/libc/stdlib/t_strtod

0.167932s

strtod_basic

Passed

N/A

0.017292s

strtod_gherman_bug

Passed

N/A

0.014590s

strtod_hex

Passed

N/A

0.014211s

strtod_inf

Passed

N/A

0.014259s

strtod_nan

Passed

N/A

0.014232s

strtod_round

Passed

N/A

0.014250s

strtod_underflow

Passed

N/A

0.014345s

strtof_inf

Passed

N/A

0.014263s

strtof_nan

Passed

N/A

0.014195s

strtold_inf

Passed

N/A

0.014243s

strtold_nan

Passed

N/A

0.014249s

lib/libc/stdlib/t_strtol

0.053615s

strtol_base

Passed

N/A

0.013187s

strtol_case

Passed

N/A

0.012904s

strtol_range

Passed

N/A

0.012340s

strtol_signed

Passed

N/A

0.011722s

lib/libc/stdlib/t_strtoi

0.050808s

strtoi_base

Passed

N/A

0.012220s

strtoi_case

Passed

N/A

0.011754s

strtoi_range

Passed

N/A

0.011921s

strtoi_signed

Passed

N/A

0.011798s

lib/libc/stdlib/t_system

0.071450s

system_basic

Passed

N/A

0.070650s

lib/libc/stdlib/t_atexit

0.123541s

atexit

Passed

N/A

0.122318s

lib/libc/stdlib/t_getopt

0.867952s

getopt

Passed

N/A

0.464491s

getopt_long

Passed

N/A

0.401851s

lib/libc/stdio/t_clearerr

0.034497s

clearerr_basic

Passed

N/A

0.021136s

clearerr_err

Passed

N/A

0.011802s

lib/libc/stdio/t_fflush

0.070264s

fflush_err

Passed

N/A

0.022670s

fflush_seek

Passed

N/A

0.022766s

fpurge_err

Passed

N/A

0.022419s

lib/libc/stdio/t_fmemopen

0.434466s

test00

Passed

N/A

0.012528s

test01

Passed

N/A

0.012234s

test02

Passed

N/A

0.012546s

test03

Passed

N/A

0.014478s

test04

Passed

N/A

0.015799s

test05

Passed

N/A

0.013518s

test06

Passed

N/A

0.013430s

test07

Passed

N/A

0.012633s

test08

Passed

N/A

0.012246s

test09

Passed

N/A

0.027871s

test10

Passed

N/A

0.024628s

test11

Passed

N/A

0.023052s

test12

Passed

N/A

0.018907s

test13

Passed

N/A

0.019219s

test14

Passed

N/A

0.019278s

test15

Passed

N/A

0.022171s

test16

Passed

N/A

0.015220s

test17

Passed

N/A

0.017321s

test18

Passed

N/A

0.013168s

test19

Passed

N/A

0.027042s

test20

Passed

N/A

0.014016s

test21

Passed

N/A

0.017607s

test22

Passed

N/A

0.038585s

lib/libc/stdio/t_fopen

0.236050s

fdopen_close

Passed

N/A

0.023292s

fdopen_err

Passed

N/A

0.025081s

fdopen_seek

Passed

N/A

0.023008s

fopen_append

Passed

N/A

0.023272s

fopen_err

Passed

N/A

0.026462s

fopen_mode

Passed

N/A

0.026413s

fopen_perm

Passed

N/A

0.015444s

fopen_regular

Passed

N/A

0.013352s

fopen_seek

Passed

N/A

0.025462s

freopen_std

Passed

N/A

0.026172s

lib/libc/stdio/t_open_memstream

0.013975s

test_open_memstream

Passed

N/A

0.013139s

lib/libc/stdio/t_fputc

0.153932s

fputc_basic

Passed

N/A

0.025642s

fputc_err

Passed

N/A

0.024519s

putc_basic

Passed

N/A

0.025377s

putc_err

Passed

N/A

0.024708s

putc_unlocked_basic

Passed

N/A

0.025677s

putc_unlocked_err

Passed

N/A

0.023291s

lib/libc/stdio/t_mktemp

0.013066s

mktemp_not_exist

Passed

N/A

0.012276s

lib/libc/stdio/t_popen

0.178383s

popen_zeropad

Passed

N/A

0.177601s

lib/libc/stdio/t_printf

0.568928s

snprintf_c99

Passed

N/A

0.014166s

snprintf_dotzero

Passed

N/A

0.013644s

snprintf_float

Passed

N/A

0.486056s

snprintf_posarg

Passed

N/A

0.013358s

snprintf_posarg_error

Passed

N/A

0.012444s

snprintf_posarg_width

Passed

N/A

0.012247s

sprintf_zeropad

Passed

N/A

0.011917s

lib/libc/stdio/t_scanf

0.025692s

sscanf_neghex

Passed

N/A

0.012293s

sscanf_whitespace

Passed

N/A

0.011826s

lib/libc/string/t_bm

0.012573s

bm

Passed

N/A

0.011851s

lib/libc/string/t_memchr

0.040455s

memchr_basic

Passed

N/A

0.013586s

memchr_simple

Passed

N/A

0.012566s

memrchr_simple

Passed

N/A

0.012223s

lib/libc/string/t_memcpy

3.291040s

memccpy_simple

Passed

N/A

0.012374s

memcpy_basic

Passed

N/A

3.263985s

memcpy_return

Passed

N/A

0.012292s

lib/libc/string/t_memmem

0.012671s

memmem_basic

Passed

N/A

0.011952s

lib/libc/string/t_memset

0.099238s

bzero_zero_size

Passed

N/A

0.013514s

memset_array

Passed

N/A

0.012958s

memset_basic

Passed

N/A

0.013092s

memset_nonzero

Passed

N/A

0.016514s

memset_return

Passed

N/A

0.011938s

memset_struct

Passed

N/A

0.013085s

memset_zero_size

Passed

N/A

0.012959s

lib/libc/string/t_popcount

0.027915s

popcount_basic

Skipped

config variable "run_popcount" not set to YES/TRUE

0.013234s

popcountll_basic

Skipped

config variable "run_popcount" not set to YES/TRUE

0.012902s

lib/libc/string/t_strcat

0.058630s

strcat_basic

Passed

N/A

0.045542s

strncat_simple

Passed

N/A

0.011576s

lib/libc/string/t_strchr

0.015785s

strchr_basic

Passed

N/A

0.015088s

lib/libc/string/t_strcmp

0.027491s

strcmp_basic

Passed

N/A

0.013247s

strcmp_simple

Passed

N/A

0.012786s

lib/libc/string/t_strcpy

0.014049s

strcpy_basic

Passed

N/A

0.013241s

lib/libc/string/t_strcspn

0.012723s

strcspn

Passed

N/A

0.011915s

lib/libc/string/t_strerror

0.109948s

strerror_basic

Passed

N/A

0.039746s

strerror_err

Passed

N/A

0.013955s

strerror_r_basic

Passed

N/A

0.039677s

strerror_r_err

Passed

N/A

0.013944s

lib/libc/string/t_stresep

0.012919s

stresep_basic

Passed

N/A

0.012131s

lib/libc/string/t_strlen

0.399216s

strlen_basic

Passed

N/A

0.012292s

strlen_huge

Passed

N/A

0.372293s

strnlen_basic

Passed

N/A

0.012228s

lib/libc/string/t_strpbrk

0.012732s

strpbrk

Passed

N/A

0.011921s

lib/libc/string/t_strrchr

0.013131s

strrchr_basic

Passed

N/A

0.012359s

lib/libc/string/t_strspn

0.012952s

strspn

Passed

N/A

0.012135s

lib/libc/string/t_swab

0.013058s

swab_basic

Passed

N/A

0.012245s

lib/libc/sys/t_access

0.095146s

access_access

Passed

N/A

0.025697s

access_fault

Passed

N/A

0.011725s

access_inval

Passed

N/A

0.014219s

access_notdir

Passed

N/A

0.013406s

access_notexist

Passed

N/A

0.012844s

access_toolong

Passed

N/A

0.012818s

lib/libc/sys/t_bind

0.013593s

bind_foreign_family

Passed

N/A

0.012783s

lib/libc/sys/t_chroot

0.092592s

chroot_basic

Passed

N/A

0.015971s

chroot_err

Passed

N/A

0.012958s

chroot_perm

Passed

N/A

0.016585s

fchroot_basic

Passed

N/A

0.014196s

fchroot_err

Passed

N/A

0.012099s

fchroot_perm

Passed

N/A

0.015315s

lib/libc/sys/t_clock_gettime

17.294674s

clock_gettime_real

Passed

N/A

17.294640s

lib/libc/sys/t_clock_nanosleep

0.012893s

clock_nanosleep_remain

Passed

N/A

0.012077s

lib/libc/sys/t_clone

0.056625s

clone_basic

Passed

N/A

0.013181s

clone_null_func

Passed

N/A

0.013469s

clone_null_stack

Passed

N/A

0.012938s

clone_out_of_proc

Passed

N/A

0.013796s

lib/libc/sys/t_connect

0.027670s

connect_foreign_family

Passed

N/A

0.012210s

connect_low_port

Passed

N/A

0.013871s

lib/libc/sys/t_dup

0.185620s

dup2_basic

Passed

N/A

0.013438s

dup2_err

Passed

N/A

0.013161s

dup2_max

Passed

N/A

0.013102s

dup2_mode

Passed

N/A

0.026323s

dup3_err

Passed

N/A

0.012937s

dup3_max

Passed

N/A

0.013022s

dup3_mode

Passed

N/A

0.024920s

dup_err

Passed

N/A

0.011825s

dup_max

Passed

N/A

0.025303s

dup_mode

Passed

N/A

0.024117s

lib/libc/sys/t_fsync

0.028737s

fsync_err

Passed

N/A

0.013584s

fsync_sync

Passed

N/A

0.013454s

lib/libc/sys/t_getcontext

0.040638s

getcontext_err

Passed

N/A

0.012214s

setcontext_err

Passed

N/A

0.013166s

setcontext_link

Passed

N/A

0.013150s

lib/libc/sys/t_getgroups

0.066320s

getgroups_err

Passed

N/A

0.012822s

getgroups_getgid

Passed

N/A

0.012616s

getgroups_setgid

Passed

N/A

0.024951s

getgroups_zero

Passed

N/A

0.013026s

lib/libc/sys/t_getitimer

0.077606s

getitimer_empty

Passed

N/A

0.012496s

getitimer_err

Passed

N/A

0.012079s

setitimer_basic

Passed

N/A

0.024979s

setitimer_err

Passed

N/A

0.011973s

setitimer_old

Passed

N/A

0.012200s

lib/libc/sys/t_getlogin

0.077157s

getlogin_r_err

Passed

N/A

0.013297s

getlogin_same

Passed

N/A

0.012793s

setlogin_basic

Passed

N/A

0.014994s

setlogin_err

Passed

N/A

0.015432s

setlogin_perm

Passed

N/A

0.016933s

lib/libc/sys/t_getpid

0.053618s

getpid_process

Passed

N/A

0.037955s

getpid_thread

Passed

N/A

0.013969s

lib/libc/sys/t_getrusage

13.164410s

getrusage_err

Passed

N/A

0.011973s

getrusage_sig

Passed

N/A

0.011960s

getrusage_utime_back

Expected failure

PR kern/30115: anticipated error did not occur

9.191009s

getrusage_utime_zero

Expected failure

PR kern/30115: anticipated error did not occur

3.946093s

lib/libc/sys/t_getsid

0.040023s

getsid_current

Passed

N/A

0.012135s

getsid_err

Passed

N/A

0.011944s

getsid_process

Passed

N/A

0.013522s

lib/libc/sys/t_getsockname

0.012912s

getsockname_unix

Passed

N/A

0.012092s

lib/libc/sys/t_gettimeofday

0.026089s

gettimeofday_err

Passed

N/A

0.011915s

gettimeofday_mono

Passed

N/A

0.012627s

lib/libc/sys/t_issetugid

0.066497s

issetugid_egid

Passed

N/A

0.015072s

issetugid_euid

Passed

N/A

0.014747s

issetugid_rgid

Passed

N/A

0.016809s

issetugid_ruid

Passed

N/A

0.016907s

lib/libc/sys/t_kevent

0.103217s

kevent_zerotimer

Passed

N/A

0.017595s

kqueue_desc_passing

Skipped

PR kern/46523

0.015845s

kqueue_unsupported_fd

Passed

N/A

0.067575s

lib/libc/sys/t_kill

1.085878s

kill_basic

Passed

N/A

0.015485s

kill_err

Passed

N/A

0.013941s

kill_perm

Passed

N/A

1.020568s

kill_pgrp_neg

Passed

N/A

0.014949s

kill_pgrp_zero

Passed

N/A

0.017200s

lib/libc/sys/t_link

0.094070s

link_count

Passed

N/A

0.025369s

link_err

Passed

N/A

0.024878s

link_perm

Passed

N/A

0.014990s

link_stat

Passed

N/A

0.024917s

lib/libc/sys/t_listen

0.040308s

listen_err

Passed

N/A

0.025676s

listen_low_port

Passed

N/A

0.012873s

lib/libc/sys/t_lwp_ctl

0.032223s

lwpctl_counter

Passed

N/A

0.031664s

lib/libc/sys/t_lwp_create

0.081544s

lwp_create_generic_fail_no_uc_cpu

Passed

N/A

0.012806s

lwp_create_sparc_fail_npc_null

Passed

N/A

0.011667s

lwp_create_sparc_fail_npc_odd

Passed

N/A

0.013816s

lwp_create_sparc_fail_pc_null

Passed

N/A

0.013056s

lwp_create_sparc_fail_pc_odd

Passed

N/A

0.013100s

lwp_create_works

Passed

N/A

0.013235s

lib/libc/sys/t_minherit

0.077468s

minherit_bad

Passed

N/A

0.012807s

minherit_copy

Passed

N/A

0.015547s

minherit_none

Passed

N/A

0.014860s

minherit_share

Passed

N/A

0.015829s

minherit_zero

Passed

N/A

0.014627s

lib/libc/sys/t_mincore

0.107490s

mincore_err

Passed

N/A

0.011842s

mincore_resid

Passed

N/A

0.073784s

mincore_shmseg

Passed

N/A

0.019508s

lib/libc/sys/t_mkdir

1.083025s

mkdir_err

Passed

N/A

0.012411s

mkdir_mode

Passed

N/A

1.029860s

mkdir_perm

Passed

N/A

0.024966s

mkdir_trail

Passed

N/A

0.012394s

lib/libc/sys/t_mkfifo

2.132263s

mkfifo_block

Passed

N/A

1.028314s

mkfifo_err

Passed

N/A

0.023324s

mkfifo_nonblock

Passed

N/A

1.025557s

mkfifo_perm

Passed

N/A

0.025109s

mkfifo_stat

Passed

N/A

0.025660s

lib/libc/sys/t_mknod

0.106679s

mknod_err

Passed

N/A

0.025808s

mknod_exist

Passed

N/A

0.024990s

mknod_perm

Passed

N/A

0.027693s

mknod_stat

Passed

N/A

0.024797s

lib/libc/sys/t_mlock

0.071883s

mlock_clip

Passed

N/A

0.013075s

mlock_err

Passed

N/A

0.012548s

mlock_limits

Passed

N/A

0.018154s

mlock_mmap

Passed

N/A

0.012904s

mlock_nested

Passed

N/A

0.012081s

lib/libc/sys/t_mmap

0.191690s

mmap_block

Skipped

The test case causes a panic (PR kern/38889, kern/46592)

0.012566s

mmap_err

Passed

N/A

0.013756s

mmap_loan

Passed

N/A

0.028380s

mmap_prot_1

Passed

N/A

0.025234s

mmap_prot_2

Passed

N/A

0.015248s

mmap_prot_3

Passed

N/A

0.027587s

mmap_truncate

Passed

N/A

0.025634s

mmap_truncate_signal

Passed

N/A

0.024975s

mmap_va0

Passed

N/A

0.011995s

lib/libc/sys/t_mprotect

0.076722s

mprotect_access

Passed

N/A

0.023399s

mprotect_err

Passed

N/A

0.011649s

mprotect_exec

Skipped

Execute protection callback check not implemented

0.011821s

mprotect_pax

Failed

non-executable mapping made executable

0.012375s

mprotect_write

Passed

N/A

0.013458s

lib/libc/sys/t_msgctl

2.137178s

msgctl_err

Passed

N/A

0.023220s

msgctl_perm

Passed

N/A

0.025677s

msgctl_pid

Passed

N/A

2.038377s

msgctl_set

Passed

N/A

0.023610s

msgctl_time

Passed

N/A

0.022261s

lib/libc/sys/t_msgget

0.116438s

msgget_excl

Passed

N/A

0.025514s

msgget_exit

Passed

N/A

0.026406s

msgget_init

Passed

N/A

0.022857s

msgget_limit

Passed

N/A

0.014173s

msgget_mode

Passed

N/A

0.023582s

lib/libc/sys/t_msgrcv

4.165631s

msgrcv_basic

Passed

N/A

0.022525s

msgrcv_block

Passed

N/A

2.038754s

msgrcv_err

Passed

N/A

0.022553s

msgrcv_mtype

Passed

N/A

0.023919s

msgrcv_nonblock

Passed

N/A

2.030959s

msgrcv_truncate

Passed

N/A

0.022191s

lib/libc/sys/t_msgsnd

4.132619s

msgsnd_block

Passed

N/A

2.027465s

msgsnd_count

Passed

N/A

0.023219s

msgsnd_err

Passed

N/A

0.022583s

msgsnd_nonblock

Passed

N/A

2.030643s

msgsnd_perm

Passed

N/A

0.025538s

lib/libc/sys/t_msync

0.077709s

msync_async

Passed

N/A

0.017057s

msync_err

Passed

N/A

0.022794s

msync_invalidate

Passed

N/A

0.017645s

msync_sync

Passed

N/A

0.017347s

lib/libc/sys/t_nanosleep

1.224211s

nanosleep_basic

Passed

N/A

0.192608s

nanosleep_err

Passed

N/A

0.012712s

nanosleep_sig

Passed

N/A

1.016664s

lib/libc/sys/t_pipe

2.035787s

pipe_restart

Passed

N/A

2.035077s

lib/libc/sys/t_pipe2

0.081785s

pipe2_basic

Passed

N/A

0.013467s

pipe2_cloexec

Passed

N/A

0.013005s

pipe2_consume

Passed

N/A

0.013016s

pipe2_einval

Passed

N/A

0.012874s

pipe2_nonblock

Passed

N/A

0.012872s

pipe2_nosigpipe

Passed

N/A

0.012974s

lib/libc/sys/t_poll

11.105555s

poll_3way

Passed

N/A

10.023632s

poll_basic

Passed

N/A

0.026025s

poll_err

Passed

N/A

0.012172s

pollts_basic

Passed

N/A

1.016907s

pollts_err

Passed

N/A

0.011851s

pollts_sigmask

Passed

N/A

0.011726s

lib/libc/sys/t_posix_fallocate

0.012548s

ebadf

Passed

N/A

0.011964s

lib/libc/sys/t_recvmmsg

0.084384s

recvmmsg_basic

Passed

N/A

0.083832s

lib/libc/sys/t_revoke

0.068247s

revoke_basic

Passed

N/A

0.026945s

revoke_err

Passed

N/A

0.013713s

revoke_perm

Passed

N/A

0.025660s

lib/libc/sys/t_select

1.035680s

pselect_sigmask

Passed

N/A

1.017739s

pselect_timeout

Passed

N/A

0.016448s

lib/libc/sys/t_setrlimit

0.176841s

setrlimit_basic

Passed

N/A

0.013884s

setrlimit_current

Passed

N/A

0.012385s

setrlimit_err

Passed

N/A

0.012234s

setrlimit_fsize

Passed

N/A

0.024712s

setrlimit_memlock

Passed

N/A

0.013925s

setrlimit_nofile_1

Passed

N/A

0.015157s

setrlimit_nofile_2

Passed

N/A

0.015213s

setrlimit_nproc

Passed

N/A

0.015450s

setrlimit_nthr

Passed

N/A

0.013422s

setrlimit_perm

Passed

N/A

0.015409s

setrlimit_stack

Passed

N/A

0.015214s

lib/libc/sys/t_setuid

0.118602s

setuid_perm

Passed

N/A

0.013585s

setuid_real

Passed

N/A

0.011464s

setuid_root

Passed

N/A

0.090675s

lib/libc/sys/t_sigaction

0.044416s

sigaction_basic

Passed

N/A

0.012292s

sigaction_noflags

Passed

N/A

0.014971s

sigaction_resethand

Passed

N/A

0.014500s

lib/libc/sys/t_sigqueue

1.041675s

sigqueue_basic

Passed

N/A

0.012257s

sigqueue_err

Passed

N/A

0.011570s

sigqueue_rt

Passed

N/A

1.015521s

lib/libc/sys/t_sigtimedwait

10.051836s

sigtimedwait_NULL_timeout

Passed

N/A

5.021201s

sigtimedwait_all0timeout

Passed

N/A

0.012227s

sigtimedwait_small_timeout

Passed

N/A

5.016013s

lib/libc/sys/t_socketpair

0.039589s

socketpair_basic

Passed

N/A

0.012072s

socketpair_cloexec

Passed

N/A

0.012116s

socketpair_nonblock

Passed

N/A

0.013390s

lib/libc/sys/t_swapcontext

0.028281s

swapcontext1

Passed

N/A

0.013327s

swapcontext2

Passed

N/A

0.013629s

lib/libc/sys/t_stat

4.356494s

stat_chflags

Passed

N/A

0.025752s

stat_dir

Passed

N/A

1.182520s

stat_err

Passed

N/A

0.012455s

stat_mtime

Passed

N/A

3.044678s

stat_perm

Passed

N/A

0.022576s

stat_size

Passed

N/A

0.023072s

stat_socket

Passed

N/A

0.012522s

stat_symlink

Passed

N/A

0.026332s

lib/libc/sys/t_timer_create

6.095343s

timer_create_err

Passed

N/A

0.012213s

timer_create_mono

Passed

N/A

1.022411s

timer_create_mono_expire

Passed

N/A

2.018755s

timer_create_real

Passed

N/A

1.020165s

timer_create_real_expire

Passed

N/A

2.018758s

lib/libc/sys/t_truncate

0.083256s

ftruncate_basic

Passed

N/A

0.025247s

ftruncate_err

Passed

N/A

0.013726s

truncate_basic

Passed

N/A

0.025573s

truncate_err

Passed

N/A

0.014855s

lib/libc/sys/t_ucontext

0.014412s

ucontext_basic

Passed

N/A

0.013839s

lib/libc/sys/t_umask

0.090078s

umask_fork

Passed

N/A

0.042441s

umask_open

Passed

N/A

0.023334s

umask_previous

Passed

N/A

0.022513s

lib/libc/sys/t_unlink

0.138145s

unlink_basic

Passed

N/A

0.063983s

unlink_err

Passed

N/A

0.023757s

unlink_fifo

Passed

N/A

0.022273s

unlink_perm

Passed

N/A

0.024837s

lib/libc/sys/t_wait

0.091312s

wait6_coredumped

Passed

N/A

0.017822s

wait6_exited

Passed

N/A

0.014196s

wait6_invalid

Passed

N/A

0.011912s

wait6_stop_and_go

Passed

N/A

0.013128s

wait6_stopgo_loop

Passed

N/A

0.016985s

wait6_terminated

Passed

N/A

0.013143s

lib/libc/sys/t_wait_noproc

0.140953s

wait

Passed

N/A

0.012107s

wait3

Passed

N/A

0.012970s

wait3_options

Passed

N/A

0.012534s

wait4

Passed

N/A

0.012220s

wait4_options

Passed

N/A

0.012101s

wait6

Passed

N/A

0.012133s

wait6_options

Passed

N/A

0.012289s

waitid

Passed

N/A

0.012015s

waitid_options

Passed

N/A

0.012408s

waitpid

Passed

N/A

0.012288s

waitpid_options

Passed

N/A

0.012115s

lib/libc/sys/t_wait_noproc_wnohang

0.126933s

wait3

Passed

N/A

0.012257s

wait3_options

Passed

N/A

0.012345s

wait4

Passed

N/A

0.012066s

wait4_options

Passed

N/A

0.012182s

wait6

Passed

N/A

0.012217s

wait6_options

Passed

N/A

0.012378s

waitid

Passed

N/A

0.011732s

waitid_options

Passed

N/A

0.012383s

waitpid

Passed

N/A

0.011958s

waitpid_options

Passed

N/A

0.012202s

lib/libc/sys/t_write

0.096222s

write_err

Passed

N/A

0.023527s

write_pipe

Passed

N/A

0.011572s

write_pos

Passed

N/A

0.023270s

write_ret

Passed

N/A

0.023251s

writev_iovmax

Passed

N/A

0.011757s

lib/libc/sys/t_posix_fadvise

0.086505s

posix_fadvise

Passed

N/A

0.021466s

posix_fadvise_reg

Passed

N/A

0.063406s

lib/libc/termios/t_tcsetpgrp

0.014058s

tcsetpgrp_err

Passed

N/A

0.013213s

lib/libc/time/t_mktime

0.043424s

localtime_r_gmt

Passed

N/A

0.013953s

mktime_negyear

Passed

N/A

0.013842s

timegm_epoch

Passed

N/A

0.013035s

lib/libc/time/t_strptime

0.127816s

Zone

Passed

N/A

0.035158s

common

Passed

N/A

0.011700s

day

Passed

N/A

0.011680s

hour

Passed

N/A

0.011757s

month

Passed

N/A

0.011559s

seconds

Passed

N/A

0.011709s

year

Passed

N/A

0.013113s

zone

Passed

N/A

0.016836s

lib/libc/tls/t_tls_static

0.008355s

t_tls_static

Passed

N/A

0.007826s

lib/libc/tls/t_tls_dynamic

0.023838s

t_tls_dynamic

Passed

N/A

0.023292s

lib/libc/tls/t_tls_dlopen

0.029824s

t_tls_dlopen

Passed

N/A

0.029236s

lib/libc/ttyio/t_ptm

0.027403s

ptm

Passed

N/A

0.013227s

ptmx

Passed

N/A

0.013046s

lib/libc/ttyio/t_ttyio

2.021849s

ioctl

Passed

N/A

2.020949s

lib/libc/ssp/t_ssp

3.186846s

fgets

Passed

N/A

0.177000s

getcwd

Passed

N/A

0.161266s

gets

Passed

N/A

0.172441s

memcpy

Passed

N/A

0.174305s

memmove

Passed

N/A

0.167995s

memset

Passed

N/A

0.164492s

raw

Passed

N/A

0.155667s

read

Passed

N/A

0.176633s

readlink

Passed

N/A

0.156851s

snprintf

Passed

N/A

0.164810s

sprintf

Passed

N/A

0.163707s

stpcpy

Passed

N/A

0.171118s

stpncpy

Passed

N/A

0.164758s

strcat

Passed

N/A

0.171256s

strcpy

Passed

N/A

0.165985s

strncat

Passed

N/A

0.171254s

strncpy

Passed

N/A

0.168145s

vsnprintf

Passed

N/A

0.153313s

vsprintf

Passed

N/A

0.155831s

lib/libc/t_convfp

0.050453s

cast_ulong

Passed

N/A

0.012091s

cast_ulong2

Passed

N/A

0.011759s

conv_uint

Passed

N/A

0.011618s

conv_ulong

Passed

N/A

0.011930s

lib/libc/t_gdtoa

0.021069s

long_format

Passed

N/A

0.020062s

lib/libc/t_cdb

0.121262s

cdb

Passed

N/A

0.120416s

lib/libcrypt/t_crypt

0.024079s

crypt_salts

Passed

N/A

0.023260s

lib/libcurses/t_curses

14.011199s

addch

Passed

N/A

0.376278s

addchnstr

Passed

N/A

0.202775s

addchstr

Passed

N/A

0.209637s

addnstr

Passed

N/A

0.189047s

addstr

Passed

N/A

0.188994s

assume_default_colors

Passed

N/A

0.340767s

attributes

Passed

N/A

0.408371s

background

Passed

N/A

0.419365s

box

Passed

N/A

0.284581s

can_change_color

Passed

N/A

0.173174s

cbreak

Passed

N/A

0.449575s

clear

Passed

N/A

2.379913s

copywin

Passed

N/A

1.479657s

curs_set

Passed

N/A

0.219007s

getch

Passed

N/A

0.198974s

getstr

Passed

N/A

0.371755s

mvwin

Passed

N/A

0.336827s

startup

Passed

N/A

0.149414s

termattrs

Passed

N/A

0.169021s

timeout

Passed

N/A

4.430230s

wborder

Passed

N/A

0.259166s

window

Passed

N/A

0.188942s

wprintw

Passed

N/A

0.209706s

wscrl

Passed

N/A

0.359284s

lib/libevent/t_event

243.397385s

kqueue

Passed

N/A

81.623473s

poll

Passed

N/A

80.848127s

select

Passed

N/A

80.923560s

lib/libexecinfo/t_backtrace

0.033936s

backtrace_fmt_basic

Passed

N/A

0.033389s

lib/libm/t_acos

0.042661s

acos_inrange

Passed

N/A

0.013298s

acos_is_nan

Passed

N/A

0.013285s

acos_is_plus_zero

Passed

N/A

0.014278s

lib/libm/t_asin

0.192814s

asin_inf_neg

Passed

N/A

0.013383s

asin_inf_pos

Passed

N/A

0.013144s

asin_inrange

Passed

N/A

0.013135s

asin_nan

Passed

N/A

0.013017s

asin_range

Passed

N/A

0.013168s

asin_zero_neg

Passed

N/A

0.012829s

asin_zero_pos

Passed

N/A

0.013303s

asinf_inf_neg

Passed

N/A

0.013179s

asinf_inf_pos

Passed

N/A

0.013108s

asinf_inrange

Passed

N/A

0.013056s

asinf_nan

Passed

N/A

0.012859s

asinf_range

Passed

N/A

0.013376s

asinf_zero_neg

Passed

N/A

0.013112s

asinf_zero_pos

Passed

N/A

0.013030s

lib/libm/t_atan

0.055130s

atan_inrange

Passed

N/A

0.014135s

atan_nan

Passed

N/A

0.012871s

atan_zero_neg

Passed

N/A

0.012796s

atan_zero_pos

Passed

N/A

0.012751s

lib/libm/t_casinh

0.013687s

casinh

Passed

N/A

0.012926s

lib/libm/t_cbrt

0.260896s

cbrt_inf_neg

Passed

N/A

0.013697s

cbrt_inf_pos

Passed

N/A

0.013216s

cbrt_nan

Passed

N/A

0.013150s

cbrt_pow

Passed

N/A

0.013298s

cbrt_zero_neg

Passed

N/A

0.013294s

cbrt_zero_pos

Passed

N/A

0.013081s

cbrtf_inf_neg

Passed

N/A

0.013142s

cbrtf_inf_pos

Passed

N/A

0.015698s

cbrtf_nan

Passed

N/A

0.015116s

cbrtf_powf

Passed

N/A

0.014972s

cbrtf_zero_neg

Passed

N/A

0.015063s

cbrtf_zero_pos

Passed

N/A

0.015182s

cbrtl_inf_neg

Passed

N/A

0.013531s

cbrtl_inf_pos

Passed

N/A

0.013162s

cbrtl_nan

Passed

N/A

0.013217s

cbrtl_powl

Passed

N/A

0.013586s

cbrtl_zero_neg

Passed

N/A

0.012953s

cbrtl_zero_pos

Passed

N/A

0.013541s

lib/libm/t_ceil

0.872190s

ceil_basic

Passed

N/A

0.016765s

ceil_inf_neg

Passed

N/A

0.016563s

ceil_inf_pos

Passed

N/A

0.016531s

ceil_nan

Passed

N/A

0.016617s

ceil_zero_neg

Passed

N/A

0.016477s

ceil_zero_pos

Passed

N/A

0.015263s

ceilf_basic

Passed

N/A

0.014572s

ceilf_inf_neg

Passed

N/A

0.014909s

ceilf_inf_pos

Passed

N/A

0.014797s

ceilf_nan

Passed

N/A

0.014500s

ceilf_zero_neg

Passed

N/A

0.014654s

ceilf_zero_pos

Passed

N/A

0.014732s

ceill_basic

Passed

N/A

0.014621s

ceill_inf_neg

Passed

N/A

0.014631s

ceill_inf_pos

Passed

N/A

0.014650s

ceill_nan

Passed

N/A

0.014761s

ceill_zero_neg

Passed

N/A

0.014760s

ceill_zero_pos

Passed

N/A

0.014444s

floor_basic

Passed

N/A

0.016671s

floor_inf_neg

Passed

N/A

0.016474s

floor_inf_pos

Passed

N/A

0.016629s

floor_nan

Passed

N/A

0.016393s

floor_zero_neg

Passed

N/A

0.015156s

floor_zero_pos

Passed

N/A

0.014652s

floorf_basic

Passed

N/A

0.016620s

floorf_inf_neg

Passed

N/A

0.016323s

floorf_inf_pos

Passed

N/A

0.016048s

floorf_nan

Passed

N/A

0.016053s

floorf_zero_neg

Passed

N/A

0.015957s

floorf_zero_pos

Passed

N/A

0.016188s

floorl_basic

Passed

N/A

0.016071s

floorl_inf_neg

Passed

N/A

0.016144s

floorl_inf_pos

Passed

N/A

0.016150s

floorl_nan

Passed

N/A

0.016070s

floorl_zero_neg

Passed

N/A

0.014917s

floorl_zero_pos

Passed

N/A

0.014900s

trunc_basic

Passed

N/A

0.014729s

trunc_inf_neg

Passed

N/A

0.014516s

trunc_inf_pos

Passed

N/A

0.015428s

trunc_nan

Passed

N/A

0.014826s

trunc_zero_neg

Passed

N/A

0.014715s

trunc_zero_pos

Passed

N/A

0.014477s

truncf_basic

Passed

N/A

0.014506s

truncf_inf_neg

Passed

N/A

0.014599s

truncf_inf_pos

Passed

N/A

0.014576s

truncf_nan

Passed

N/A

0.014618s

truncf_zero_neg

Passed

N/A

0.014598s

truncf_zero_pos

Passed

N/A

0.014698s

truncl_basic

Passed

N/A

0.014719s

truncl_inf_neg

Passed

N/A

0.016834s

truncl_inf_pos

Passed

N/A

0.016743s

truncl_nan

Passed

N/A

0.016536s

truncl_zero_neg

Passed

N/A

0.016539s

truncl_zero_pos

Passed

N/A

0.014859s

lib/libm/t_cos

0.178658s

cos_angles

Passed

N/A

0.015179s

cos_inf_neg

Passed

N/A

0.014910s

cos_inf_pos

Passed

N/A

0.015026s

cos_nan

Passed

N/A

0.014941s

cos_zero_neg

Passed

N/A

0.014751s

cos_zero_pos

Passed

N/A

0.014759s

cosf_angles

Passed

N/A

0.014816s

cosf_inf_neg

Passed

N/A

0.013166s

cosf_inf_pos

Passed

N/A

0.013292s

cosf_nan

Passed

N/A

0.012722s

cosf_zero_neg

Passed

N/A

0.012997s

cosf_zero_pos

Passed

N/A

0.013060s

lib/libm/t_cosh

0.179289s

cosh_inf_neg

Passed

N/A

0.013207s

cosh_inf_pos

Passed

N/A

0.013302s

cosh_inrange

Passed

N/A

0.015140s

cosh_nan

Passed

N/A

0.014950s

cosh_zero_neg

Passed

N/A

0.014868s

cosh_zero_pos

Passed

N/A

0.014647s

coshf_inf_neg

Passed

N/A

0.014961s

coshf_inf_pos

Passed

N/A

0.014860s

coshf_inrange

Passed

N/A

0.014949s

coshf_nan

Passed

N/A

0.013511s

coshf_zero_neg

Passed

N/A

0.012879s

coshf_zero_pos

Passed

N/A

0.012974s

lib/libm/t_erf

0.236866s

erf_inf_neg

Passed

N/A

0.013526s

erf_inf_pos

Passed

N/A

0.013179s

erf_nan

Passed

N/A

0.013121s

erf_zero_neg

Passed

N/A

0.013157s

erf_zero_pos

Passed

N/A

0.013126s

erfc_inf_neg

Passed

N/A

0.014193s

erfc_inf_pos

Passed

N/A

0.014853s

erfc_nan

Passed

N/A

0.014818s

erfcf_inf_neg

Passed

N/A

0.014574s

erfcf_inf_pos

Passed

N/A

0.014531s

erfcf_nan

Passed

N/A

0.014590s

erff_inf_neg

Passed

N/A

0.014502s

erff_inf_pos

Passed

N/A

0.014650s

erff_nan

Passed

N/A

0.014528s

erff_zero_neg

Passed

N/A

0.013659s

erff_zero_pos

Passed

N/A

0.013710s

lib/libm/t_exp

0.386714s

exp2_is_nan

Passed

N/A

0.013956s

exp2_is_plus_zero

Passed

N/A

0.015873s

exp2_powers

Passed

N/A

0.015723s

exp2_values

Passed

N/A

0.015637s

exp_inf_neg

Passed

N/A

0.013971s

exp_inf_pos

Passed

N/A

0.014337s

exp_nan

Passed

N/A

0.013574s

exp_product

Passed

N/A

0.013600s

exp_zero_neg

Passed

N/A

0.013273s

exp_zero_pos

Passed

N/A

0.013312s

expf_inf_neg

Passed

N/A

0.013580s

expf_inf_pos

Passed

N/A

0.015433s

expf_nan

Passed

N/A

0.015279s

expf_product

Passed

N/A

0.015528s

expf_zero_neg

Passed

N/A

0.015285s

expf_zero_pos

Passed

N/A

0.015310s

expm1_inf_neg

Passed

N/A

0.013614s

expm1_inf_pos

Passed

N/A

0.013395s

expm1_nan

Passed

N/A

0.013419s

expm1_zero_neg

Passed

N/A

0.013465s

expm1_zero_pos

Passed

N/A

0.013413s

expm1f_inf_neg

Passed

N/A

0.013453s

expm1f_inf_pos

Passed

N/A

0.013652s

expm1f_nan

Passed

N/A

0.013348s

expm1f_zero_neg

Passed

N/A

0.013304s

expm1f_zero_pos

Passed

N/A

0.013579s

lib/libm/t_fenv

0.059537s

feenableexcept

Passed

N/A

0.013031s

fegetexcept

Passed

N/A

0.014627s

fegetround

Passed

N/A

0.014191s

fesetround

Passed

N/A

0.014141s

lib/libm/t_fmod

0.013680s

fmod

Passed

N/A

0.012978s

lib/libm/t_hypot

0.040169s

hypot_integer

Passed

N/A

0.013111s

hypotf_integer

Passed

N/A

0.012514s

pr50698

Passed

N/A

0.012587s

lib/libm/t_ilogb

0.013432s

ilogb

Passed

N/A

0.012662s

lib/libm/t_infinity

0.044945s

infinity_double

Passed

N/A

0.012940s

infinity_float

Passed

N/A

0.014855s

infinity_long_double

Passed

N/A

0.014659s

lib/libm/t_ldexp

0.293548s

ldexp_basic

Passed

N/A

0.015929s

ldexp_denormal

Passed

N/A

0.015295s

ldexp_denormal_large

Passed

N/A

0.015598s

ldexp_exp2

Passed

N/A

0.014808s

ldexp_inf_neg

Passed

N/A

0.014674s

ldexp_inf_pos

Passed

N/A

0.013998s

ldexp_infinity

Passed

N/A

0.014822s

ldexp_nan

Passed

N/A

0.014634s

ldexp_overflow

Passed

N/A

0.014911s

ldexp_underflow

Passed

N/A

0.014866s

ldexp_zero

Passed

N/A

0.020560s

ldexp_zero_neg

Passed

N/A

0.013227s

ldexp_zero_pos

Passed

N/A

0.013203s

ldexpf_exp2f

Passed

N/A

0.012948s

ldexpf_inf_neg

Passed

N/A

0.013173s

ldexpf_inf_pos

Passed

N/A

0.013374s

ldexpf_nan

Passed

N/A

0.013130s

ldexpf_zero_neg

Passed

N/A

0.013268s

ldexpf_zero_pos

Passed

N/A

0.013478s

lib/libm/t_log

0.855282s

log10_base

Passed

N/A

0.014586s

log10_inf_neg

Passed

N/A

0.015734s

log10_inf_pos

Passed

N/A

0.016006s

log10_nan

Passed

N/A

0.015027s

log10_one_pos

Passed

N/A

0.014825s

log10_zero_neg

Passed

N/A

0.014892s

log10_zero_pos

Passed

N/A

0.014739s

log10f_base

Passed

N/A

0.014384s

log10f_inf_neg

Passed

N/A

0.014847s

log10f_inf_pos

Passed

N/A

0.014491s

log10f_nan

Passed

N/A

0.014859s

log10f_one_pos

Passed

N/A

0.014709s

log10f_zero_neg

Passed

N/A

0.014517s

log10f_zero_pos

Passed

N/A

0.014824s

log1p_inf_neg

Passed

N/A

0.014505s

log1p_inf_pos

Passed

N/A

0.014736s

log1p_nan

Passed

N/A

0.014611s

log1p_one_neg

Passed

N/A

0.016605s

log1p_zero_neg

Passed

N/A

0.016489s

log1p_zero_pos

Passed

N/A

0.016645s

log1pf_inf_neg

Passed

N/A

0.016530s

log1pf_inf_pos

Passed

N/A

0.014864s

log1pf_nan

Passed

N/A

0.014448s

log1pf_one_neg

Passed

N/A

0.016590s

log1pf_zero_neg

Passed

N/A

0.016421s

log1pf_zero_pos

Passed

N/A

0.016332s

log2_base

Passed

N/A

0.016386s

log2_inf_neg

Passed

N/A

0.015292s

log2_inf_pos

Passed

N/A

0.014798s

log2_nan

Passed

N/A

0.014498s

log2_one_pos

Passed

N/A

0.014854s

log2_zero_neg

Passed

N/A

0.014879s

log2_zero_pos

Passed

N/A

0.014706s

log2f_base

Passed

N/A

0.014677s

log2f_inf_neg

Passed

N/A

0.014683s

log2f_inf_pos

Passed

N/A

0.014619s

log2f_nan

Passed

N/A

0.014947s

log2f_one_pos

Passed

N/A

0.014411s

log2f_zero_neg

Passed

N/A

0.014708s

log2f_zero_pos

Passed

N/A

0.014707s

log_base

Passed

N/A

0.014581s

log_inf_neg

Passed

N/A

0.014451s

log_inf_pos

Passed

N/A

0.014832s

log_nan

Passed

N/A

0.014521s

log_one_pos

Passed

N/A

0.016602s

log_zero_neg

Passed

N/A

0.016499s

log_zero_pos

Passed

N/A

0.016906s

logf_base

Passed

N/A

0.016494s

logf_inf_neg

Passed

N/A

0.015110s

logf_inf_pos

Passed

N/A

0.014779s

logf_nan

Passed

N/A

0.014740s

logf_one_pos

Passed

N/A

0.014623s

logf_zero_neg

Passed

N/A

0.014757s

logf_zero_pos

Passed

N/A

0.014789s

lib/libm/t_modf

0.013882s

modf

Passed

N/A

0.013113s

lib/libm/t_pow

0.282103s

pow_inf_neg_x

Passed

N/A

0.014474s

pow_inf_neg_y

Passed

N/A

0.013474s

pow_inf_pos_x

Passed

N/A

0.013616s

pow_inf_pos_y

Passed

N/A

0.013290s

pow_nan_x

Passed

N/A

0.013377s

pow_nan_y

Passed

N/A

0.014141s

pow_one_neg_x

Passed

N/A

0.013073s

pow_one_pos_x

Passed

N/A

0.013016s

pow_zero_x

Passed

N/A

0.014577s

pow_zero_y

Passed

N/A

0.013386s

powf_inf_neg_x

Passed

N/A

0.013198s

powf_inf_neg_y

Passed

N/A

0.013418s

powf_inf_pos_x

Passed

N/A

0.013195s

powf_inf_pos_y

Passed

N/A

0.013394s

powf_nan_x

Passed

N/A

0.013183s

powf_nan_y

Passed

N/A

0.013361s

powf_one_neg_x

Passed

N/A

0.013346s

powf_one_pos_x

Passed

N/A

0.013197s

powf_zero_x

Passed

N/A

0.013445s

powf_zero_y

Passed

N/A

0.013205s

lib/libm/t_precision

0.013606s

t_precision

Passed

N/A

0.012843s

lib/libm/t_round

0.013276s

round_dir

Passed

N/A

0.012519s

lib/libm/t_scalbn

0.290420s

scalbn_inf_neg

Passed

N/A

0.015375s

scalbn_inf_pos

Passed

N/A

0.014708s

scalbn_ldexp

Passed

N/A

0.014604s

scalbn_nan

Passed

N/A

0.014750s

scalbn_val

Passed

N/A

0.014604s

scalbn_zero_neg

Passed

N/A

0.013717s

scalbn_zero_pos

Passed

N/A

0.013625s

scalbnf_inf_neg

Passed

N/A

0.013020s

scalbnf_inf_pos

Passed

N/A

0.013146s

scalbnf_ldexpf

Passed

N/A

0.012978s

scalbnf_nan

Passed

N/A

0.013242s

scalbnf_val

Passed

N/A

0.012990s

scalbnf_zero_neg

Passed

N/A

0.013334s

scalbnf_zero_pos

Passed

N/A

0.013003s

scalbnl_inf_neg

Passed

N/A

0.013131s

scalbnl_inf_pos

Passed

N/A

0.013197s

scalbnl_nan

Passed

N/A

0.013526s

scalbnl_val

Passed

N/A

0.013060s

scalbnl_zero_neg

Passed

N/A

0.015142s

scalbnl_zero_pos

Passed

N/A

0.014681s

lib/libm/t_sin

0.181208s

sin_angles

Passed

N/A

0.015281s

sin_inf_neg

Passed

N/A

0.014453s

sin_inf_pos

Passed

N/A

0.014435s

sin_nan

Passed

N/A

0.014491s

sin_zero_neg

Passed

N/A

0.014453s

sin_zero_pos

Passed

N/A

0.014501s

sinf_angles

Passed

N/A

0.014410s

sinf_inf_neg

Passed

N/A

0.013709s

sinf_inf_pos

Passed

N/A

0.014467s

sinf_nan

Passed

N/A

0.014553s

sinf_zero_neg

Passed

N/A

0.013674s

sinf_zero_pos

Passed

N/A

0.012868s

lib/libm/t_sinh

0.176332s

sinh_inf_neg

Passed

N/A

0.013354s

sinh_inf_pos

Passed

N/A

0.015341s

sinh_inrange

Passed

N/A

0.014940s

sinh_nan

Passed

N/A

0.014888s

sinh_zero_neg

Passed

N/A

0.014672s

sinh_zero_pos

Passed

N/A

0.015187s

sinhf_inf_neg

Passed

N/A

0.013876s

sinhf_inf_pos

Passed

N/A

0.013065s

sinhf_inrange

Passed

N/A

0.013089s

sinhf_nan

Passed

N/A

0.013119s

sinhf_zero_neg

Passed

N/A

0.013135s

sinhf_zero_pos

Passed

N/A

0.012951s

lib/libm/t_sqrt

0.255582s

sqrt_inf_neg

Passed

N/A

0.013737s

sqrt_inf_pos

Passed

N/A

0.014658s

sqrt_nan

Passed

N/A

0.013282s

sqrt_pow

Passed

N/A

0.013340s

sqrt_zero_neg

Passed

N/A

0.014595s

sqrt_zero_pos

Passed

N/A

0.013295s

sqrtf_inf_neg

Passed

N/A

0.013224s

sqrtf_inf_pos

Passed

N/A

0.013234s

sqrtf_nan

Passed

N/A

0.013368s

sqrtf_powf

Passed

N/A

0.013113s

sqrtf_zero_neg

Passed

N/A

0.013228s

sqrtf_zero_pos

Passed

N/A

0.013116s

sqrtl_inf_neg

Passed

N/A

0.013574s

sqrtl_inf_pos

Passed

N/A

0.013194s

sqrtl_nan

Passed

N/A

0.013442s

sqrtl_powl

Passed

N/A

0.013276s

sqrtl_zero_neg

Passed

N/A

0.013204s

sqrtl_zero_pos

Passed

N/A

0.015055s

lib/libm/t_tan

0.167167s

tan_angles

Passed

N/A

0.013287s

tan_inf_neg

Passed

N/A

0.013094s

tan_inf_pos

Passed

N/A

0.012790s

tan_nan

Passed

N/A

0.013098s

tan_zero_neg

Passed

N/A

0.012712s

tan_zero_pos

Passed

N/A

0.014784s

tanf_angles

Passed

N/A

0.014558s

tanf_inf_neg

Passed

N/A

0.013380s

tanf_inf_pos

Passed

N/A

0.013108s

tanf_nan

Passed

N/A

0.012793s

tanf_zero_neg

Passed

N/A

0.013147s

tanf_zero_pos

Passed

N/A

0.012692s

lib/libm/t_tanh

0.144798s

tanh_inf_neg

Passed

N/A

0.013279s

tanh_inf_pos

Passed

N/A

0.013075s

tanh_nan

Passed

N/A

0.012983s

tanh_zero_neg

Passed

N/A

0.012704s

tanh_zero_pos

Passed

N/A

0.012917s

tanhf_inf_neg

Passed

N/A

0.013028s

tanhf_inf_pos

Passed

N/A

0.015108s

tanhf_nan

Passed

N/A

0.014753s

tanhf_zero_neg

Passed

N/A

0.014795s

tanhf_zero_pos

Passed

N/A

0.014745s

lib/libobjc/t_threads

0.018022s

thread_callback

Passed

N/A

0.017456s

lib/libposix/bsd/t_rename

0.013862s

rename

Passed

N/A

0.013080s

lib/libposix/posix1/t_rename

0.014098s

rename

Passed

N/A

0.013184s

lib/libposix/posix2/t_rename

0.014139s

rename

Passed

N/A

0.013225s

lib/libppath/t_ppath

0.411365s

component_at

Passed

N/A

0.016641s

copydel_bool_success

Passed

N/A

0.016678s

copydel_object_twice_success

Passed

N/A

0.016632s

copyset_bool_success

Passed

N/A

0.016155s

copyset_object_twice_success

Passed

N/A

0.016687s

create_bool_eexist

Passed

N/A

0.016008s

create_bool_success

Passed

N/A

0.015943s

delete_bool_eftype

Passed

N/A

0.015832s

delete_bool_enoent

Passed

N/A

0.015873s

delete_bool_success

Passed

N/A

0.015919s

get_bool_eftype

Passed

N/A

0.015898s

get_bool_enoent

Passed

N/A

0.015204s

get_bool_success

Passed

N/A

0.014746s

get_idx_key

Passed

N/A

0.015722s

get_string_eftype

Passed

N/A

0.015634s

get_string_enoent

Passed

N/A

0.016122s

get_string_success

Passed

N/A

0.016220s

length

Passed

N/A

0.015629s

pop_until_empty

Passed

N/A

0.015678s

ppath_copy

Passed

N/A

0.015626s

push_until_full

Passed

N/A

0.015715s

replace

Passed

N/A

0.015659s

set_bool_eftype

Passed

N/A

0.015675s

set_bool_enoent

Passed

N/A

0.015946s

set_bool_success

Passed

N/A

0.015764s

lib/libprop/t_basic

0.030052s

prop_basic

Passed

N/A

0.014699s

prop_dictionary_equals

Passed

N/A

0.014164s

lib/libpthread/t_barrier

10.064408s

barrier

Passed

N/A

10.063835s

lib/libpthread/t_cond

9.062382s

bogus_timedwaits

Passed

N/A

0.014368s

broadcast

Passed

N/A

0.346067s

cond_timedwait_race

Passed

N/A

2.180798s

condattr

Passed

N/A

0.015248s

destroy_after_cancel

Passed

N/A

0.015314s

signal_before_unlock

Passed

N/A

2.019956s

signal_before_unlock_static_init

Passed

N/A

2.019916s

signal_delay_wait

Passed

N/A

2.018626s

signal_wait_race

Passed

N/A

0.426646s

lib/libpthread/t_condwait

4.044481s

cond_wait_mono

Passed

N/A

2.023692s

cond_wait_real

Passed

N/A

2.019383s

lib/libpthread/t_detach

0.014183s

pthread_detach

Passed

N/A

0.013491s

lib/libpthread/t_equal

0.014601s

pthread_equal

Passed

N/A

0.013876s

lib/libpthread/t_fork

5.023549s

fork

Passed

N/A

5.022734s

lib/libpthread/t_fpu

0.019150s

fpu

Passed

N/A

0.018303s

lib/libpthread/t_join

0.019540s

pthread_join

Passed

N/A

0.018748s

lib/libpthread/t_kill

0.030418s

simple

Passed

N/A

0.029590s

lib/libpthread/t_mutex

52.256580s

mutex1

Passed

N/A

4.034192s

mutex2

Passed

N/A

6.566538s

mutex3

Passed

N/A

6.351819s

mutex4

Passed

N/A

4.030387s

mutex5

Passed

N/A

10.019453s

mutex6

Passed

N/A

21.219558s

mutexattr1

Passed

N/A

0.014977s

mutexattr2

Passed

N/A

0.014814s

lib/libpthread/t_name

0.014887s

name

Passed

N/A

0.014103s

lib/libpthread/t_once

0.052227s

once1

Passed

N/A

0.014589s

once2

Passed

N/A

0.020193s

once3

Passed

N/A

0.015560s

lib/libpthread/t_preempt

1.022307s

preempt1

Passed

N/A

1.021650s

lib/libpthread/t_rwlock

1.028299s

rwlock1

Passed

N/A

1.014439s

rwlock_static

Passed

N/A

0.012811s

lib/libpthread/t_sem

20.482643s

before_start_no_threads

Passed

N/A

10.032922s

before_start_one_thread

Passed

N/A

10.021030s

named

Passed

N/A

0.013796s

unnamed

Passed

N/A

0.412672s

lib/libpthread/t_sigmask

4.087923s

before_threads

Passed

N/A

0.015450s

incorrect_mask_bug

Passed

N/A

3.037557s

respected_while_running

Passed

N/A

1.019916s

upcalls_not_started

Passed

N/A

0.013015s

lib/libpthread/t_sigsuspend

1.023777s

sigsuspend

Passed

N/A

1.023202s

lib/libpthread/t_siglongjmp

0.015354s

siglongjmp1

Passed

N/A

0.014819s

lib/libpthread/t_sleep

1.021020s

sleep1

Passed

N/A

1.020506s

lib/libpthread/t_swapcontext

0.015317s

swapcontext1

Passed

N/A

0.014786s

lib/libpthread/t_timedmutex

85.123205s

mutex1

Passed

N/A

4.027296s

mutex2

Passed

N/A

23.877244s

mutex3

Passed

N/A

21.850337s

mutex4

Passed

N/A

4.031472s

mutex5

Passed

N/A

10.019677s

mutex6

Failed

/usr/src/tests/lib/libpthread/t_mutex.c:430: mutex_lock(&mutex6, &ts_lengthy): Invalid argument

21.220583s

mutexattr1

Passed

N/A

0.013782s

mutexattr2

Passed

N/A

0.013916s

timedmutex1

Passed

N/A

0.015172s

timedmutex2

Passed

N/A

0.015407s

timedmutex3

Passed

N/A

0.016077s

timedmutex4

Passed

N/A

0.015213s

lib/libpthread/t_atexit

0.142550s

atexit

Passed

N/A

0.141611s

lib/libpthread/t_cancel

0.131710s

register_while_disabled

Passed

N/A

0.130926s

lib/libpthread/t_exit

0.140447s

main_thread

Passed

N/A

0.139530s

lib/libpthread/t_resolv

4.156471s

resolv

Passed

N/A

4.155868s

lib/libpthread_dbg/t_dummy

0.046798s

dummy1

Passed

N/A

0.015114s

dummy2

Passed

N/A

0.015211s

dummy3

Passed

N/A

0.014989s

lib/libpthread_dbg/t_threads

0.157172s

threads1

Passed

N/A

0.017910s

threads2

Passed

N/A

0.017641s

threads3

Passed

N/A

0.018014s

threads4

Passed

N/A

0.017692s

threads5

Passed

N/A

0.016766s

threads6

Passed

N/A

0.016153s

threads7

Passed

N/A

0.015851s

threads8

Passed

N/A

0.015852s

threads9

Passed

N/A

0.015811s

lib/librefuse/t_refuse_opt

0.145988s

t_fuse_opt_add_arg

Passed

N/A

0.016900s

t_fuse_opt_add_opt

Passed

N/A

0.016165s

t_fuse_opt_add_opt_escaped

Passed

N/A

0.016196s

t_fuse_opt_insert_arg

Passed

N/A

0.014628s

t_fuse_opt_match

Passed

N/A

0.014709s

t_fuse_opt_parse

Passed

N/A

0.014831s

t_fuse_opt_parse_null_args

Passed

N/A

0.014459s

t_fuse_opt_parse_null_opts

Passed

N/A

0.014913s

t_fuse_opt_parse_null_proc

Passed

N/A

0.016415s

lib/librt/t_sched

0.118700s

sched_getparam

Passed

N/A

0.014218s

sched_priority

Passed

N/A

0.014211s

sched_rr_get_interval_1

Passed

N/A

0.014183s

sched_rr_get_interval_2

Passed

N/A

0.014112s

sched_setscheduler_1

Passed

N/A

0.014199s

sched_setscheduler_2

Passed

N/A

0.014007s

sched_setscheduler_3

Passed

N/A

0.013975s

sched_setscheduler_4

Passed

N/A

0.014250s

lib/librt/t_sem

20.226880s

basic

Passed

N/A

0.013791s

child

Passed

N/A

20.211534s

lib/libtre/t_regex_att

0.228897s

basic

Passed

N/A

0.078319s

categorization

Passed

N/A

0.028729s

forcedassoc

Passed

N/A

0.021747s

leftassoc

Passed

N/A

0.017583s

nullsubexpr

Passed

N/A

0.019449s

repetition

Passed

N/A

0.038223s

rightassoc

Expected failure

Reason for breakage unknown: /usr/src/tests/lib/libtre/../libc/regex/t_regex_att.c:377: res != matches ((0,4)(0,1)(1,4)(4,4) != (0,4)(0,2)(2,3)(3,4)): at line 3

0.020235s

lib/libtre/t_exhaust

4.275135s

regcomp_too_big

Passed

N/A

4.274373s

lib/libusbhid/t_usbhid

0.091975s

check_hid_get_data

Expected failure

only the 32-bit opcode works, 8 and 16-bit is broken: 4 checks failed as expected; see output for more details

0.012669s

check_hid_logical_range

Expected failure

only the 32-bit opcode works, 8 and 16-bit is broken: 4 checks failed as expected; see output for more details

0.013583s

check_hid_physical_range

Expected failure

only the 32-bit opcode works, 8 and 16-bit is broken: 4 checks failed as expected; see output for more details

0.013232s

check_hid_set_data

Passed

N/A

0.012972s

check_hid_usage

Passed

N/A

0.023599s

check_parse_just_pop

Passed

N/A

0.012154s

lib/libutil/t_efun

0.051737s

ecalloc

Passed

N/A

0.012738s

efopen

Passed

N/A

0.012251s

emalloc

Passed

N/A

0.012247s

erealloc

Passed

N/A

0.012171s

lib/libutil/t_parsedate

2.661890s

atsecs

Passed

N/A

0.015970s

dates

Passed

N/A

0.014552s

dsttimes

Passed

N/A

0.046915s

gibberish

Passed

N/A

0.013523s

relative

Passed

N/A

2.532679s

times

Passed

N/A

0.016666s

zones

Passed

N/A

0.017223s

lib/libutil/t_pidfile

0.122943s

change_basenames

Passed

N/A

0.020830s

change_mix

Passed

N/A

0.020492s

change_paths

Passed

N/A

0.019706s

custom_basename

Passed

N/A

0.019179s

custom_path

Passed

N/A

0.018566s

default_path

Passed

N/A

0.019329s

lib/libutil/t_snprintb

0.029074s

snprintb

Passed

N/A

0.014045s

snprintb_m

Passed

N/A

0.013471s

lib/libutil/t_sockaddr_snprintf

0.070515s

sockaddr_snprintf_at

Passed

N/A

0.014185s

sockaddr_snprintf_dl

Passed

N/A

0.013038s

sockaddr_snprintf_in

Passed

N/A

0.013477s

sockaddr_snprintf_in6

Passed

N/A

0.012907s

sockaddr_snprintf_un

Passed

N/A

0.012739s

lib/semaphore/pthread/t_sem_pth

0.636732s

blocktimedwait

Passed

N/A

0.113395s

blockwait

Passed

N/A

0.239438s

busydestroy

Passed

N/A

0.058859s

destroy

Passed

N/A

0.043335s

initvalue

Passed

N/A

0.043363s

named

Passed

N/A

0.044830s

postwait

Passed

N/A

0.042877s

unlink

Passed

N/A

0.044097s

lib/librumpclient/t_fd

0.370155s

bigenough

Passed

N/A

0.112054s

sigio

Passed

N/A

0.256571s

lib/librumpclient/t_exec

4.225880s

cloexec

Passed

N/A

0.616378s

exec

Passed

N/A

0.606252s

noexec

Passed

N/A

0.589221s

threxec

Passed

N/A

1.721428s

vfork

Passed

N/A

0.684628s

lib/librumphijack/t_asyncio

1.114171s

invafd

Passed

N/A

0.383072s

select_allunset

Passed

N/A

0.385134s

select_timeout

Passed

N/A

0.340304s

lib/librumphijack/t_config

0.340495s

fdoff

Passed

N/A

0.339673s

lib/librumphijack/t_cwd

2.623631s

basic_chdir

Passed

N/A

0.325159s

basic_fchdir

Passed

N/A

0.329567s

slash_chdir

Passed

N/A

0.322626s

slash_fchdir

Passed

N/A

0.332583s

symlink_chdir

Passed

N/A

0.318201s

symlink_fchdir

Passed

N/A

0.324341s

symlink_slash_chdir

Passed

N/A

0.322716s

symlink_slash_fchdir

Passed

N/A

0.339257s

lib/librumphijack/t_sh

0.919897s

redirect

Passed

N/A

0.505053s

runscript

Passed

N/A

0.412994s

lib/librumphijack/t_tcpip

4.906024s

http

Passed

N/A

0.858553s

nfs

Passed

N/A

1.966110s

nfs_autoload

Skipped

test currently valid only on i386

0.245186s

ssh

Expected failure

PR lib/50174: atf-check failed; see the output of the test for details

1.821998s

lib/librumphijack/t_vfs

5.367132s

blanket

Passed

N/A

0.404500s

cpcopy

Passed

N/A

0.812049s

doubleblanket

Passed

N/A

0.511644s

ln_nox

Passed

N/A

0.754575s

ln_x

Passed

N/A

0.393127s

mv_nox

Passed

N/A

0.686518s

mv_x

Passed

N/A

0.589025s

paxcopy

Passed

N/A

0.816747s

runonprefix

Passed

N/A

0.369466s

lib/libdes/t_des

0.196642s

align

Passed

N/A

0.015613s

cbc

Passed

N/A

0.012399s

cbc_cksum

Passed

N/A

0.012579s

cbcm

Passed

N/A

0.012275s

cfb

Passed

N/A

0.012648s

desx_cbc

Passed

N/A

0.012358s

ecb

Passed

N/A

0.012299s

ede_cbc

Passed

N/A

0.012244s

ede_ecb

Passed

N/A

0.012526s

ede_ofb64

Passed

N/A

0.012329s

fast_crypt

Passed

N/A

0.012339s

ofb

Passed

N/A

0.012294s

ofb64

Passed

N/A

0.012218s

pcbc

Passed

N/A

0.012088s

quad_cksum

Passed

N/A

0.012339s

lib/libskey/t_algorithms

0.087962s

md4

Passed

N/A

0.012747s

md5

Passed

N/A

0.012578s

sha1

Passed

N/A

0.060946s

libexec/ld.elf_so/t_dlerror-cleared

0.014097s

rtld_dlerror_cleared

Passed

N/A

0.013564s

libexec/ld.elf_so/t_dlerror-false

0.013637s

rtld_dlerror_false

Passed

N/A

0.013093s

libexec/ld.elf_so/t_dlinfo

0.050107s

rtld_dlinfo_linkmap_dlopen

Passed

N/A

0.012503s

rtld_dlinfo_linkmap_dlopen_iter

Passed

N/A

0.012214s

rtld_dlinfo_linkmap_inval

Passed

N/A

0.011730s

rtld_dlinfo_linkmap_self

Passed

N/A

0.011439s

libexec/ld.elf_so/t_dlvsym

0.070691s

rtld_dlvsym_symbol_nonexistent

Passed

N/A

0.019204s

rtld_dlvsym_v1

Passed

N/A

0.012193s

rtld_dlvsym_v3

Passed

N/A

0.012095s

rtld_dlvsym_version_nonexistent

Passed

N/A

0.012350s

rtld_dlvsym_version_null

Passed

N/A

0.012095s

libexec/ld.elf_so/t_ifunc

0.048259s

rtld_ifunc

Passed

N/A

0.047674s

libexec/ld.elf_so/t_df_1_noopen

0.267894s

df_1_noopen1

Passed

N/A

0.132476s

df_1_noopen2

Passed

N/A

0.133581s

libexec/ld.elf_so/t_dl_symver

0.617378s

dl_symver

Passed

N/A

0.616831s

net/fdpass/t_fdpass

0.793279s

fdpass_compat

Passed

N/A

0.300795s

fdpass_compat_normal

Passed

N/A

0.181751s

fdpass_normal

Passed

N/A

0.148385s

fdpass_normal_compat

Passed

N/A

0.158661s

net/in_cksum/t_in_cksum

22.255291s

mbufs_aligned

Passed

N/A

7.045566s

mbufs_unaligned

Passed

N/A

7.002604s

sizes_aligned

Passed

N/A

4.319077s

sizes_unaligned

Passed

N/A

3.884679s

net/net/t_unix

0.041484s

sockaddr_un_closed

Passed

N/A

0.013078s

sockaddr_un_len_exceed

Passed

N/A

0.012600s

sockaddr_un_len_max

Passed

N/A

0.013195s

net/net/t_tcp

0.042406s

fcntl_reset_nonblock

Passed

N/A

0.014170s

paccept_nonblock

Passed

N/A

0.013121s

paccept_reset_nonblock

Passed

N/A

0.012966s

net/net/t_udp

0.031423s

udp4_send

Passed

N/A

0.015129s

udp6_send

Passed

N/A

0.014709s

net/net/t_pktinfo

0.014249s

pktinfo

Passed

N/A

0.013353s

net/net/t_raw

0.180566s

PRU_SENSE

Passed

N/A

0.179644s

net/net/t_forwarding

67.444046s

ipforwarding_fastforward_v4

Passed

N/A

7.058850s

ipforwarding_fastforward_v6

Passed

N/A

7.096802s

ipforwarding_misc

Passed

N/A

22.440672s

ipforwarding_v4

Passed

N/A

12.850833s

ipforwarding_v6

Passed

N/A

17.978668s

net/net/t_ipaddress

10.451494s

ipaddr_auto_linklocal

Passed

N/A

1.160740s

ipaddr_same_address

Passed

N/A

5.830461s

ipaddr_same_address6

Passed

N/A

3.453177s

net/net/t_ipv6address

39.571769s

linklocal

Passed

N/A

37.532919s

linklocal_ops

Passed

N/A

2.030745s

net/net/t_ipv6_lifetime

29.721494s

basic

Passed

N/A

29.718104s

net/net/t_mtudisc

12.269533s

mtudisc_basic

Passed

N/A

12.265699s

net/net/t_mtudisc6

13.960516s

mtudisc6_basic

Passed

N/A

13.956584s

net/net/t_ping6_opts

42.728904s

ping6_opts_gateway

Passed

N/A

10.045212s

ping6_opts_hops

Passed

N/A

15.505330s

ping6_opts_interface

Passed

N/A

8.134397s

ping6_opts_sourceaddr

Passed

N/A

9.026072s

net/sys/t_rfc6056

0.051183s

inet4

Passed

N/A

0.025098s

inet6

Passed

N/A

0.024675s

net/arp/t_arp

76.146216s

arp_cache_expiration_10s

Passed

N/A

13.603463s

arp_cache_expiration_5s

Passed

N/A

8.609540s

arp_cache_overwriting

Passed

N/A

1.729386s

arp_command

Passed

N/A

9.528458s

arp_garp

Passed

N/A

5.732004s

arp_link_activation

Passed

N/A

3.810104s

arp_proxy_arp_pub

Passed

N/A

15.672782s

arp_proxy_arp_pubproxy

Passed

N/A

15.924816s

arp_static

Passed

N/A

1.510288s

net/arp/t_dad

18.562746s

dad_basic

Passed

N/A

14.932863s

dad_duplicated

Passed

N/A

3.624391s

net/bpf/t_bpf

0.374354s

bpfwriteleak

Passed

N/A

0.186809s

bpfwritetrunc

Passed

N/A

0.184963s

net/bpf/t_div-by-zero

0.180154s

div_by_zero

Passed

N/A

0.179323s

net/bpf/t_mbuf

3.623608s

bpf_mbuf_ldb_abs

Passed

N/A

0.176162s

bpf_mbuf_ldb_abs_overflow

Passed

N/A

0.181633s

bpf_mbuf_ldb_ind

Passed

N/A

0.177167s

bpf_mbuf_ldb_ind_overflow1

Passed

N/A

0.183978s

bpf_mbuf_ldb_ind_overflow2

Passed

N/A

0.180868s

bpf_mbuf_ldb_ind_overflow3

Passed

N/A

0.175625s

bpf_mbuf_ldh_abs

Passed

N/A

0.172971s

bpf_mbuf_ldh_abs_overflow

Passed

N/A

0.182540s

bpf_mbuf_ldh_ind

Passed

N/A

0.178515s

bpf_mbuf_ldh_ind_overflow1

Passed

N/A

0.180100s

bpf_mbuf_ldh_ind_overflow2

Passed

N/A

0.180054s

bpf_mbuf_ldh_ind_overflow3

Passed

N/A

0.176907s

bpf_mbuf_ldw_abs

Passed

N/A

0.180263s

bpf_mbuf_ldw_abs_overflow

Passed

N/A

0.187212s

bpf_mbuf_ldw_ind

Passed

N/A

0.182802s

bpf_mbuf_ldw_ind_overflow1

Passed

N/A

0.181864s

bpf_mbuf_ldw_ind_overflow2

Passed

N/A

0.183865s

bpf_mbuf_ldw_ind_overflow3

Passed

N/A

0.179064s

bpf_mbuf_msh

Passed

N/A

0.180294s

bpf_mbuf_msh_overflow

Passed

N/A

0.183063s

net/bpfilter/t_bpfilter

1.606072s

bpfilterbadjmp

Passed

N/A

0.191749s

bpfilterbadmem

Passed

N/A

0.184904s

bpfilterbadret

Passed

N/A

0.185423s

bpfiltercontig

Passed

N/A

0.230598s

bpfiltermchain

Passed

N/A

0.218338s

bpfilternegjmp

Passed

N/A

0.195085s

bpfilternoinitA

Passed

N/A

0.194646s

bpfilternoinitX

Passed

N/A

0.189619s

net/carp/t_basic

8.369053s

handover

Passed

N/A

8.366952s

net/icmp/t_forward

1.202971s

returndatabytes

Passed

N/A

1.201048s

net/icmp/t_ping

9.049329s

floodping

Passed

N/A

1.824779s

floodping2

Passed

N/A

2.929766s

ping_of_death

Passed

N/A

0.274444s

pingsize

Passed

N/A

3.296983s

simpleping

Passed

N/A

0.714319s

net/icmp/t_ping2

0.927501s

basic

Passed

N/A

0.925372s

net/icmp/t_icmp_redirect

23.118355s

icmp_redirect

Passed

N/A

8.262221s

icmp_redirect_timeout

Passed

N/A

14.848020s

net/icmp/t_icmp6_redirect

13.546325s

icmp6_redirect_basic

Passed

N/A

13.542792s

net/if/t_compat

0.190401s

OOSIOCGIFBRDADDR

Expected failure

PR kern/51610: rump does not include COMPAT_43: /usr/src/tests/net/if/t_compat.c:72: rump_sys_ioctl(fd, ((((unsigned long)0x80000000|(unsigned long)0x40000000)) | (((sizeof(struct oifreq)) & 0x1fff) << 16) | ((('i')) << 8) | ((18))), &ifreq): Inappropriate ioctl for device

0.188050s

net/if/t_ifconf

1.875257s

basic

Passed

N/A

1.871837s

net/if/t_ifconfig

27.780123s

ifconfig_create_destroy

Passed

N/A

0.984003s

ifconfig_options

Passed

N/A

5.040482s

ifconfig_parameters

Passed

N/A

21.748291s

net/if_bridge/t_bridge

88.903310s

bridge_ipv4

Passed

N/A

14.138304s

bridge_ipv6

Passed

N/A

24.374101s

bridge_member_ipv4

Passed

N/A

20.629968s

bridge_member_ipv6

Passed

N/A

25.759679s

bridge_rtable

Passed

N/A

3.982502s

net/if_gif/t_gif

141.540982s

gif_basic_ipv4overipv4

Passed

N/A

9.528280s

gif_basic_ipv4overipv6

Passed

N/A

9.568978s

gif_basic_ipv6overipv4

Passed

N/A

14.588937s

gif_basic_ipv6overipv6

Passed

N/A

14.575092s

gif_ioctl_ipv4overipv4

Passed

N/A

10.728370s

gif_ioctl_ipv4overipv6

Passed

N/A

10.710572s

gif_ioctl_ipv6overipv4

Passed

N/A

15.711659s

gif_ioctl_ipv6overipv6

Passed

N/A

15.807914s

gif_recursive_ipv4overipv4

Passed

N/A

10.107083s

gif_recursive_ipv4overipv6

Passed

N/A

10.063363s

gif_recursive_ipv6overipv4

Passed

N/A

10.037640s

gif_recursive_ipv6overipv6

Passed

N/A

10.069803s

net/if_loop/t_pr

0.337707s

loopmtu

Passed

N/A

0.169818s

loopmtu_csum

Passed

N/A

0.166557s

net/if_pppoe/t_pppoe

83.640384s

pppoe6_chap

Passed

N/A

20.045710s

pppoe6_pap

Passed

N/A

19.589047s

pppoe_chap

Passed

N/A

21.701409s

pppoe_pap

Passed

N/A

22.297163s

net/if_tap/t_tap

13.459181s

tap_bridged

Passed

N/A

5.217935s

tap_create_destroy

Passed

N/A

0.873367s

tap_stand_alone

Passed

N/A

7.361648s

net/if_tun/t_tun

12.355995s

tun_create_destroy

Passed

N/A

0.607231s

tun_setup

Passed

N/A

11.746073s

net/mcast/t_mcast

22.995831s

mcast_conninet4

Passed

N/A

2.736261s

mcast_conninet6

Passed

N/A

2.350288s

mcast_connmappedbuginet4

Passed

N/A

3.087738s

mcast_connmappedinet4

Passed

N/A

2.956974s

mcast_unconninet4

Passed

N/A

2.803581s

mcast_unconninet6

Passed

N/A

2.868264s

mcast_unconnmappedbuginet4

Passed

N/A

3.087726s

mcast_unconnmappedinet4

Passed

N/A

3.078192s

net/mpls/t_mpls_fw

4.972735s

mplsfw4

Passed

N/A

2.489346s

mplsfw4_expl

Passed

N/A

2.473065s

net/mpls/t_mpls_fw6

5.268205s

mplsfw6

Passed

N/A

2.626524s

mplsfw6_expl

Passed

N/A

2.630975s

net/mpls/t_mpls_fw64

5.560217s

mplsfw64_expl

Passed

N/A

2.791605s

mplsfw64_impl

Passed

N/A

2.759887s

net/mpls/t_rfc4182

2.567656s

rfc4182

Passed

N/A

2.562101s

net/mpls/t_ldp_regen

23.827013s

ldp_regen

Passed

N/A

23.821929s

net/ndp/t_dad

28.765924s

dad_basic

Passed

N/A

5.535813s

dad_count

Passed

N/A

16.335563s

dad_duplicated

Passed

N/A

6.885590s

net/ndp/t_ndp

63.423102s

ndp_cache_expiration

Passed

N/A

37.130186s

ndp_cache_overwriting

Passed

N/A

5.496953s

ndp_commands

Passed

N/A

7.721691s

ndp_link_activation

Passed

N/A

7.756176s

ndp_neighborgcthresh

Passed

N/A

5.303122s

net/ndp/t_ra

24.688970s

ra_basic

Passed

N/A

24.686178s

net/npf/t_npf

2.155838s

npf_bpf

Passed

N/A

0.484175s

npf_nat

Passed

N/A

0.339934s

npf_nbuf

Passed

N/A

0.329702s

npf_rule

Passed

N/A

0.327865s

npf_state

Passed

N/A

0.335132s

npf_table

Passed

N/A

0.333711s

net/route/t_change

3.867872s

route_change_gateway

Passed

N/A

0.704837s

route_change_ifa

Passed

N/A

0.862211s

route_change_ifp

Passed

N/A

0.868913s

route_change_ifp_ifa

Passed

N/A

0.824634s

route_change_reject2blackhole

Passed

N/A

0.600036s

net/route/t_flags

22.036017s

route_flags_announce

Passed

N/A

1.355859s

route_flags_blackhole

Passed

N/A

2.469446s

route_flags_connected

Passed

N/A

1.321828s

route_flags_default_gateway

Passed

N/A

1.309356s

route_flags_icmp_redirect

Passed

N/A

8.068868s

route_flags_lo

Passed

N/A

1.285396s

route_flags_reject

Passed

N/A

4.813209s

route_flags_static

Passed

N/A

1.387028s

net/route/t_flags6

13.254393s

route_flags_announce6

Passed

N/A

1.353549s

route_flags_blackhole6

Passed

N/A

2.514367s

route_flags_connected6

Passed

N/A

1.349641s

route_flags_default_gateway6

Passed

N/A

1.318543s

route_flags_lo6

Passed

N/A

1.385223s

route_flags_reject6

Passed

N/A

3.864768s

route_flags_static6

Passed

N/A

1.449930s

net/route/t_route

7.147049s

route_command_get

Passed

N/A

2.352384s

route_command_get6

Passed

N/A

2.386709s

route_non_subnet_gateway

Passed

N/A

2.390738s

net/if_vlan/t_vlan

13.372736s

vlan_basic

Passed

N/A

12.735112s

vlan_create_destroy

Passed

N/A

0.634460s

sbin/fsck_ffs/t_enable_quotas

11.901448s

corrupt_be_1

Passed

N/A

0.905193s

corrupt_be_2

Passed

N/A

0.622410s

corrupt_le_1

Passed

N/A

0.627425s

corrupt_le_2

Passed

N/A

0.627626s

dir1_be_1

Passed

N/A

0.468798s

dir1_be_2

Passed

N/A

0.442787s

dir1_le_1

Passed

N/A

0.458987s

dir1_le_2

Passed

N/A

0.479438s

disable_be_1

Passed

N/A

0.678375s

disable_be_2

Passed

N/A

0.669968s

disable_le_1

Passed

N/A

0.707014s

disable_le_2

Passed

N/A

0.669606s

notreg_be_1

Passed

N/A

0.579304s

notreg_be_2

Passed

N/A

0.585710s

notreg_le_1

Passed

N/A

0.587454s

notreg_le_2

Passed

N/A

0.572622s

unallocated_be_1

Passed

N/A

0.567887s

unallocated_be_2

Passed

N/A

0.533130s

unallocated_le_1

Passed

N/A

0.537181s

unallocated_le_2

Passed

N/A

0.550910s

sbin/fsck_ffs/t_check_quotas

31.599615s

corrupt_list_be_1

Passed

N/A

0.625944s

corrupt_list_be_2

Passed

N/A

0.621881s

corrupt_list_le_1

Passed

N/A

0.633743s

corrupt_list_le_2

Passed

N/A

0.604448s

expand1_list_be_1

Passed

N/A

0.764138s

expand1_list_be_2

Passed

N/A

0.659342s

expand1_list_le_1

Passed

N/A

0.723880s

expand1_list_le_2

Passed

N/A

0.663760s

expand2_list_be_1

Passed

N/A

6.386068s

expand2_list_be_2

Passed

N/A

6.456111s

expand2_list_le_1

Passed

N/A

6.383490s

expand2_list_le_2

Passed

N/A

6.270696s

sbin/gpt/t_gpt

4.293510s

backup_2part

Passed

N/A

0.480155s

bootable_2part

Skipped

Required file '/usr/mdec/gptmbr.bin' not found

0.000543s

change_attr_2part

Passed

N/A

0.429652s

change_type_2part

Passed

N/A

0.434269s

create_2part

Passed

N/A

0.313833s

create_empty

Passed

N/A

0.203365s

label_2part

Passed

N/A

0.359016s

migrate_disklabel

Failed

atf-check failed; see the output of the test for details

0.269004s

recover_backup

Failed

atf-check failed; see the output of the test for details

0.298516s

recover_primary

Passed

N/A

0.359547s

remove_2part

Passed

N/A

0.305616s

resize_2part

Passed

N/A

0.393406s

restore_2part

Passed

N/A

0.433845s

sbin/ifconfig/t_nonexistent

0.126561s

nonexistent

Passed

N/A

0.125727s

sbin/newfs/t_enable_quotas

2.898725s

enabled_be_1_both

Passed

N/A

0.259438s

enabled_be_1_group

Passed

N/A

0.251467s

enabled_be_1_user

Passed

N/A

0.237136s

enabled_be_2_both

Passed

N/A

0.239629s

enabled_be_2_group

Passed

N/A

0.237909s

enabled_be_2_user

Passed

N/A

0.238456s

enabled_le_1_both

Passed

N/A

0.237385s

enabled_le_1_group

Passed

N/A

0.238407s

enabled_le_1_user

Passed

N/A

0.238372s

enabled_le_2_both

Passed

N/A

0.245321s

enabled_le_2_group

Passed

N/A

0.230847s

enabled_le_2_user

Passed

N/A

0.226273s

sbin/newfs_msdos/t_create

0.367033s

validfat32

Passed

N/A

0.364768s

sbin/resize_ffs/t_check

0.407446s

check_grow

Passed

N/A

0.403427s

sbin/resize_ffs/t_grow

32.636270s

grow_16M_v0_8192

Passed

N/A

10.782548s

grow_16M_v1_16384

Passed

N/A

10.859093s

grow_16M_v2_32768

Passed

N/A

10.546965s

grow_ffsv1_partial_cg

Passed

N/A

0.364525s

sbin/resize_ffs/t_shrink

39.144221s

shrink_24M_16M_v0_32768

Passed

N/A

14.413014s

shrink_24M_16M_v1_65536

Passed

N/A

13.096253s

shrink_24M_16M_v2_4096

Expected failure

PR bin/44205: atf-check failed; see the output of the test for details

11.167924s

shrink_ffsv1_partial_cg

Passed

N/A

0.386485s

sbin/resize_ffs/t_grow_swapped

31.498992s

grow_16M_v0_65536

Passed

N/A

9.804611s

grow_16M_v1_4096

Passed

N/A

10.723937s

grow_16M_v2_8192

Passed

N/A

10.519101s

grow_ffsv1_partial_cg

Passed

N/A

0.367387s

sbin/resize_ffs/t_shrink_swapped

40.660724s

shrink_24M_16M_v0_4096

Passed

N/A

14.242117s

shrink_24M_16M_v1_8192

Passed

N/A

14.490695s

shrink_24M_16M_v2_16384

Expected failure

PR bin/44205: atf-check failed; see the output of the test for details

11.491160s

shrink_ffsv1_partial_cg

Passed

N/A

0.356080s

sbin/route/t_missing

0.124030s

missing

Passed

N/A

0.123186s

sbin/sysctl/t_perm

24.723798s

sysctl_ddb

Passed

N/A

0.649146s

sysctl_hw

Passed

N/A

3.377787s

sysctl_kern

Passed

N/A

6.236611s

sysctl_machdep

Passed

N/A

0.499638s

sysctl_net

Passed

N/A

10.536108s

sysctl_security

Passed

N/A

1.454512s

sysctl_vfs

Passed

N/A

0.911157s

sysctl_vm

Passed

N/A

1.050547s

sbin/sysctl/t_sysctl

0.242386s

basic

Passed

N/A

0.241514s

sys/net/t_print

0.028349s

dl_print

Passed

N/A

0.014022s

sdl_print

Passed

N/A

0.012575s

sys/netatalk/t_print

0.028640s

at_print

Passed

N/A

0.013386s

sat_print

Passed

N/A

0.013472s

sys/netinet/t_print

0.028713s

in_print

Passed

N/A

0.013798s

sin_print

Passed

N/A

0.013132s

sys/netinet6/t_print

0.028741s

in6_print

Passed

N/A

0.013781s

sin6_print

Passed

N/A

0.013180s

sys/rc/t_rc_d_cli

3.823009s

default_restart_no_args

Passed

N/A

0.467637s

default_restart_with_args

Passed

N/A

0.356836s

default_start_no_args

Passed

N/A

0.320427s

default_start_with_args

Passed

N/A

0.250383s

default_stop_no_args

Passed

N/A

0.248337s

default_stop_with_args

Passed

N/A

0.405977s

no_command

Passed

N/A

0.158472s

overriden_custom_no_args

Passed

N/A

0.204497s

overriden_custom_with_args

Passed

N/A

0.201559s

overriden_restart_no_args

Passed

N/A

0.198463s

overriden_restart_with_args

Passed

N/A

0.207806s

overriden_start_no_args

Passed

N/A

0.199912s

overriden_start_with_args

Passed

N/A

0.198041s

overriden_stop_no_args

Passed

N/A

0.195930s

overriden_stop_with_args

Passed

N/A

0.194935s

usr.bin/awk/t_awk

4.077389s

assign_NF

Passed

N/A

0.180638s

big_regexp

Passed

N/A

0.173367s

empty_rs

Passed

N/A

0.152957s

end

Passed

N/A

0.237746s

modify_subsep

Passed

N/A

0.143789s

multibyte

Passed

N/A

0.475547s

newline_rs

Passed

N/A

0.145386s

period

Passed

N/A

0.186374s

regex_caret_1_rs

Passed

N/A

0.138883s

regex_caret_2_rs

Passed

N/A

0.143191s

regex_dollar_1_rs

Passed

N/A

0.149467s

regex_dollar_2_rs

Passed

N/A

0.142025s

regex_or_1_rs

Passed

N/A

0.142842s

regex_or_2_rs

Passed

N/A

0.146332s

regex_or_3_rs

Passed

N/A

0.142258s

regex_reallocation_rs

Passed

N/A

0.184375s

regex_two_star_rs

Passed

N/A

0.148273s

single_char_regex_group_rs

Passed

N/A

0.148399s

single_char_regex_star_rs

Passed

N/A

0.146712s

single_char_rs

Passed

N/A

0.141454s

string1

Passed

N/A

0.153119s

two_char_regex_group_rs

Passed

N/A

0.145701s

two_char_regex_star_rs

Passed

N/A

0.145316s

two_char_rs

Passed

N/A

0.142282s

usr.bin/basename/t_basename

0.534163s

basic

Passed

N/A

0.323571s

suffix

Passed

N/A

0.209331s

usr.bin/bzip2/t_bzip2

1.039942s

basic

Passed

N/A

1.038874s

usr.bin/cc/t_hello

6.951295s

hello

Passed

N/A

3.417082s

hello32

Passed

N/A

2.175510s

hello_pic

Passed

N/A

0.784990s

hello_pie

Passed

N/A

0.567218s

usr.bin/cmp/t_cmp

0.442731s

missing

Passed

N/A

0.239028s

skip

Passed

N/A

0.201644s

usr.bin/config/t_config

2.379131s

deffs_redef

Passed

N/A

0.276736s

devi

Passed

N/A

0.229415s

loop

Passed

N/A

0.172319s

loop2

Passed

N/A

0.167031s

min

Passed

N/A

0.192092s

no_pseudo

Passed

N/A

0.175655s

no_select

Passed

N/A

0.181654s

no_undefined_opt

Passed

N/A

0.155206s

postponed_orphan

Passed

N/A

0.150101s

pseudo_parent

Passed

N/A

0.154542s

select

Passed

N/A

0.176543s

shadow_instance

Passed

N/A

0.156264s

undefined_opt

Passed

N/A

0.152082s

usr.bin/cut/t_cut

1.259817s

basic

Passed

N/A

0.234305s

dflag

Passed

N/A

0.221049s

dsflag

Passed

N/A

0.228955s

latin1

Passed

N/A

0.162704s

sflag

Passed

N/A

0.236341s

utf8

Passed

N/A

0.171094s

usr.bin/diff/t_diff

0.427349s

mallocv

Passed

N/A

0.146001s

nomallocv

Passed

N/A

0.137676s

same

Passed

N/A

0.141457s

usr.bin/dirname/t_dirname

0.367223s

basic

Passed

N/A

0.366460s

usr.bin/find/t_find

0.793069s

emptyperm

Passed

N/A

0.507621s

exit

Passed

N/A

0.136620s

exit_status

Passed

N/A

0.145635s

usr.bin/gdb/t_regress

11.809314s

pie

Passed

N/A

3.418593s

threads

Passed

N/A

8.387995s

usr.bin/grep/t_grep

2.590934s

basic

Passed

N/A

0.197791s

begin_end

Passed

N/A

0.175573s

binary

Passed

N/A

0.149829s

context

Passed

N/A

0.244062s

context2

Passed

N/A

0.195579s

egrep

Passed

N/A

0.141106s

file_exp

Passed

N/A

0.153788s

ignore_case

Passed

N/A

0.136703s

invert

Passed

N/A

0.141677s

negative

Passed

N/A

0.129873s

nonexistent

Passed

N/A

0.132876s

recurse

Passed

N/A

0.144175s

recurse_symlink

Passed

N/A

0.158026s

whole_line

Passed

N/A

0.141708s

word_regexps

Passed

N/A

0.143729s

zgrep

Passed

N/A

0.188179s

usr.bin/gzip/t_gzip

4.319434s

concatenated

Passed

N/A

0.153353s

crcerror

Passed

N/A

0.146134s

good

Passed

N/A

0.138748s

pipe

Passed

N/A

3.733047s

truncated

Passed

N/A

0.143070s

usr.bin/id/t_groups

0.504341s

correct

Passed

N/A

0.318533s

syntax

Passed

N/A

0.183031s

usr.bin/id/t_id

4.738345s

Gflag

Passed

N/A

0.625459s

default

Passed

N/A

0.442995s

gflag

Passed

N/A

1.104918s

pflag

Passed

N/A

0.486239s

primaries

Passed

N/A

0.961232s

uflag

Passed

N/A

1.108193s

usr.bin/id/t_whoami

0.381218s

correct

Passed

N/A

0.186876s

syntax

Passed

N/A

0.191754s

usr.bin/infocmp/t_terminfo

0.655525s

basic

Passed

N/A

0.460980s

missing

Passed

N/A

0.193190s

usr.bin/jot/t_jot

0.314509s

basic

Passed

N/A

0.133170s

format

Passed

N/A

0.180199s

usr.bin/ld/t_script

5.100153s

multisec

Passed

N/A

0.694091s

order_default

Passed

N/A

1.222123s

order_merge

Passed

N/A

1.050194s

order_reorder

Passed

N/A

1.058319s

order_sort

Passed

N/A

1.060995s

usr.bin/ld/t_section

0.815905s

orphan

Passed

N/A

0.427834s

startstop

Passed

N/A

0.385549s

usr.bin/m4/t_m4

0.280563s

eof

Passed

N/A

0.279377s

usr.bin/make/t_make

42.094457s

comment

Passed

N/A

0.947256s

cond1

Passed

N/A

0.822601s

cond2

Passed

N/A

0.790429s

doterror

Passed

N/A

0.844786s

dotwait

Passed

N/A

12.190665s

error

Passed

N/A

0.768427s

escape

Expected failure

see PR toolchain/49085: atf-check failed; see the output of the test for details

0.973620s

export

Passed

N/A

0.808734s

export_all

Passed

N/A

0.818068s

export_env

Passed

N/A

0.811039s

forloop

Passed

N/A

0.907470s

forsubst

Passed

N/A

0.772980s

hash

Passed

N/A

0.851153s

impsrc

Expected failure

see PR toolchain/49085: atf-check failed; see the output of the test for details

0.884449s

misc

Passed

N/A

0.783907s

moderrs

Passed

N/A

0.850924s

modmatch

Passed

N/A

0.967795s

modmisc

Passed

N/A

0.838309s

modorder

Passed

N/A

0.833464s

modts

Passed

N/A

0.922277s

modword

Passed

N/A

1.507237s

order

Passed

N/A

0.816910s

phony_end

Expected failure

see PR toolchain/49085: atf-check failed; see the output of the test for details

0.814279s

posix

Passed

N/A

0.885753s

posix1

Expected failure

see PR toolchain/49085: atf-check failed; see the output of the test for details

1.298763s

qequals

Passed

N/A

0.784031s

suffixes

Expected failure

see PR toolchain/49085: this uses up all memory and then fails

0.556788s

sunshcmd

Passed

N/A

0.832229s

sysv

Passed

N/A

0.835626s

ternary

Passed

N/A

0.899598s

unexport

Passed

N/A

0.799745s

unexport_env

Passed

N/A

0.802265s

varcmd

Passed

N/A

0.979149s

varmisc

Passed

N/A

0.909198s

varshell

Passed

N/A

0.939429s

usr.bin/mkdep/t_mkdep

1.071398s

prefix

Passed

N/A

0.289445s

prefix_and_suffixes

Passed

N/A

0.267997s

suffixes

Passed

N/A

0.510950s

usr.bin/nbperf/t_nbperf

38.407597s

bdz

Passed

N/A

12.751619s

chm

Passed

N/A

15.111292s

chm3

Passed

N/A

10.524898s

usr.bin/netpgpverify/t_netpgpverify

6.123831s

netpgpverify_testset_1_rsa_signatures

Passed

N/A

2.182082s

netpgpverify_testset_2_dsa_signatures

Passed

N/A

3.929893s

usr.bin/pr/t_basic

0.172326s

basic

Passed

N/A

0.171324s

usr.bin/rump_server/t_disk

2.943551s

data

Passed

N/A

0.450754s

notrunc

Passed

N/A

0.361371s

offset

Passed

N/A

0.345345s

size

Passed

N/A

0.350760s

type_blk

Passed

N/A

0.359664s

type_blk_default

Passed

N/A

0.356526s

type_chr

Passed

N/A

0.357589s

type_reg

Passed

N/A

0.350907s

usr.bin/shmif_dumpbus/t_basic

3.105117s

contents

Passed

N/A

0.438317s

header

Passed

N/A

0.233325s

pcap

Passed

N/A

2.418610s

usr.bin/sdiff/t_sdiff

3.290468s

dot

Passed

N/A

0.202924s

flags

Passed

N/A

0.260772s

iflags

Passed

N/A

0.519154s

merge

Passed

N/A

1.161318s

oneline

Passed

N/A

0.197992s

same

Passed

N/A

0.149898s

short

Passed

N/A

0.170481s

stdin

Passed

N/A

0.208531s

tabends

Passed

N/A

0.246908s

tabs

Passed

N/A

0.163572s

usr.bin/sed/t_sed

1.334807s

c2048

Passed

N/A

0.145631s

emptybackref

Expected failure

PR bin/28126: atf-check failed; see the output of the test for details

0.189066s

longlines

Passed

N/A

0.200271s

preserve_leading_ws_ia

Passed

N/A

0.142596s

rangeselection

Passed

N/A

0.653490s

usr.bin/sort/t_sort

8.669654s

any_char

Passed

N/A

0.225663s

basic

Passed

N/A

0.145505s

bflag

Passed

N/A

0.219958s

cflag

Passed

N/A

0.140509s

empty_file

Passed

N/A

0.191392s

end_of_options

Passed

N/A

0.178806s

kflag_alpha

Passed

N/A

0.596053s

kflag_limits

Passed

N/A

0.146512s

kflag_many_fields

Passed

N/A

0.157092s

kflag_no_end

Passed

N/A

0.156394s

kflag_nonmonotone

Passed

N/A

0.148349s

kflag_one_field

Passed

N/A

0.149181s

kflag_outofbounds

Passed

N/A

0.147134s

kflag_two_fields

Passed

N/A

0.149132s

long_file

Passed

N/A

0.544843s

long_records

Passed

N/A

0.202424s

mflag

Passed

N/A

0.161863s

mflag_uflag

Passed

N/A

0.148292s

mflag_uflag_first

Passed

N/A

0.190393s

missing_newline

Passed

N/A

0.140412s

nflag

Passed

N/A

0.153663s

nflag_rflag

Passed

N/A

0.156773s

null_bytes

Passed

N/A

0.139425s

oflag

Passed

N/A

0.182829s

oflag_displaced

Passed

N/A

0.137358s

plus_as_path

Passed

N/A

0.146130s

plus_bad_tempfile

Passed

N/A

0.145047s

plus_no_end

Passed

N/A

0.157074s

plus_nonmonotone

Passed

N/A

0.149908s

plus_one

Passed

N/A

0.158288s

plus_one_minus_two

Passed

N/A

0.159138s

plus_rflag_invalid

Passed

N/A

0.153001s

plus_tflag

Passed

N/A

0.754890s

plus_zero

Passed

N/A

0.141000s

rflag

Passed

N/A

0.157631s

sflag

Passed

N/A

0.157911s

sflag_many_files

Passed

N/A

0.168166s

tflag

Passed

N/A

0.245095s

tflag_alphabetic

Passed

N/A

0.145090s

tflag_char_pos

Passed

N/A

0.257770s

tflag_whitespace

Passed

N/A

0.320058s

uflag

Passed

N/A

0.151241s

uflag_rflag

Passed

N/A

0.149014s

usr.bin/tmux/t_tmux

2.141805s

stdin

Passed

N/A

2.141104s

usr.bin/tr/t_basic

3.679313s

csubst

Passed

N/A

0.225880s

dopt

Passed

N/A

1.476190s

dsopt

Passed

N/A

0.652110s

sopt

Passed

N/A

0.662360s

subst

Passed

N/A

0.659501s

usr.bin/unifdef/t_basic

0.337728s

basic

Passed

N/A

0.174865s

lastline

Passed

N/A

0.161100s

usr.bin/uniq/t_uniq

0.661078s

basic

Passed

N/A

0.135066s

show_duplicates

Passed

N/A

0.130485s

show_duplicates_from_third_character

Passed

N/A

0.128979s

show_uniques

Passed

N/A

0.135105s

test_counts

Passed

N/A

0.128052s

usr.bin/vmstat/t_vmstat

0.282632s

default

Passed

N/A

0.148252s

opt_s

Passed

N/A

0.133035s

usr.bin/xlint/lint1/t_integration

6.010980s

alignof

Passed

N/A

0.269348s

c99_complex_num

Passed

N/A

0.153818s

c99_complex_split

Passed

N/A

0.157054s

c99_decls_after_stmt

Passed

N/A

0.158523s

c99_decls_after_stmt3

Passed

N/A

0.164138s

c99_for_loops

Passed

N/A

0.158634s

c99_func

Passed

N/A

0.158654s

c99_recursive_init

Passed

N/A

0.150693s

c99_struct_init

Passed

N/A

0.150744s

c99_union_init1

Passed

N/A

0.156418s

c99_union_init2

Passed

N/A

0.151575s

c99_union_init3

Passed

N/A

0.155749s

c9x_array_init

Passed

N/A

0.150445s

c9x_recursive_init

Passed

N/A

0.152749s

cast_init

Passed

N/A

0.157541s

cast_init2

Passed

N/A

0.156701s

cast_lhs

Passed

N/A

0.156013s

compound_literals1

Passed

N/A

0.152917s

compound_literals2

Passed

N/A

0.148990s

constant_conv1

Passed

N/A

0.155242s

constant_conv2

Passed

N/A

0.152071s

cvt_in_ternary

Passed

N/A

0.153331s

ellipsis_in_switch

Passed

N/A

0.147410s

gcc_compound_statements1

Passed

N/A

0.152859s

gcc_compound_statements2

Passed

N/A

0.151385s

gcc_compound_statements3

Passed

N/A

0.154069s

gcc_func

Passed

N/A

0.153235s

gcc_variable_array_init

Passed

N/A

0.167837s

incorrect_array_size

Passed

N/A

0.159135s

long_double_int

Passed

N/A

0.153828s

nested_structs

Passed

N/A

0.158356s

nolimit_init

Passed

N/A

0.155084s

packed_structs

Passed

N/A

0.151466s

shift_to_narrower_type

Passed

N/A

0.152223s

type_conv1

Passed

N/A

0.155382s

type_conv2

Passed

N/A

0.149909s

type_conv3

Passed

N/A

0.150277s

zero_sized_arrays

Passed

N/A

0.150225s

usr.sbin/mtree/t_mtree

2.773991s

mtree_check

Passed

N/A

0.168342s

mtree_convert_C

Passed

N/A

0.125508s

mtree_convert_C_S

Passed

N/A

0.127057s

mtree_convert_D

Passed

N/A

0.143015s

mtree_convert_D_S

Passed

N/A

0.150877s

mtree_create

Passed

N/A

0.168470s

mtree_ignore

Passed

N/A

0.207538s

mtree_merge

Passed

N/A

0.145157s

mtree_nonemptydir

Passed

N/A

0.167904s

netbsd6_check

Passed

N/A

0.149253s

netbsd6_convert_C

Passed

N/A

0.116924s

netbsd6_convert_C_S

Passed

N/A

0.121307s

netbsd6_convert_D

Passed

N/A

0.123703s

netbsd6_convert_D_S

Passed

N/A

0.124380s

netbsd6_create

Passed

N/A

0.174066s

netbsd6_ignore

Passed

N/A

0.217266s

netbsd6_merge

Passed

N/A

0.142322s

netbsd6_nonemptydir

Passed

N/A

0.167213s

usr.sbin/tcpdump/t_tcpdump

10.218054s

promiscuous

Passed

N/A

10.217354s

usr.sbin/traceroute/t_traceroute

2.956315s

basic

Passed

N/A

1.492922s

basic_icmp

Passed

N/A

1.458583s

usr.sbin/useradd/t_useradd

0.349917s

longname

Expected failure

PR bin/39546: atf-check failed; see the output of the test for details

0.349293s

fs/ffs/t_fifos

0.186396s

fifos

Passed

N/A

0.185478s

fs/ffs/t_snapshot

5.570621s

snapshot

Passed

N/A

1.009331s

snapshotstress

Passed

N/A

4.559980s

fs/ffs/t_snapshot_log

5.670286s

snapshot

Passed

N/A

1.068098s

snapshotstress

Passed

N/A

4.600685s

fs/ffs/t_snapshot_v2

5.546597s

snapshot

Passed

N/A

0.973194s

snapshotstress

Passed

N/A

4.571705s

fs/ffs/t_mount

0.425603s

48Kimage

Expected failure

PR kern/43573: mount failed: Invalid argument

0.128779s

fsbsizeovermaxbsize

Passed

N/A

0.145506s

fsbsizeovermaxphys

Passed

N/A

0.145747s

fs/ffs/t_quota2_1

7.189951s

quota_1000_O1_be

Passed

N/A

1.274720s

quota_1000_O1_le

Passed

N/A

1.473054s

quota_1000_O2_be

Passed

N/A

1.285952s

quota_1000_O2_le

Passed

N/A

1.497263s

quota_40_O1_be

Passed

N/A

0.254111s

quota_40_O1_le

Passed

N/A

0.262895s

quota_40_O1_log

Passed

N/A

0.340663s

quota_40_O2_be

Passed

N/A

0.249229s

quota_40_O2_le

Passed

N/A

0.268787s

quota_40_O2_log

Passed

N/A

0.262958s

fs/ffs/t_quota2_remount

0.481225s

quota_10_O1_be

Passed

N/A

0.233618s

quota_10_O1_le

Passed

N/A

0.245241s

fs/ffs/t_getquota

9.863304s

get_be_1_both

Passed

N/A

0.841528s

get_be_1_group

Passed

N/A

0.836337s

get_be_1_user

Passed

N/A

0.818476s

get_be_2_both

Passed

N/A

0.807341s

get_be_2_group

Passed

N/A

0.827852s

get_be_2_user

Passed

N/A

0.804341s

get_le_1_both

Passed

N/A

0.810856s

get_le_1_group

Passed

N/A

0.836401s

get_le_1_user

Passed

N/A

0.796179s

get_le_2_both

Passed

N/A

0.819912s

get_le_2_group

Passed

N/A

0.819545s

get_le_2_user

Passed

N/A

0.825401s

fs/ffs/t_setquota

35.514867s

set_be_1_both

Passed

N/A

0.981880s

set_be_1_group

Passed

N/A

1.002853s

set_be_1_user

Passed

N/A

0.975245s

set_be_2_both

Passed

N/A

0.994249s

set_be_2_group

Passed

N/A

0.995563s

set_be_2_user

Passed

N/A

0.970522s

set_default_be_1_both

Passed

N/A

0.818739s

set_default_be_1_group

Passed

N/A

0.866062s

set_default_be_1_user

Passed

N/A

0.860543s

set_default_be_2_both

Passed

N/A

0.832303s

set_default_be_2_group

Passed

N/A

0.830760s

set_default_be_2_user

Passed

N/A

0.840123s

set_default_le_1_both

Passed

N/A

0.875334s

set_default_le_1_group

Passed

N/A

0.825731s

set_default_le_1_user

Passed

N/A

0.858019s

set_default_le_2_both

Passed

N/A

0.857540s

set_default_le_2_group

Passed

N/A

0.837246s

set_default_le_2_user

Passed

N/A

0.813181s

set_le_1_both

Passed

N/A

0.947069s

set_le_1_group

Passed

N/A

0.983784s

set_le_1_user

Passed

N/A

0.991960s

set_le_2_both

Passed

N/A

0.990012s

set_le_2_group

Passed

N/A

0.974493s

set_le_2_user

Passed

N/A

1.010203s

set_new_be_1_both

Passed

N/A

0.843543s

set_new_be_1_both_log

Passed

N/A

0.849382s

set_new_be_1_group

Passed

N/A

0.850833s

set_new_be_1_user

Passed

N/A

0.882075s

set_new_be_2_both

Passed

N/A

0.840247s

set_new_be_2_both_log

Passed

N/A

0.831042s

set_new_be_2_group

Passed

N/A

0.850618s

set_new_be_2_user

Passed

N/A

0.828548s

set_new_le_1_both

Passed

N/A

0.832367s

set_new_le_1_both_log

Passed

N/A

0.856319s

set_new_le_1_group

Passed

N/A

0.841174s

set_new_le_1_user

Passed

N/A

0.824115s

set_new_le_2_both

Passed

N/A

0.846821s

set_new_le_2_both_log

Passed

N/A

0.845759s

set_new_le_2_group

Passed

N/A

0.846192s

set_new_le_2_user

Passed

N/A

0.844741s

fs/ffs/t_quotalimit

26.259181s

herit_defq_le_1_group

Passed

N/A

0.994581s

herit_defq_le_1_group_log

Passed

N/A

1.024757s

herit_defq_le_1_user

Passed

N/A

1.006067s

herit_defq_le_1_user_log

Passed

N/A

1.047774s

herit_idefq_le_1_group_log

Passed

N/A

1.027365s

herit_idefq_le_1_user_log

Passed

N/A

1.043098s

inolimit_le_1_group

Passed

N/A

0.972687s

inolimit_le_1_group_log

Passed

N/A

0.979168s

inolimit_le_1_user

Passed

N/A

0.987015s

inolimit_le_1_user_log

Passed

N/A

1.008544s

limit_le_1_group

Passed

N/A

0.976922s

limit_le_1_group_log

Passed

N/A

1.001482s

limit_le_1_user

Passed

N/A

1.030945s

limit_le_1_user_log

Passed

N/A

0.998368s

sinolimit_le_1_group

Passed

N/A

3.004125s

sinolimit_le_1_user

Passed

N/A

3.004512s

slimit_le_1_group

Passed

N/A

3.127660s

slimit_le_1_user

Passed

N/A

2.994389s

fs/ffs/t_clearquota

14.856033s

clear_be_1_both

Passed

N/A

0.991977s

clear_be_1_both_log

Passed

N/A

0.988587s

clear_be_1_group

Passed

N/A

0.830311s

clear_be_1_user

Passed

N/A

0.856717s

clear_be_2_both

Passed

N/A

1.042880s

clear_be_2_both_log

Passed

N/A

1.007794s

clear_be_2_group

Passed

N/A

0.831730s

clear_be_2_user

Passed

N/A

0.867660s

clear_le_1_both

Passed

N/A

0.981331s

clear_le_1_both_log

Passed

N/A

1.015018s

clear_le_1_group

Passed

N/A

0.851564s

clear_le_1_user

Passed

N/A

0.900688s

clear_le_2_both

Passed

N/A

0.998061s

clear_le_2_both_log

Passed

N/A

1.011565s

clear_le_2_group

Passed

N/A

0.827609s

clear_le_2_user

Passed

N/A

0.825273s

fs/ffs/t_miscquota

21.984204s

default_deny_user

Passed

N/A

0.888416s

default_deny_user_big

Passed

N/A

8.164156s

log_unlink

Passed

N/A

0.822912s

log_unlink_remount

Passed

N/A

0.808336s

npsnapshot_unconf_user

Passed

N/A

1.469150s

npsnapshot_user

Passed

N/A

1.456138s

psnapshot_unconf_user

Passed

N/A

1.499255s

psnapshot_user

Passed

N/A

1.459392s

walk_list_user

Passed

N/A

5.399483s

fs/fifofs/t_fifo

0.605318s

parent_child

Passed

N/A

0.604519s

fs/hfs/t_pathconvert

0.124726s

colonslash

Passed

N/A

0.121277s

fs/kernfs/t_basic

0.136205s

getdents

Passed

N/A

0.067666s

hostname

Passed

N/A

0.066842s

fs/lfs/t_pr

0.273902s

mknod

Passed

N/A

0.261979s

fs/msdosfs/t_snapshot

5.409084s

snapshot

Passed

N/A

0.956725s

snapshotstress

Passed

N/A

4.451002s

fs/nfs/t_mountd

0.805381s

mountdhup

Expected failure

PR kern/5844: op failed with EACCES

0.801246s

fs/nfs/t_rquotad

14.511208s

get_nfs_be_1_both

Passed

N/A

2.663958s

get_nfs_be_1_group

Passed

N/A

2.386082s

get_nfs_be_1_user

Passed

N/A

2.234718s

get_nfs_le_1_both

Passed

N/A

2.614881s

get_nfs_le_1_group

Passed

N/A

2.363643s

get_nfs_le_1_user

Passed

N/A

2.230321s

fs/nullfs/t_basic

0.135759s

basic

Passed

N/A

0.068346s

twistymount

Passed

N/A

0.065303s

fs/psshfs/t_psshfs

8.325339s

inode_nos

Passed

N/A

2.327001s

ls

Passed

N/A

2.255361s

pwd

Passed

N/A

1.785002s

read_empty_file

Passed

N/A

1.941424s

fs/ptyfs/t_ptyfs

0.071398s

basic

Passed

N/A

0.070414s

fs/ptyfs/t_nullpts

0.070186s

nullrevoke

Passed

N/A

0.069232s

fs/puffs/t_basic

1.590114s

inactive_basic

Passed

N/A

0.169420s

inactive_reclaim

Passed

N/A

0.158026s

mount

Passed

N/A

0.160169s

reclaim_hardlink

Passed

N/A

0.159303s

root_chrdev

Passed

N/A

0.168974s

root_fifo

Passed

N/A

0.169433s

root_lnk

Passed

N/A

0.116224s

root_reg

Passed

N/A

0.152079s

signals

Passed

N/A

0.169110s

unlink_accessible

Passed

N/A

0.159415s

fs/puffs/t_fuzz

1.674418s

mountfuzz0

Passed

N/A

0.175821s

mountfuzz1

Passed

N/A

0.167195s

mountfuzz2

Passed

N/A

0.176926s

mountfuzz3

Passed

N/A

0.172952s

mountfuzz4

Passed

N/A

0.166786s

mountfuzz5

Passed

N/A

0.169993s

mountfuzz6

Passed

N/A

0.161670s

mountfuzz7

Passed

N/A

0.176268s

mountfuzz8

Passed

N/A

0.301112s

fs/puffs/t_io

0.204943s

nocache

Passed

N/A

0.203854s

fs/tmpfs/t_renamerace

4.076272s

renamerace2

Passed

N/A

4.075156s

fs/tmpfs/t_create

1.539966s

attrs

Passed

N/A

0.830463s

create

Passed

N/A

0.326111s

kqueue

Passed

N/A

0.381057s

fs/tmpfs/t_devices

0.499104s

basic

Passed

N/A

0.498065s

fs/tmpfs/t_dots

0.711624s

nesteddir

Passed

N/A

0.371396s

topdir

Passed

N/A

0.338427s

fs/tmpfs/t_exec

0.342455s

basic

Passed

N/A

0.341495s

fs/tmpfs/t_link

1.538498s

basic

Passed

N/A

0.511961s

kqueue

Passed

N/A

0.556971s

subdirs

Passed

N/A

0.466971s

fs/tmpfs/t_mkdir

10.927422s

attrs

Passed

N/A

0.716617s

kqueue

Passed

N/A

0.425066s

many

Passed

N/A

9.089112s

nested

Passed

N/A

0.348468s

single

Passed

N/A

0.343298s

fs/tmpfs/t_mknod

2.021686s

block

Passed

N/A

0.305161s

block_kqueue

Passed

N/A

0.376250s

char

Passed

N/A

0.293151s

char_kqueue

Passed

N/A

0.368902s

pipe

Passed

N/A

0.305618s

pipe_kqueue

Passed

N/A

0.367493s

fs/tmpfs/t_mount

1.655054s

attrs

Passed

N/A

0.265194s

large

Passed

N/A

0.355769s

mntpt

Passed

N/A

0.242524s

negative

Passed

N/A

0.257083s

options

Passed

N/A

0.277722s

plain

Passed

N/A

0.251085s

fs/tmpfs/t_pipes

0.288532s

basic

Passed

N/A

0.287571s

fs/tmpfs/t_read_write

0.784504s

basic

Passed

N/A

0.331742s

kqueue

Passed

N/A

0.451026s

fs/tmpfs/t_readdir

4.477107s

caching

Passed

N/A

0.388787s

dots

Passed

N/A

0.349739s

many

Passed

N/A

3.232563s

types

Passed

N/A

0.502463s

fs/tmpfs/t_remove

1.611625s

dot

Passed

N/A

0.341637s

kqueue

Passed

N/A

0.438025s

single

Passed

N/A

0.386780s

uchg

Passed

N/A

0.441818s

fs/tmpfs/t_rename

5.037734s

basic

Passed

N/A

0.417722s

crossdev

Passed

N/A

0.389917s

dir_to_emptydir

Passed

N/A

0.478037s

dir_to_file

Passed

N/A

0.456153s

dir_to_fulldir

Passed

N/A

0.593406s

dotdot

Passed

N/A

0.888950s

dots

Passed

N/A

0.377560s

file_to_dir

Passed

N/A

0.466915s

kqueue

Passed

N/A

0.960856s

fs/tmpfs/t_rmdir

3.334995s

curdir

Passed

N/A

0.363096s

dots

Passed

N/A

0.383261s

kqueue

Passed

N/A

0.436941s

links

Passed

N/A

0.435250s

mntpt

Passed

N/A

0.272656s

nested

Passed

N/A

0.383678s

non_empty

Passed

N/A

0.444778s

non_existent

Passed

N/A

0.268794s

single

Passed

N/A

0.338087s

fs/tmpfs/t_setattr

3.564058s

chgrp

Passed

N/A

0.347049s

chgrp_kqueue

Passed

N/A

0.379013s

chmod

Passed

N/A

0.322868s

chmod_kqueue

Passed

N/A

0.372595s

chown

Passed

N/A

0.349031s

chown_kqueue

Passed

N/A

0.368661s

chowngrp

Passed

N/A

0.330526s

chowngrp_kqueue

Passed

N/A

0.371022s

chtimes

Passed

N/A

0.349289s

chtimes_kqueue

Passed

N/A

0.364530s

fs/tmpfs/t_sizes

1.939859s

big

Passed

N/A

0.435616s

overflow

Passed

N/A

0.516510s

overwrite

Passed

N/A

0.688608s

small

Passed

N/A

0.295601s

fs/tmpfs/t_sockets

0.417107s

basic

Passed

N/A

0.416374s

fs/tmpfs/t_statvfs

0.281037s

values

Passed

N/A

0.280298s

fs/tmpfs/t_symlink

1.627097s

dir

Passed

N/A

0.442989s

exec

Passed

N/A

0.363445s

file

Passed

N/A

0.381939s

kqueue

Passed

N/A

0.434818s

fs/tmpfs/t_times

6.423061s

empty

Passed

N/A

2.381146s

link

Passed

N/A

1.320326s

non_empty

Passed

N/A

1.322062s

rename

Passed

N/A

1.395890s

fs/tmpfs/t_trail_slash

0.401183s

main

Passed

N/A

0.400289s

fs/tmpfs/t_truncate

0.323967s

basic

Passed

N/A

0.323039s

fs/tmpfs/t_vnd

3.456507s

basic

Passed

N/A

3.455219s

fs/tmpfs/t_vnode_leak

21.268437s

main

Passed

N/A

21.267453s

fs/umapfs/t_basic

0.067883s

basic

Passed

N/A

0.066848s

fs/union/t_pr

0.235373s

devnull1

Passed

N/A

0.075711s

devnull2

Passed

N/A

0.080833s

multilayer

Passed

N/A

0.076102s

fs/vfs/t_full

10.399185s

ext2fs_fillfs

Passed

N/A

0.692656s

ffs_fillfs

Passed

N/A

0.439961s

ffslog_fillfs

Passed

N/A

0.417240s

lfs_fillfs

Passed

N/A

0.728711s

msdosfs_fillfs

Passed

N/A

0.451458s

nfs_fillfs

Passed

N/A

1.476597s

p2k_ffs_fillfs

Skipped

fs does not support explicit block allocation (GOP_ALLOC)

0.395186s

puffs_fillfs

Skipped

fs does not support explicit block allocation (GOP_ALLOC)

0.294767s

rumpfs_fillfs

Skipped

fs does not support explicit block allocation (GOP_ALLOC)

0.273133s

sysvbfs_fillfs

Passed

N/A

0.932580s

tmpfs_fillfs

Passed

N/A

0.346356s

udf_fillfs

Passed

N/A

1.134051s

v7fs_fillfs

Passed

N/A

2.702595s

fs/vfs/t_io

51.670388s

ext2fs_extendfile

Passed

N/A

0.337877s

ext2fs_extendfile_append

Passed

N/A

0.318109s

ext2fs_holywrite

Passed

N/A

0.336731s

ext2fs_overwrite512

Passed

N/A

0.333879s

ext2fs_overwrite64k

Passed

N/A

0.327787s

ext2fs_overwrite_trunc

Passed

N/A

0.337716s

ext2fs_read_after_unlink

Passed

N/A

0.308007s

ext2fs_read_fault

Passed

N/A

0.329658s

ext2fs_shrinkfile

Passed

N/A

0.308135s

ext2fs_wrrd_after_unlink

Passed

N/A

0.332876s

ffs_extendfile

Passed

N/A

0.319255s

ffs_extendfile_append

Passed

N/A

0.321202s

ffs_holywrite

Passed

N/A

0.317838s

ffs_overwrite512

Passed

N/A

0.319889s

ffs_overwrite64k

Passed

N/A

0.343200s

ffs_overwrite_trunc

Passed

N/A

0.341991s

ffs_read_after_unlink

Passed

N/A

0.321837s

ffs_read_fault

Passed

N/A

0.322703s

ffs_shrinkfile

Passed

N/A

0.339185s

ffs_wrrd_after_unlink

Passed

N/A

0.332846s

ffslog_extendfile

Passed

N/A

0.351836s

ffslog_extendfile_append

Passed

N/A

0.325813s

ffslog_holywrite

Passed

N/A

0.333014s

ffslog_overwrite512

Passed

N/A

0.323352s

ffslog_overwrite64k

Passed

N/A

0.325197s

ffslog_overwrite_trunc

Passed

N/A

0.349876s

ffslog_read_after_unlink

Passed

N/A

0.346313s

ffslog_read_fault

Passed

N/A

0.348863s

ffslog_shrinkfile

Passed

N/A

0.351726s

ffslog_wrrd_after_unlink

Passed

N/A

0.364008s

lfs_extendfile

Passed

N/A

0.431199s

lfs_extendfile_append

Passed

N/A

0.400040s

lfs_holywrite

Passed

N/A

0.403283s

lfs_overwrite512

Passed

N/A

0.425688s

lfs_overwrite64k

Passed

N/A

0.404472s

lfs_overwrite_trunc

Passed

N/A

0.479171s

lfs_read_after_unlink

Passed

N/A

0.403668s

lfs_read_fault

Passed

N/A

0.400921s

lfs_shrinkfile

Passed

N/A

0.429258s

lfs_wrrd_after_unlink

Passed

N/A

0.401192s

msdosfs_extendfile

Passed

N/A

0.330795s

msdosfs_extendfile_append

Passed

N/A

0.330967s

msdosfs_holywrite

Passed

N/A

0.332628s

msdosfs_overwrite512

Passed

N/A

0.319419s

msdosfs_overwrite64k

Passed

N/A

0.331151s

msdosfs_overwrite_trunc

Passed

N/A

0.332063s

msdosfs_read_after_unlink

Passed

N/A

0.312269s

msdosfs_read_fault

Passed

N/A

0.307595s

msdosfs_shrinkfile

Passed

N/A

0.329690s

msdosfs_wrrd_after_unlink

Passed

N/A

0.319668s

nfs_extendfile

Passed

N/A

0.673005s

nfs_extendfile_append

Passed

N/A

0.667482s

nfs_holywrite

Passed

N/A

0.623936s

nfs_overwrite512

Passed

N/A

0.635879s

nfs_overwrite64k

Passed

N/A

0.667678s

nfs_overwrite_trunc

Passed

N/A

0.682252s

nfs_read_after_unlink

Passed

N/A

0.634271s

nfs_read_fault

Passed

N/A

0.853767s

nfs_shrinkfile

Passed

N/A

0.651732s

nfs_wrrd_after_unlink

Passed

N/A

0.658317s

p2k_ffs_extendfile

Passed

N/A

0.455764s

p2k_ffs_extendfile_append

Passed

N/A

0.447652s

p2k_ffs_holywrite

Passed

N/A

0.498256s

p2k_ffs_overwrite512

Passed

N/A

0.457883s

p2k_ffs_overwrite64k

Passed

N/A

0.498463s

p2k_ffs_overwrite_trunc

Passed

N/A

0.468067s

p2k_ffs_read_after_unlink

Passed

N/A

0.477849s

p2k_ffs_read_fault

Passed

N/A

0.457732s

p2k_ffs_shrinkfile

Passed

N/A

0.447498s

p2k_ffs_wrrd_after_unlink

Passed

N/A

0.488570s

puffs_extendfile

Passed

N/A

0.347848s

puffs_extendfile_append

Passed

N/A

0.379245s

puffs_holywrite

Passed

N/A

0.379511s

puffs_overwrite512

Passed

N/A

0.349426s

puffs_overwrite64k

Passed

N/A

0.379073s

puffs_overwrite_trunc

Passed

N/A

0.389375s

puffs_read_after_unlink

Passed

N/A

0.369621s

puffs_read_fault

Passed

N/A

0.369184s

puffs_shrinkfile

Passed

N/A

0.349368s

puffs_wrrd_after_unlink

Passed

N/A

0.389528s

rumpfs_extendfile

Passed

N/A

0.283113s

rumpfs_extendfile_append

Passed

N/A

0.281526s

rumpfs_holywrite

Passed

N/A

0.283621s

rumpfs_overwrite512

Passed

N/A

0.278315s

rumpfs_overwrite64k

Passed

N/A

0.276119s

rumpfs_overwrite_trunc

Passed

N/A

0.302789s

rumpfs_read_after_unlink

Passed

N/A

0.305279s

rumpfs_read_fault

Passed

N/A

0.306112s

rumpfs_shrinkfile

Passed

N/A

0.283476s

rumpfs_wrrd_after_unlink

Passed

N/A

0.283653s

sysvbfs_extendfile

Passed

N/A

0.300251s

sysvbfs_extendfile_append

Passed

N/A

0.324291s

sysvbfs_holywrite

Passed

N/A

0.322623s

sysvbfs_overwrite512

Passed

N/A

0.303538s

sysvbfs_overwrite64k

Passed

N/A

0.313351s

sysvbfs_overwrite_trunc

Passed

N/A

0.330779s

sysvbfs_read_after_unlink

Passed

N/A

0.328647s

sysvbfs_read_fault

Passed

N/A

0.322078s

sysvbfs_shrinkfile

Passed

N/A

0.326053s

sysvbfs_wrrd_after_unlink

Passed

N/A

0.321975s

tmpfs_extendfile

Passed

N/A

0.285441s

tmpfs_extendfile_append

Passed

N/A

0.293135s

tmpfs_holywrite

Passed

N/A

0.312853s

tmpfs_overwrite512

Passed

N/A

0.302500s

tmpfs_overwrite64k

Passed

N/A

0.311394s

tmpfs_overwrite_trunc

Passed

N/A

0.280619s

tmpfs_read_after_unlink

Passed

N/A

0.313483s

tmpfs_read_fault

Passed

N/A

0.311155s

tmpfs_shrinkfile

Passed

N/A

0.287296s

tmpfs_wrrd_after_unlink

Passed

N/A

0.310586s

udf_extendfile

Passed

N/A

0.586661s

udf_extendfile_append

Passed

N/A

0.568260s

udf_holywrite

Passed

N/A

0.597925s

udf_overwrite512

Passed

N/A

0.568760s

udf_overwrite64k

Passed

N/A

0.598279s

udf_overwrite_trunc

Passed

N/A

0.597347s

udf_read_after_unlink

Passed

N/A

0.827897s

udf_read_fault

Passed

N/A

0.568711s

udf_shrinkfile

Passed

N/A

0.568140s

udf_wrrd_after_unlink

Passed

N/A

0.568001s

v7fs_extendfile

Passed

N/A

0.340306s

v7fs_extendfile_append

Passed

N/A

0.329971s

v7fs_holywrite

Passed

N/A

0.348305s

v7fs_overwrite512

Passed

N/A

0.319059s

v7fs_overwrite64k

Passed

N/A

0.359798s

v7fs_overwrite_trunc

Passed

N/A

0.368280s

v7fs_read_after_unlink

Passed

N/A

0.346826s

v7fs_read_fault

Passed

N/A

0.318119s

v7fs_shrinkfile

Passed

N/A

0.315720s

v7fs_wrrd_after_unlink

Passed

N/A

0.605893s

fs/vfs/t_renamerace

116.206076s

ext2fs_renamerace

Passed

N/A

5.328699s

ext2fs_renamerace_dirs

Passed

N/A

5.326224s

ffs_renamerace

Passed

N/A

5.327476s

ffs_renamerace_dirs

Passed

N/A

5.329264s

ffslog_renamerace

Passed

N/A

5.366037s

ffslog_renamerace_dirs

Passed

N/A

5.360682s

lfs_renamerace

Passed

N/A

5.759074s

lfs_renamerace_dirs

Passed

N/A

5.756365s

msdosfs_renamerace

Expected failure

PR kern/43626: unmount failed: Device busy

5.313494s

msdosfs_renamerace_dirs

Expected signal

PR kern/43626

0.592232s

nfs_renamerace

Passed

N/A

5.678311s

nfs_renamerace_dirs

Passed

N/A

5.658997s

p2k_ffs_renamerace

Passed

N/A

5.468682s

p2k_ffs_renamerace_dirs

Passed

N/A

5.466861s

puffs_renamerace

Passed

N/A

5.356964s

puffs_renamerace_dirs

Passed

N/A

5.589738s

rumpfs_renamerace

Skipped

rename not supported by file system

0.268041s

rumpfs_renamerace_dirs

Skipped

rename not supported by file system

0.265487s

sysvbfs_renamerace

Skipped

filesystem has not enough inodes

0.290143s

sysvbfs_renamerace_dirs

Skipped

directories not supported by file system

0.286820s

tmpfs_renamerace

Passed

N/A

5.288977s

tmpfs_renamerace_dirs

Passed

N/A

5.276591s

udf_renamerace

Expected failure

PR kern/49046: race did not trigger this time

5.332030s

udf_renamerace_dirs

Passed

N/A

5.616356s

v7fs_renamerace

Passed

N/A

5.393007s

v7fs_renamerace_dirs

Passed

N/A

5.367320s

fs/vfs/t_ro

29.495410s

ext2fs_attrs

Passed

N/A

0.332740s

ext2fs_create

Passed

N/A

0.328303s

ext2fs_createdir

Passed

N/A

0.328385s

ext2fs_createfifo

Passed

N/A

0.325870s

ext2fs_createlink

Passed

N/A

0.308150s

ext2fs_createsymlink

Passed

N/A

0.325897s

ext2fs_fileio

Passed

N/A

0.331547s

ext2fs_rmfile

Passed

N/A

0.299934s

ffs_attrs

Passed

N/A

0.327250s

ffs_create

Passed

N/A

0.336903s

ffs_createdir

Passed

N/A

0.317320s

ffs_createfifo

Passed

N/A

0.337891s

ffs_createlink

Passed

N/A

0.339268s

ffs_createsymlink

Passed

N/A

0.311525s

ffs_fileio

Passed

N/A

0.328971s

ffs_rmfile

Passed

N/A

0.341259s

ffslog_attrs

Passed

N/A

0.326449s

ffslog_create

Passed

N/A

0.317541s

ffslog_createdir

Passed

N/A

0.316036s

ffslog_createfifo

Passed

N/A

0.334094s

ffslog_createlink

Passed

N/A

0.325340s

ffslog_createsymlink

Passed

N/A

0.335906s

ffslog_fileio

Passed

N/A

0.343238s

ffslog_rmfile

Passed

N/A

0.324662s

msdosfs_attrs

Passed

N/A

0.297158s

msdosfs_create

Passed

N/A

0.306198s

msdosfs_createdir

Passed

N/A

0.297557s

msdosfs_createfifo

Passed

N/A

0.308790s

msdosfs_createlink

Passed

N/A

0.321177s

msdosfs_createsymlink

Passed

N/A

0.323333s

msdosfs_fileio

Passed

N/A

0.300403s

msdosfs_rmfile

Passed

N/A

0.294730s

nfs_attrs

Passed

N/A

0.641708s

nfs_create

Passed

N/A

0.648667s

nfs_createdir

Passed

N/A

0.636111s

nfs_createfifo

Passed

N/A

0.673760s

nfs_createlink

Passed

N/A

0.649188s

nfs_createsymlink

Passed

N/A

0.631949s

nfs_fileio

Passed

N/A

0.667051s

nfs_rmfile

Passed

N/A

0.630860s

nfsro_attrs

Passed

N/A

0.660199s

nfsro_create

Passed

N/A

0.642349s

nfsro_createdir

Passed

N/A

0.645651s

nfsro_createfifo

Passed

N/A

0.629050s

nfsro_createlink

Passed

N/A

0.660524s

nfsro_createsymlink

Passed

N/A

0.647621s

nfsro_fileio

Passed

N/A

0.675577s

nfsro_rmfile

Passed

N/A

0.650345s

sysvbfs_attrs

Passed

N/A

0.316030s

sysvbfs_create

Passed

N/A

0.309644s

sysvbfs_createdir

Passed

N/A

0.300427s

sysvbfs_createfifo

Passed

N/A

0.301705s

sysvbfs_createlink

Passed

N/A

0.317122s

sysvbfs_createsymlink

Passed

N/A

0.296615s

sysvbfs_fileio

Passed

N/A

0.293315s

sysvbfs_rmfile

Passed

N/A

0.304515s

udf_attrs

Passed

N/A

0.573542s

udf_create

Passed

N/A

0.312689s

udf_createdir

Passed

N/A

0.334582s

udf_createfifo

Passed

N/A

0.330833s

udf_createlink

Passed

N/A

0.565469s

udf_createsymlink

Passed

N/A

0.310549s

udf_fileio

Passed

N/A

0.566218s

udf_rmfile

Passed

N/A

0.576980s

v7fs_attrs

Passed

N/A

0.342749s

v7fs_create

Passed

N/A

0.318874s

v7fs_createdir

Passed

N/A

0.312983s

v7fs_createfifo

Passed

N/A

0.340979s

v7fs_createlink

Passed

N/A

0.342331s

v7fs_createsymlink

Passed

N/A

0.314924s

v7fs_fileio

Passed

N/A

0.329201s

v7fs_rmfile

Passed

N/A

0.329258s

fs/vfs/t_rmdirrace

125.423283s

ext2fs_race

Passed

N/A

10.338055s

ffs_race

Passed

N/A

10.326068s

ffslog_race

Passed

N/A

10.341412s

lfs_race

Passed

N/A

10.492825s

msdosfs_race

Passed

N/A

10.313373s

nfs_race

Passed

N/A

10.663054s

p2k_ffs_race

Passed

N/A

10.436501s

puffs_race

Passed

N/A

10.348018s

rumpfs_race

Passed

N/A

10.279663s

sysvbfs_race

Skipped

directories not supported by file system

0.292095s

tmpfs_race

Passed

N/A

10.296840s

udf_race

Passed

N/A

10.949834s

v7fs_race

Passed

N/A

10.309072s

fs/vfs/t_union

9.571376s

ext2fs_basic

Skipped

fs does not support VOP_WHITEOUT

0.299618s

ext2fs_whiteout

Skipped

fs does not support VOP_WHITEOUT

0.325678s

ffs_basic

Passed

N/A

0.333538s

ffs_whiteout

Passed

N/A

0.351312s

ffslog_basic

Passed

N/A

0.336481s

ffslog_whiteout

Passed

N/A

0.354636s

lfs_basic

Passed

N/A

0.404357s

lfs_whiteout

Passed

N/A

0.455081s

msdosfs_basic

Skipped

fs does not support VOP_WHITEOUT

0.299496s

msdosfs_whiteout

Skipped

fs does not support VOP_WHITEOUT

0.356669s

nfs_basic

Skipped

fs does not support VOP_WHITEOUT

0.619767s

nfs_whiteout

Skipped

fs does not support VOP_WHITEOUT

0.664516s

p2k_ffs_basic

Skipped

fs does not support VOP_WHITEOUT

0.402156s

p2k_ffs_whiteout

Skipped

fs does not support VOP_WHITEOUT

0.458044s

puffs_basic

Skipped

fs does not support VOP_WHITEOUT

0.295389s

puffs_whiteout

Skipped

fs does not support VOP_WHITEOUT

0.339021s

rumpfs_basic

Passed

N/A

0.278212s

rumpfs_whiteout

Passed

N/A

0.327081s

sysvbfs_basic

Skipped

fs does not support VOP_WHITEOUT

0.290295s

sysvbfs_whiteout

Skipped

fs does not support VOP_WHITEOUT

0.329809s

tmpfs_basic

Passed

N/A

0.302254s

tmpfs_whiteout

Passed

N/A

0.330731s

udf_basic

Skipped

fs does not support VOP_WHITEOUT

0.325571s

udf_whiteout

Skipped

fs does not support VOP_WHITEOUT

0.350757s

v7fs_basic

Skipped

fs does not support VOP_WHITEOUT

0.309055s

v7fs_whiteout

Skipped

fs does not support VOP_WHITEOUT

0.348089s

fs/vfs/t_unpriv

19.376999s

ext2fs_dirperms

Passed

N/A

0.310978s

ext2fs_flags

Passed

N/A

0.299351s

ext2fs_owner

Passed

N/A

0.296948s

ext2fs_times

Passed

N/A

0.333321s

ffs_dirperms

Passed

N/A

0.312654s

ffs_flags

Passed

N/A

0.309483s

ffs_owner

Passed

N/A

0.306846s

ffs_times

Passed

N/A

0.319117s

ffslog_dirperms

Passed

N/A

0.326698s

ffslog_flags

Passed

N/A

0.313176s

ffslog_owner

Passed

N/A

0.331710s

ffslog_times

Passed

N/A

0.343637s

lfs_dirperms

Passed

N/A

0.419924s

lfs_flags

Passed

N/A

0.394670s

lfs_owner

Passed

N/A

0.416716s

lfs_times

Passed

N/A

0.391629s

msdosfs_dirperms

Passed

N/A

0.326881s

msdosfs_flags

Passed

N/A

0.321370s

msdosfs_owner

Skipped

owner not supported by file system

0.311141s

msdosfs_times

Passed

N/A

0.323288s

nfs_dirperms

Passed

N/A

0.636790s

nfs_flags

Skipped

file flags not supported by file system

0.635694s

nfs_owner

Passed

N/A

0.635464s

nfs_times

Passed

N/A

0.651279s

p2k_ffs_dirperms

Passed

N/A

0.482727s

p2k_ffs_flags

Passed

N/A

0.467980s

p2k_ffs_owner

Passed

N/A

0.438480s

p2k_ffs_times

Passed

N/A

0.487261s

puffs_dirperms

Passed

N/A

0.348205s

puffs_flags

Skipped

file flags not supported by file system

0.310955s

puffs_owner

Passed

N/A

0.376901s

puffs_times

Passed

N/A

0.359553s

rumpfs_dirperms

Passed

N/A

0.270596s

rumpfs_flags

Passed

N/A

0.276566s

rumpfs_owner

Passed

N/A

0.283747s

rumpfs_times

Passed

N/A

0.299217s

sysvbfs_dirperms

Skipped

directories not supported by file system

0.314493s

sysvbfs_flags

Skipped

file flags not supported by file system

0.299597s

sysvbfs_owner

Passed

N/A

0.321426s

sysvbfs_times

Passed

N/A

0.320961s

tmpfs_dirperms

Passed

N/A

0.280547s

tmpfs_flags

Passed

N/A

0.308025s

tmpfs_owner

Passed

N/A

0.302125s

tmpfs_times

Passed

N/A

0.287351s

udf_dirperms

Passed

N/A

0.565658s

udf_flags

Skipped

file flags not supported by file system

0.328452s

udf_owner

Passed

N/A

0.334010s

udf_times

Passed

N/A

0.583289s

v7fs_dirperms

Passed

N/A

0.337439s

v7fs_flags

Passed

N/A

0.338786s

v7fs_owner

Passed

N/A

0.311738s

v7fs_times

Passed

N/A

0.342141s

fs/vfs/t_vfsops

28.112506s

ext2fs_tfhinval

Passed

N/A

0.367583s

ext2fs_tfhremove

Passed

N/A

0.304499s

ext2fs_tfilehandle

Passed

N/A

0.318216s

ext2fs_tmount

Passed

N/A

0.303397s

ext2fs_tstatvfs

Passed

N/A

0.324177s

ext2fs_tsync

Passed

N/A

0.316918s

ffs_tfhinval

Passed

N/A

0.309289s

ffs_tfhremove

Passed

N/A

0.314141s

ffs_tfilehandle

Passed

N/A

0.332268s

ffs_tmount

Passed

N/A

0.306430s

ffs_tstatvfs

Passed

N/A

0.335335s

ffs_tsync

Passed

N/A

0.324877s

ffslog_tfhinval

Passed

N/A

0.343665s

ffslog_tfhremove

Passed

N/A

0.333185s

ffslog_tfilehandle

Passed

N/A

0.321677s

ffslog_tmount

Passed

N/A

0.314002s

ffslog_tstatvfs

Passed

N/A

0.309787s

ffslog_tsync

Passed

N/A

0.311209s

lfs_tfhinval

Passed

N/A

0.420761s

lfs_tfhremove

Expected failure

fhopen() for removed file succeeds (PR kern/43745): /usr/src/tests/fs/vfs/t_vfsops.c:152: Expected true value in rump_sys_fhopen(fhp, fhsize, O_RDONLY) == -1

0.413390s

lfs_tfilehandle

Passed

N/A

0.396014s

lfs_tmount

Passed

N/A

0.410187s

lfs_tstatvfs

Passed

N/A

0.413117s

lfs_tsync

Passed

N/A

0.412899s

msdosfs_tfhinval

Passed

N/A

0.309056s

msdosfs_tfhremove

Passed

N/A

0.319268s

msdosfs_tfilehandle

Passed

N/A

0.305780s

msdosfs_tmount

Passed

N/A

0.322477s

msdosfs_tstatvfs

Passed

N/A

0.303212s

msdosfs_tsync

Passed

N/A

0.301831s

nfs_tfhinval

Passed

N/A

0.655731s

nfs_tfhremove

Passed

N/A

0.635665s

nfs_tfilehandle

Passed

N/A

0.645621s

nfs_tmount

Passed

N/A

0.610767s

nfs_tstatvfs

Passed

N/A

0.640983s

nfs_tsync

Passed

N/A

0.628236s

p2k_ffs_tfhinval

Passed

N/A

0.451206s

p2k_ffs_tfhremove

Passed

N/A

0.458212s

p2k_ffs_tfilehandle

Passed

N/A

0.447772s

p2k_ffs_tmount

Passed

N/A

0.468184s

p2k_ffs_tstatvfs

Passed

N/A

0.448097s

p2k_ffs_tsync

Passed

N/A

0.447807s

puffs_tfhinval

Passed

N/A

0.368231s

puffs_tfhremove

Passed

N/A

0.349219s

puffs_tfilehandle

Passed

N/A

0.369628s

puffs_tmount

Passed

N/A

0.369675s

puffs_tstatvfs

Passed

N/A

0.369107s

puffs_tsync

Passed

N/A

0.358261s

rumpfs_tfhinval

Skipped

file handles not supported

0.270681s

rumpfs_tfhremove

Skipped

file handles not supported

0.297425s

rumpfs_tfilehandle

Skipped

file handles not supported

0.298420s

rumpfs_tmount

Passed

N/A

0.291258s

rumpfs_tstatvfs

Passed

N/A

0.284613s

rumpfs_tsync

Passed

N/A

0.282327s

sysvbfs_tfhinval

Skipped

file handles not supported

0.309457s

sysvbfs_tfhremove

Skipped

file handles not supported

0.316246s

sysvbfs_tfilehandle

Skipped

file handles not supported

0.304152s

sysvbfs_tmount

Passed

N/A

0.315301s

sysvbfs_tstatvfs

Passed

N/A

0.324615s

sysvbfs_tsync

Passed

N/A

0.289910s

tmpfs_tfhinval

Passed

N/A

0.293367s

tmpfs_tfhremove

Passed

N/A

0.276002s

tmpfs_tfilehandle

Passed

N/A

0.286889s

tmpfs_tmount

Passed

N/A

0.283992s

tmpfs_tstatvfs

Passed

N/A

0.304172s

tmpfs_tsync

Passed

N/A

0.302493s

udf_tfhinval

Skipped

file handles not supported

0.307388s

udf_tfhremove

Skipped

file handles not supported

0.311346s

udf_tfilehandle

Skipped

file handles not supported

0.307895s

udf_tmount

Passed

N/A

0.307002s

udf_tstatvfs

Passed

N/A

0.316696s

udf_tsync

Passed

N/A

0.310791s

v7fs_tfhinval

Skipped

file handles not supported

0.307074s

v7fs_tfhremove

Skipped

file handles not supported

0.311862s

v7fs_tfilehandle

Skipped

file handles not supported

0.309952s

v7fs_tmount

Passed

N/A

0.313692s

v7fs_tstatvfs

Passed

N/A

0.319561s

v7fs_tsync

Passed

N/A

0.326728s

fs/vfs/t_vnops

162.475100s

ext2fs_access_simple

Passed

N/A

0.338292s

ext2fs_attrs

Passed

N/A

0.340094s

ext2fs_create_exist

Passed

N/A

0.348459s

ext2fs_create_many

Passed

N/A

2.705668s

ext2fs_create_nametoolong

Passed

N/A

0.329419s

ext2fs_create_nonalphanum

Passed

N/A

0.481324s

ext2fs_dir_notempty

Passed

N/A

0.350073s

ext2fs_dir_rmdirdotdot

Passed

N/A

0.338909s

ext2fs_dir_simple

Passed

N/A

0.340411s

ext2fs_fcntl_getlock_pids

Passed

N/A

0.338972s

ext2fs_fcntl_lock

Passed

N/A

0.332859s

ext2fs_lookup_complex

Passed

N/A

0.333669s

ext2fs_lookup_simple

Passed

N/A

0.335544s

ext2fs_lstat_symlink

Passed

N/A

0.346970s

ext2fs_read_directory

Passed

N/A

0.338726s

ext2fs_rename_dir

Passed

N/A

0.333310s

ext2fs_rename_dotdot

Passed

N/A

0.348866s

ext2fs_rename_nametoolong

Passed

N/A

0.354183s

ext2fs_rename_reg_nodir

Passed

N/A

0.345167s

ext2fs_symlink_long

Passed

N/A

0.366662s

ext2fs_symlink_root

Passed

N/A

0.343761s

ext2fs_symlink_zerolen

Passed

N/A

0.328372s

ffs_access_simple

Passed

N/A

0.355975s

ffs_attrs

Passed

N/A

0.347845s

ffs_create_exist

Passed

N/A

0.358794s

ffs_create_many

Passed

N/A

1.540566s

ffs_create_nametoolong

Passed

N/A

0.341705s

ffs_create_nonalphanum

Passed

N/A

0.474068s

ffs_dir_notempty

Passed

N/A

0.335567s

ffs_dir_rmdirdotdot

Passed

N/A

0.341657s

ffs_dir_simple

Passed

N/A

0.370334s

ffs_fcntl_getlock_pids

Passed

N/A

0.356044s

ffs_fcntl_lock

Passed

N/A

0.355224s

ffs_lookup_complex

Passed

N/A

0.342937s

ffs_lookup_simple

Passed

N/A

0.336002s

ffs_lstat_symlink

Passed

N/A

0.333600s

ffs_read_directory

Passed

N/A

0.355914s

ffs_rename_dir

Passed

N/A

0.371515s

ffs_rename_dotdot

Passed

N/A

0.343309s

ffs_rename_nametoolong

Passed

N/A

0.353486s

ffs_rename_reg_nodir

Passed

N/A

0.365041s

ffs_symlink_long

Passed

N/A

0.367561s

ffs_symlink_root

Passed

N/A

0.361125s

ffs_symlink_zerolen

Passed

N/A

0.336906s

ffslog_access_simple

Passed

N/A

0.365353s

ffslog_attrs

Passed

N/A

0.342732s

ffslog_create_exist

Passed

N/A

0.355308s

ffslog_create_many

Passed

N/A

1.293263s

ffslog_create_nametoolong

Passed

N/A

0.353072s

ffslog_create_nonalphanum

Passed

N/A

0.492515s

ffslog_dir_notempty

Passed

N/A

0.367576s

ffslog_dir_rmdirdotdot

Passed

N/A

0.372723s

ffslog_dir_simple

Passed

N/A

0.363621s

ffslog_fcntl_getlock_pids

Passed

N/A

0.374776s

ffslog_fcntl_lock

Passed

N/A

0.347289s

ffslog_lookup_complex

Passed

N/A

0.364752s

ffslog_lookup_simple

Passed

N/A

0.346239s

ffslog_lstat_symlink

Passed

N/A

0.343883s

ffslog_read_directory

Passed

N/A

0.356017s

ffslog_rename_dir

Passed

N/A

0.356708s

ffslog_rename_dotdot

Passed

N/A

0.367613s

ffslog_rename_nametoolong

Passed

N/A

0.365692s

ffslog_rename_reg_nodir

Passed

N/A

0.355342s

ffslog_symlink_long

Passed

N/A

0.370361s

ffslog_symlink_root

Passed

N/A

0.366174s

ffslog_symlink_zerolen

Passed

N/A

0.368333s

lfs_access_simple

Passed

N/A

0.422832s

lfs_attrs

Passed

N/A

0.426774s

lfs_create_exist

Passed

N/A

0.428081s

lfs_create_many

Passed

N/A

3.605268s

lfs_create_nametoolong

Passed

N/A

0.430354s

lfs_create_nonalphanum

Passed

N/A

1.460134s

lfs_dir_notempty

Passed

N/A

0.434195s

lfs_dir_rmdirdotdot

Passed

N/A

0.427153s

lfs_dir_simple

Passed

N/A

0.429102s

lfs_fcntl_getlock_pids

Passed

N/A

0.431801s

lfs_fcntl_lock

Passed

N/A

0.421874s

lfs_lookup_complex

Passed

N/A

0.435897s

lfs_lookup_simple

Passed

N/A

0.409806s

lfs_lstat_symlink

Passed

N/A

0.428131s

lfs_read_directory

Passed

N/A

0.426365s

lfs_rename_dir

Passed

N/A

0.439855s

lfs_rename_dotdot

Passed

N/A

0.410175s

lfs_rename_nametoolong

Passed

N/A

0.434667s

lfs_rename_reg_nodir

Passed

N/A

0.435293s

lfs_symlink_long

Passed

N/A

0.437304s

lfs_symlink_root

Passed

N/A

0.432496s

lfs_symlink_zerolen

Passed

N/A

0.416073s

msdosfs_access_simple

Passed

N/A

0.341575s

msdosfs_attrs

Passed

N/A

0.348560s

msdosfs_create_exist

Passed

N/A

0.335792s

msdosfs_create_many

Passed

N/A

7.858589s

msdosfs_create_nametoolong

Passed

N/A

0.338759s

msdosfs_create_nonalphanum

Passed

N/A

0.430701s

msdosfs_dir_notempty

Passed

N/A

0.317676s

msdosfs_dir_rmdirdotdot

Passed

N/A

0.344102s

msdosfs_dir_simple

Passed

N/A

0.340249s

msdosfs_fcntl_getlock_pids

Passed

N/A

0.341562s

msdosfs_fcntl_lock

Passed

N/A

0.355534s

msdosfs_lookup_complex

Passed

N/A

0.330751s

msdosfs_lookup_simple

Passed

N/A

0.348059s

msdosfs_lstat_symlink

Skipped

symlinks not supported by file system

0.343627s

msdosfs_read_directory

Passed

N/A

0.325161s

msdosfs_rename_dir

Passed

N/A

0.340399s

msdosfs_rename_dotdot

Passed

N/A

0.337178s

msdosfs_rename_nametoolong

Passed

N/A

0.337143s

msdosfs_rename_reg_nodir

Passed

N/A

0.327988s

msdosfs_symlink_long

Skipped

symlinks not supported by file system

0.317056s

msdosfs_symlink_root

Skipped

symlinks not supported by file system

0.326033s

msdosfs_symlink_zerolen

Skipped

symlinks not supported by file system

0.339246s

nfs_access_simple

Passed

N/A

0.649937s

nfs_attrs

Passed

N/A

0.644563s

nfs_create_exist

Passed

N/A

0.668495s

nfs_create_many

Passed

N/A

7.404169s

nfs_create_nametoolong

Passed

N/A

0.643007s

nfs_create_nonalphanum

Passed

N/A

1.320043s

nfs_dir_notempty

Passed

N/A

0.656595s

nfs_dir_rmdirdotdot

Passed

N/A

0.644805s

nfs_dir_simple

Passed

N/A

0.675502s

nfs_fcntl_getlock_pids

Passed

N/A

0.670351s

nfs_fcntl_lock

Passed

N/A

0.685151s

nfs_lookup_complex

Passed

N/A

0.653174s

nfs_lookup_simple

Passed

N/A

0.657545s

nfs_lstat_symlink

Passed

N/A

0.666436s

nfs_read_directory

Passed

N/A

0.655120s

nfs_rename_dir

Passed

N/A

0.700204s

nfs_rename_dotdot

Passed

N/A

0.672390s

nfs_rename_nametoolong

Passed

N/A

0.648982s

nfs_rename_reg_nodir

Passed

N/A

0.644361s

nfs_symlink_long

Passed

N/A

0.742092s

nfs_symlink_root

Passed

N/A

0.637128s

nfs_symlink_zerolen

Passed

N/A

0.642867s

p2k_ffs_access_simple

Passed

N/A

0.477104s

p2k_ffs_attrs

Passed

N/A

0.488265s

p2k_ffs_create_exist

Passed

N/A

0.488149s

p2k_ffs_create_many

Passed

N/A

5.928885s

p2k_ffs_create_nametoolong

Passed

N/A

0.463724s

p2k_ffs_create_nonalphanum

Passed

N/A

1.028452s

p2k_ffs_dir_notempty

Passed

N/A

0.484213s

p2k_ffs_dir_rmdirdotdot

Passed

N/A

0.498149s

p2k_ffs_dir_simple

Passed

N/A

0.488295s

p2k_ffs_fcntl_getlock_pids

Passed

N/A

0.498163s

p2k_ffs_fcntl_lock

Passed

N/A

0.477364s

p2k_ffs_lookup_complex

Passed

N/A

0.488460s

p2k_ffs_lookup_simple

Passed

N/A

0.488172s

p2k_ffs_lstat_symlink

Passed

N/A

0.487703s

p2k_ffs_read_directory

Passed

N/A

0.478600s

p2k_ffs_rename_dir

Passed

N/A

0.518298s

p2k_ffs_rename_dotdot

Passed

N/A

0.477856s

p2k_ffs_rename_nametoolong

Passed

N/A

0.478164s

p2k_ffs_rename_reg_nodir

Passed

N/A

0.498396s

p2k_ffs_symlink_long

Passed

N/A

0.578100s

p2k_ffs_symlink_root

Passed

N/A

0.478333s

p2k_ffs_symlink_zerolen

Passed

N/A

0.498183s

puffs_access_simple

Passed

N/A

0.387450s

puffs_attrs

Passed

N/A

0.359667s

puffs_create_exist

Passed

N/A

0.379008s

puffs_create_many

Passed

N/A

4.411168s

puffs_create_nametoolong

Passed

N/A

0.377497s

puffs_create_nonalphanum

Passed

N/A

0.679790s

puffs_dir_notempty

Passed

N/A

0.369061s

puffs_dir_rmdirdotdot

Passed

N/A

0.379236s

puffs_dir_simple

Passed

N/A

0.369252s

puffs_fcntl_getlock_pids

Passed

N/A

0.368751s

puffs_fcntl_lock

Passed

N/A

0.389246s

puffs_lookup_complex

Passed

N/A

0.369616s

puffs_lookup_simple

Passed

N/A

0.389817s

puffs_lstat_symlink

Passed

N/A

0.388879s

puffs_read_directory

Passed

N/A

0.418832s

puffs_rename_dir

Passed

N/A

0.419683s

puffs_rename_dotdot

Passed

N/A

0.379293s

puffs_rename_nametoolong

Passed

N/A

0.359459s

puffs_rename_reg_nodir

Passed

N/A

0.388976s

puffs_symlink_long

Passed

N/A

0.419763s

puffs_symlink_root

Passed

N/A

0.368734s

puffs_symlink_zerolen

Passed

N/A

0.379402s

rumpfs_access_simple

Passed

N/A

0.300525s

rumpfs_attrs

Passed

N/A

0.311874s

rumpfs_create_exist

Passed

N/A

0.320107s

rumpfs_create_many

Passed

N/A

1.429564s

rumpfs_create_nametoolong

Passed

N/A

0.321524s

rumpfs_create_nonalphanum

Passed

N/A

0.368168s

rumpfs_dir_notempty

Passed

N/A

0.317015s

rumpfs_dir_rmdirdotdot

Passed

N/A

0.305886s

rumpfs_dir_simple

Passed

N/A

0.298360s

rumpfs_fcntl_getlock_pids

Passed

N/A

0.323606s

rumpfs_fcntl_lock

Passed

N/A

0.305217s

rumpfs_lookup_complex

Passed

N/A

0.306265s

rumpfs_lookup_simple

Passed

N/A

0.299774s

rumpfs_lstat_symlink

Passed

N/A

0.326399s

rumpfs_read_directory

Passed

N/A

0.316585s

rumpfs_rename_dir

Skipped

rename not supported by file system

0.317368s

rumpfs_rename_dotdot

Skipped

rename not supported by file system

0.321985s

rumpfs_rename_nametoolong

Skipped

rename not supported by file system

0.324199s

rumpfs_rename_reg_nodir

Skipped

rename not supported by file system

0.296187s

rumpfs_symlink_long

Passed

N/A

0.308202s

rumpfs_symlink_root

Passed

N/A

0.315358s

rumpfs_symlink_zerolen

Passed

N/A

0.297277s

sysvbfs_access_simple

Passed

N/A

0.328626s

sysvbfs_attrs

Passed

N/A

0.346961s

sysvbfs_create_exist

Passed

N/A

0.322882s

sysvbfs_create_many

Passed

N/A

0.318554s

sysvbfs_create_nametoolong

Passed

N/A

0.337863s

sysvbfs_create_nonalphanum

Passed

N/A

0.334701s

sysvbfs_dir_notempty

Skipped

directories not supported by file system

0.330571s

sysvbfs_dir_rmdirdotdot

Skipped

directories not supported by file system

0.336556s

sysvbfs_dir_simple

Skipped

directories not supported by file system

0.328729s

sysvbfs_fcntl_getlock_pids

Passed

N/A

0.350658s

sysvbfs_fcntl_lock

Passed

N/A

0.335897s

sysvbfs_lookup_complex

Skipped

directories not supported by file system

0.317865s

sysvbfs_lookup_simple

Passed

N/A

0.319176s

sysvbfs_lstat_symlink

Skipped

symlinks not supported by file system

0.333690s

sysvbfs_read_directory

Passed

N/A

0.317430s

sysvbfs_rename_dir

Skipped

directories not supported by file system

0.316444s

sysvbfs_rename_dotdot

Skipped

directories not supported by file system

0.326678s

sysvbfs_rename_nametoolong

Passed

N/A

0.325090s

sysvbfs_rename_reg_nodir

Passed

N/A

0.350156s

sysvbfs_symlink_long

Skipped

symlinks not supported by file system

0.322078s

sysvbfs_symlink_root

Skipped

symlinks not supported by file system

0.322315s

sysvbfs_symlink_zerolen

Skipped

symlinks not supported by file system

0.310657s

tmpfs_access_simple

Passed

N/A

0.309888s

tmpfs_attrs

Passed

N/A

0.308768s

tmpfs_create_exist

Passed

N/A

0.320127s

tmpfs_create_many

Passed

N/A

1.045546s

tmpfs_create_nametoolong

Passed

N/A

0.311200s

tmpfs_create_nonalphanum

Passed

N/A

0.367288s

tmpfs_dir_notempty

Passed

N/A

0.308244s

tmpfs_dir_rmdirdotdot

Passed

N/A

0.301121s

tmpfs_dir_simple

Passed

N/A

0.305421s

tmpfs_fcntl_getlock_pids

Passed

N/A

0.302898s

tmpfs_fcntl_lock

Passed

N/A

0.324399s

tmpfs_lookup_complex

Passed

N/A

0.323629s

tmpfs_lookup_simple

Passed

N/A

0.328943s

tmpfs_lstat_symlink

Passed

N/A

0.305375s

tmpfs_read_directory

Passed

N/A

0.308570s

tmpfs_rename_dir

Passed

N/A

0.311032s

tmpfs_rename_dotdot

Passed

N/A

0.310737s

tmpfs_rename_nametoolong

Passed

N/A

0.320942s

tmpfs_rename_reg_nodir

Passed

N/A

0.328246s

tmpfs_symlink_long

Passed

N/A

0.337390s

tmpfs_symlink_root

Passed

N/A

0.318919s

tmpfs_symlink_zerolen

Passed

N/A

0.320621s

udf_access_simple

Passed

N/A

0.615964s

udf_attrs

Passed

N/A

0.587354s

udf_create_exist

Passed

N/A

0.588096s

udf_create_many

Passed

N/A

1.893170s

udf_create_nametoolong

Passed

N/A

0.361602s

udf_create_nonalphanum

Passed

N/A

0.679874s

udf_dir_notempty

Passed

N/A

0.598339s

udf_dir_rmdirdotdot

Passed

N/A

0.608034s

udf_dir_simple

Passed

N/A

0.578608s

udf_fcntl_getlock_pids

Passed

N/A

0.589136s

udf_fcntl_lock

Passed

N/A

0.598284s

udf_lookup_complex

Passed

N/A

0.352055s

udf_lookup_simple

Passed

N/A

0.338284s

udf_lstat_symlink

Passed

N/A

0.584721s

udf_read_directory

Passed

N/A

0.345372s

udf_rename_dir

Passed

N/A

0.591227s

udf_rename_dotdot

Passed

N/A

0.619215s

udf_rename_nametoolong

Passed

N/A

0.617939s

udf_rename_reg_nodir

Passed

N/A

0.588433s

udf_symlink_long

Passed

N/A

0.628069s

udf_symlink_root

Passed

N/A

0.588607s

udf_symlink_zerolen

Passed

N/A

0.608199s

v7fs_access_simple

Passed

N/A

0.338042s

v7fs_attrs

Passed

N/A

0.332541s

v7fs_create_exist

Passed

N/A

0.345645s

v7fs_create_many

Passed

N/A

9.149926s

v7fs_create_nametoolong

Passed

N/A

0.340107s

v7fs_create_nonalphanum

Passed

N/A

0.701886s

v7fs_dir_notempty

Passed

N/A

0.354258s

v7fs_dir_rmdirdotdot

Passed

N/A

0.332571s

v7fs_dir_simple

Passed

N/A

0.352075s

v7fs_fcntl_getlock_pids

Passed

N/A

0.342205s

v7fs_fcntl_lock

Passed

N/A

0.345638s

v7fs_lookup_complex

Passed

N/A

0.335645s

v7fs_lookup_simple

Passed

N/A

0.356156s

v7fs_lstat_symlink

Passed

N/A

0.348454s

v7fs_read_directory

Passed

N/A

0.351307s

v7fs_rename_dir

Passed

N/A

0.368376s

v7fs_rename_dotdot

Passed

N/A

0.345769s

v7fs_rename_nametoolong

Passed

N/A

0.343281s

v7fs_rename_reg_nodir

Passed

N/A

0.340291s

v7fs_symlink_long

Passed

N/A

0.389680s

v7fs_symlink_root

Passed

N/A

0.337508s

v7fs_symlink_zerolen

Passed

N/A

0.355761s

fs/cd9660/t_high_ino_big_file

0.312003s

pr_kern_48787

Skipped

not enough free disk space, have 1048344 Kbytes, need ~ 4500000 Kbytes

0.310865s

rump/rumpkern/t_copy

0.205329s

copy_efault

Passed

N/A

0.018828s

copyinstr

Passed

N/A

0.057248s

copyoutstr

Passed

N/A

0.063122s

copystr

Passed

N/A

0.062706s

rump/rumpkern/t_kern

0.536932s

lockme_DESTROYHELD

Passed

N/A

0.084405s

lockme_DOUBLEFREE

Passed

N/A

0.088418s

lockme_DOUBLEINIT

Skipped

test requires LOCKDEBUG kernel

0.020821s

lockme_MEMFREE

Skipped

test requires LOCKDEBUG kernel

0.019936s

lockme_MTX

Passed

N/A

0.091796s

lockme_RWDOUBLEX

Passed

N/A

0.091936s

lockme_RWRX

Skipped

test requires LOCKDEBUG kernel

0.021441s

lockme_RWXR

Passed

N/A

0.085240s

rump/rumpkern/t_lwproc

0.535940s

inherit

Passed

N/A

0.062951s

lwps

Passed

N/A

0.073218s

makelwp

Passed

N/A

0.057741s

nolwp

Passed

N/A

0.058089s

nolwprelease

Passed

N/A

0.088427s

nullswitch

Passed

N/A

0.063444s

proccreds

Passed

N/A

0.059873s

rfork

Passed

N/A

0.061427s

rump/rumpkern/t_modcmd

0.069068s

cmsg_modcmd

Passed

N/A

0.068422s

rump/rumpkern/t_modlinkset

0.069252s

modlinkset

Passed

N/A

0.068660s

rump/rumpkern/t_signals

0.210331s

sigignore

Passed

N/A

0.057091s

sigpanic

Passed

N/A

0.086968s

sigraise

Passed

N/A

0.059455s

rump/rumpkern/t_threads

0.155526s

kthread

Passed

N/A

0.074952s

threadjoin

Passed

N/A

0.079198s

rump/rumpkern/t_tsleep

0.197065s

tsleep

Passed

N/A

0.196264s

rump/rumpkern/t_vm

10.224487s

busypage

Passed

N/A

0.062613s

uvmwait

Passed

N/A

10.160225s

rump/rumpkern/t_sp

30.172896s

basic

Passed

N/A

0.316988s

fork_fakeauth

Passed

N/A

0.339776s

fork_pipecomm

Passed

N/A

0.327335s

fork_simple

Passed

N/A

0.318565s

reconnect

Passed

N/A

2.481362s

signal

Passed

N/A

0.339864s

sigsafe

Passed

N/A

6.130813s

stress_killer

Passed

N/A

9.730809s

stress_long

Passed

N/A

6.858333s

stress_short

Passed

N/A

3.321051s

rump/rumpnet/t_shmif

8.381975s

crossping

Passed

N/A

8.380106s

rump/rumpvfs/t_basic

0.065719s

lseekrv

Passed

N/A

0.065059s

rump/rumpvfs/t_etfs

0.568540s

key

Passed

N/A

0.065119s

large_blk

Passed

N/A

0.206991s

range_blk

Passed

N/A

0.118232s

reregister_blk

Passed

N/A

0.110921s

reregister_reg

Passed

N/A

0.062147s

rump/rumpvfs/t_p2kifs

0.060027s

makecn

Passed

N/A

0.059178s

rump/modautoload/t_modautoload

0.020789s

modautoload

Skipped

host kernel modules not supported

0.019922s

modules/t_modctl

0.684451s

cmd_load

Passed

N/A

0.059910s

cmd_load_props

Passed

N/A

0.098218s

cmd_load_recurse

Passed

N/A

0.158047s

cmd_stat

Passed

N/A

0.101396s

cmd_unload

Passed

N/A

0.263531s

modules/t_builtin

0.331148s

busydisable

Passed

N/A

0.062137s

disable

Passed

N/A

0.064231s

disabledstat

Passed

N/A

0.066880s

forcereload

Passed

N/A

0.068419s

noauto

Passed

N/A

0.065617s

modules/t_abi_uvm

0.413603s

PAGE_SIZE

Passed

N/A

0.412525s

modules/t_modload

2.409452s

bflag

Passed

N/A

0.584664s

iflag

Passed

N/A

0.786440s

plain

Passed

N/A

0.451053s

sflag

Passed

N/A

0.582618s

crypto/libcrypto/t_certs

0.143475s

x509v3

Passed

N/A

0.142732s

crypto/libcrypto/t_ciphers

4.259876s

bf

Passed

N/A

0.171122s

cast

Passed

N/A

3.068722s

des

Passed

N/A

0.146345s

evp

Passed

N/A

0.301549s

idea

Passed

N/A

0.141545s

rc2

Passed

N/A

0.143446s

rc4

Passed

N/A

0.178690s

rc5

Skipped

RC5 support not available; system built with MKCRYPTO_RC5=no

0.102803s

crypto/libcrypto/t_hashes

0.973937s

hmac

Passed

N/A

0.136779s

md2

Passed

N/A

0.132835s

md4

Passed

N/A

0.134967s

md5

Passed

N/A

0.132734s

mdc2

Passed

N/A

0.139299s

ripemd

Passed

N/A

0.140458s

sha

Passed

N/A

0.151469s

crypto/libcrypto/t_libcrypto

8.779936s

bn

Passed

N/A

7.852250s

conf

Passed

N/A

0.162149s

engine

Passed

N/A

0.246283s

lhash

Passed

N/A

0.151449s

rand

Passed

N/A

0.134087s

threads

Passed

N/A

0.228789s

crypto/libcrypto/t_pubkey

25.292201s

dh

Passed

N/A

0.416038s

dsa

Passed

N/A

0.471991s

ec

Passed

N/A

8.715482s

ecdh

Passed

N/A

1.333977s

ecdsa

Passed

N/A

8.962384s

rsa

Passed

N/A

5.100847s

srp

Passed

N/A

0.285407s

crypto/opencrypto/t_opencrypto

5.413675s

aesctr1

Passed

N/A

0.406835s

aesctr2

Passed

N/A

0.383746s

arc4

Skipped

ARC4 not implemented by swcrypto

0.277922s

camellia

Passed

N/A

0.397188s

cbcdes

Passed

N/A

0.392056s

comp

Passed

N/A

0.439232s

comp_deflate

Passed

N/A

0.378977s

comp_zlib_rnd

Passed

N/A

0.392111s

gcm

Passed

N/A

0.377954s

md5

Passed

N/A

0.392810s

md5_hmac

Passed

N/A

0.396915s

null

Passed

N/A

0.384535s

sha1_hmac

Passed

N/A

0.388685s

xcbcmac

Passed

N/A

0.385578s

ipf/t_filter_exec

16.275925s

f1

Passed

N/A

0.488098s

f10

Passed

N/A

1.042983s

f11

Passed

N/A

0.476557s

f12

Passed

N/A

0.435651s

f13

Passed

N/A

0.593760s

f14

Passed

N/A

0.515956s

f15

Passed

N/A

0.174453s

f16

Passed

N/A

0.181034s

f17

Passed

N/A

0.171305s

f18

Passed

N/A

0.163757s

f19

Passed

N/A

0.247925s

f2

Passed

N/A

0.435940s

f20

Passed

N/A

0.171420s

f24

Passed

N/A

0.168150s

f25

Passed

N/A

0.181393s

f26

Expected failure

Known to be broken: results differ

0.444869s

f27

Expected failure

Known to be broken: results differ

0.445248s

f3

Passed

N/A

0.539864s

f30

Passed

N/A

0.330191s

f4

Passed

N/A

0.541479s

f5

Passed

N/A

2.575151s

f6

Passed

N/A

2.521999s

f7

Passed

N/A

0.577021s

f8

Passed

N/A

0.443146s

f9

Passed

N/A

1.040144s

ipv6_1

Passed

N/A

0.224639s

ipv6_2

Passed

N/A

0.335317s

ipv6_3

Passed

N/A

0.211723s

ipv6_5

Passed

N/A

0.273329s

ipv6_6

Passed

N/A

0.279664s

ipf/t_filter_parse

3.718549s

i1

Passed

N/A

0.197758s

i10

Passed

N/A

0.164336s

i11

Passed

N/A

0.158094s

i12

Passed

N/A

0.154233s

i13

Passed

N/A

0.143645s

i14

Passed

N/A

0.155134s

i15

Passed

N/A

0.155804s

i16

Passed

N/A

0.152119s

i17

Expected failure

Known to be broken: atf-check failed; see the output of the test for details

0.171292s

i18

Passed

N/A

0.155678s

i19

Passed

N/A

0.269017s

i2

Passed

N/A

0.155837s

i20

Passed

N/A

0.147770s

i21

Passed

N/A

0.145116s

i22

Passed

N/A

0.155449s

i23

Passed

N/A

0.143565s

i3

Passed

N/A

0.144908s

i4

Passed

N/A

0.156775s

i5

Passed

N/A

0.144811s

i6

Passed

N/A

0.147931s

i7

Passed

N/A

0.151165s

i8

Passed

N/A

0.167357s

i9

Passed

N/A

0.155283s

ipf/t_logging

1.474548s

l1

Passed

N/A

1.472173s

ipf/t_nat_exec

10.698574s

n1

Passed

N/A

0.347411s

n10

Passed

N/A

0.323903s

n100

Passed

N/A

0.214571s

n101

Passed

N/A

0.219610s

n102

Passed

N/A

0.222892s

n103

Passed

N/A

0.220309s

n104

Passed

N/A

0.218494s

n105

Passed

N/A

0.209808s

n106

Passed

N/A

0.219710s

n11

Passed

N/A

0.329516s

n11_6

Passed

N/A

0.331272s

n12

Passed

N/A

0.214474s

n12_6

Passed

N/A

0.214948s

n13

Passed

N/A

0.203235s

n14

Passed

N/A

0.214885s

n15_6

Passed

N/A

0.270262s

n16

Passed

N/A

0.213091s

n17

Passed

N/A

0.212336s

n1_6

Passed

N/A

0.337974s

n2

Passed

N/A

0.376518s

n200

Passed

N/A

0.214616s

n2_6

Passed

N/A

0.404789s

n3

Passed

N/A

0.279413s

n4

Passed

N/A

0.486981s

n4_6

Passed

N/A

0.491828s

n5

Passed

N/A

0.517166s

n5_6

Passed

N/A

0.515909s

n6

Passed

N/A

0.657695s

n6_6

Passed

N/A

0.442156s

n7

Passed

N/A

0.324751s

n7_6

Passed

N/A

0.338133s

n8

Passed

N/A

0.208695s

n8_6

Expected failure

See PR kern/47665: results differ

0.216575s

n9

Passed

N/A

0.205397s

n9_6

Expected failure

See PR kern/47665: results differ

0.220743s

ipf/t_nat_ipf_exec

4.359384s

ni1

Passed

N/A

0.194472s

ni10

Passed

N/A

0.192458s

ni11

Passed

N/A

0.194851s

ni12

Passed

N/A

0.188791s

ni13

Passed

N/A

0.212885s

ni14

Passed

N/A

0.193222s

ni15

Passed

N/A

0.203702s

ni16

Passed

N/A

0.207998s

ni17

Passed

N/A

0.176601s

ni18

Passed

N/A

0.177675s

ni19

Passed

N/A

0.216841s

ni2

Passed

N/A

0.198815s

ni20

Passed

N/A

0.217134s

ni21

Passed

N/A

0.195759s

ni23

Passed

N/A

0.188986s

ni3

Passed

N/A

0.193330s

ni4

Passed

N/A

0.197612s

ni5

Passed

N/A

0.211109s

ni6

Passed

N/A

0.188268s

ni7

Passed

N/A

0.194249s

ni8

Passed

N/A

0.188192s

ni9

Passed

N/A

0.188990s

ipf/t_nat_parse

3.162656s

in1

Passed

N/A

0.203309s

in100

Passed

N/A

0.145124s

in100_6

Passed

N/A

0.148888s

in101

Passed

N/A

0.152323s

in101_6

Passed

N/A

0.154464s

in102

Passed

N/A

0.145106s

in102_6

Passed

N/A

0.139467s

in1_6

Passed

N/A

0.151912s

in2

Passed

N/A

0.167098s

in2_6

Passed

N/A

0.159394s

in3

Passed

N/A

0.143060s

in3_6

Passed

N/A

0.156808s

in4

Passed

N/A

0.251131s

in4_6

Passed

N/A

0.146995s

in5

Passed

N/A

0.153676s

in5_6

Passed

N/A

0.143032s

in6

Passed

N/A

0.141335s

in6_6

Passed

N/A

0.152491s

in7

Passed

N/A

0.146767s

in8_6

Passed

N/A

0.139805s

ipf/t_pools

2.992653s

f28

Passed

N/A

0.187740s

f29

Passed

N/A

0.168545s

ip1

Passed

N/A

0.183441s

ip2

Passed

N/A

0.168665s

ip3

Passed

N/A

0.158759s

p1

Passed

N/A

0.175528s

p10

Passed

N/A

0.172378s

p11

Passed

N/A

0.166143s

p12

Passed

N/A

0.171085s

p13

Passed

N/A

0.170434s

p2

Passed

N/A

0.164336s

p3

Passed

N/A

0.178822s

p4

Passed

N/A

0.200219s

p5

Passed

N/A

0.172011s

p6

Passed

N/A

0.181382s

p7

Passed

N/A

0.174364s

p9

Passed

N/A

0.171896s

share/examples/t_asm

0.372267s

hello

Skipped

Example program not implemented on this platform

0.371476s

share/mk/t_lib

2.575769s

defaults__build_and_install

Passed

N/A

2.569242s

share/mk/t_own

0.644273s

makeconf__missing

Passed

N/A

0.250115s

makeconf__ok

Passed

N/A

0.391514s

share/mk/t_prog

2.245024s

defaults__build_and_install

Passed

N/A

1.355883s

without_man__build_and_install

Passed

N/A

0.879675s

share/mk/t_test

8.232879s

one_c

Passed

N/A

1.227792s

one_cxx

Passed

N/A

6.225257s

one_sh

Passed

N/A

0.768106s

atf/atf-c/detail/dynstr_test

5.516216s

append_ap

Passed

N/A

1.149142s

append_fmt

Passed

N/A

1.142337s

clear

Passed

N/A

0.012921s

copy

Passed

N/A

0.014173s

cstring

Passed

N/A

0.013844s

equal_cstring

Passed

N/A

0.013642s

equal_dynstr

Passed

N/A

0.013545s

fini_disown

Passed

N/A

0.014129s

init

Passed

N/A

0.013518s

init_ap

Passed

N/A

0.013632s

init_fmt

Passed

N/A

0.012838s

init_raw

Passed

N/A

0.013704s

init_rep

Passed

N/A

0.405154s

init_substr

Passed

N/A

0.013518s

length

Passed

N/A

0.034483s

prepend_ap

Passed

N/A

1.311725s

prepend_fmt

Passed

N/A

1.297975s

rfind_ch

Passed

N/A

0.014020s

atf/atf-c/detail/env_test

0.054267s

get

Passed

N/A

0.012714s

has

Passed

N/A

0.012805s

set

Passed

N/A

0.013101s

unset

Passed

N/A

0.013258s

atf/atf-c/detail/fs_test

0.366142s

eaccess

Passed

N/A

0.016222s

exists

Passed

N/A

0.014814s

getcwd

Passed

N/A

0.014741s

mkdtemp_err

Passed

N/A

0.016479s

mkdtemp_ok

Passed

N/A

0.014377s

mkdtemp_umask

Passed

N/A

0.014199s

mkstemp_err

Passed

N/A

0.015219s

mkstemp_ok

Passed

N/A

0.014642s

mkstemp_umask

Passed

N/A

0.014270s

path_append

Passed

N/A

0.013825s

path_branch_path

Passed

N/A

0.014600s

path_copy

Passed

N/A

0.014328s

path_equal

Passed

N/A

0.014170s

path_is_absolute

Passed

N/A

0.014087s

path_is_root

Passed

N/A

0.014391s

path_leaf_name

Passed

N/A

0.013621s

path_normalize

Passed

N/A

0.014401s

path_to_absolute

Passed

N/A

0.014789s

rmdir_empty

Passed

N/A

0.014419s

rmdir_enotempty

Passed

N/A

0.014218s

rmdir_eperm

Passed

N/A

0.014051s

stat_mode

Passed

N/A

0.013965s

stat_perms

Passed

N/A

0.014404s

stat_type

Passed

N/A

0.014219s

atf/atf-c/detail/list_test

0.123978s

list_append

Passed

N/A

0.013938s

list_append_list

Passed

N/A

0.013117s

list_for_each

Passed

N/A

0.013461s

list_for_each_c

Passed

N/A

0.013660s

list_index

Passed

N/A

0.013443s

list_index_c

Passed

N/A

0.013087s

list_init

Passed

N/A

0.012907s

list_to_charpp_empty

Passed

N/A

0.012427s

list_to_charpp_some

Passed

N/A

0.012992s

atf/atf-c/detail/map_test

0.175414s

find

Passed

N/A

0.013191s

find_c

Passed

N/A

0.012282s

map_for_each

Passed

N/A

0.021719s

map_for_each_c

Passed

N/A

0.013456s

map_init

Passed

N/A

0.011748s

map_init_charpp_empty

Passed

N/A

0.011987s

map_init_charpp_null

Passed

N/A

0.011709s

map_init_charpp_short

Passed

N/A

0.011907s

map_init_charpp_some

Passed

N/A

0.011996s

map_insert

Passed

N/A

0.012238s

stable_keys

Passed

N/A

0.012118s

to_charpp_empty

Passed

N/A

0.012086s

to_charpp_some

Passed

N/A

0.011919s

atf/atf-c/detail/process_test

2.015939s

child_pid

Passed

N/A

0.017059s

child_wait_eintr

Passed

N/A

1.025449s

exec_failure

Passed

N/A

0.028902s

exec_list

Passed

N/A

0.021575s

exec_prehook

Passed

N/A

0.017301s

exec_success

Passed

N/A

0.020469s

fork_cookie

Passed

N/A

0.020143s

fork_out_capture_err_capture

Passed

N/A

0.019475s

fork_out_capture_err_connect

Passed

N/A

0.019176s

fork_out_capture_err_default

Passed

N/A

0.018392s

fork_out_capture_err_inherit

Passed

N/A

0.018520s

fork_out_capture_err_redirect_fd

Passed

N/A

0.018739s

fork_out_capture_err_redirect_path

Passed

N/A

0.018568s

fork_out_connect_err_capture

Passed

N/A

0.019235s

fork_out_connect_err_connect

Passed

N/A

0.018418s

fork_out_connect_err_default

Passed

N/A

0.018598s

fork_out_connect_err_inherit

Passed

N/A

0.019054s

fork_out_connect_err_redirect_fd

Passed

N/A

0.018739s

fork_out_connect_err_redirect_path

Passed

N/A

0.018473s

fork_out_default_err_capture

Passed

N/A

0.019046s

fork_out_default_err_connect

Passed

N/A

0.018647s

fork_out_default_err_default

Passed

N/A

0.018928s

fork_out_default_err_inherit

Passed

N/A

0.018811s

fork_out_default_err_redirect_fd

Passed

N/A

0.018981s

fork_out_default_err_redirect_path

Passed

N/A

0.018724s

fork_out_inherit_err_capture

Passed

N/A

0.018833s

fork_out_inherit_err_connect

Passed

N/A

0.018556s

fork_out_inherit_err_default

Passed

N/A

0.018842s

fork_out_inherit_err_inherit

Passed

N/A

0.018558s

fork_out_inherit_err_redirect_fd

Passed

N/A

0.018711s

fork_out_inherit_err_redirect_path

Passed

N/A

0.018528s

fork_out_redirect_fd_err_capture

Passed

N/A

0.018545s

fork_out_redirect_fd_err_connect

Passed

N/A

0.018544s

fork_out_redirect_fd_err_default

Passed

N/A

0.018871s

fork_out_redirect_fd_err_inherit

Passed

N/A

0.018545s

fork_out_redirect_fd_err_redirect_fd

Passed

N/A

0.021907s

fork_out_redirect_fd_err_redirect_path

Passed

N/A

0.021277s

fork_out_redirect_path_err_capture

Passed

N/A

0.020161s

fork_out_redirect_path_err_connect

Passed

N/A

0.020629s

fork_out_redirect_path_err_default

Passed

N/A

0.020188s

fork_out_redirect_path_err_inherit

Passed

N/A

0.020745s

fork_out_redirect_path_err_redirect_fd

Passed

N/A

0.020936s

fork_out_redirect_path_err_redirect_path

Passed

N/A

0.019727s

status_coredump

Passed

N/A

0.020477s

status_exited

Passed

N/A

0.020620s

status_signaled

Passed

N/A

0.020394s

stream_init_capture

Passed

N/A

0.014705s

stream_init_connect

Passed

N/A

0.014338s

stream_init_inherit

Passed

N/A

0.015614s

stream_init_redirect_fd

Passed

N/A

0.015600s

stream_init_redirect_path

Passed

N/A

0.014370s

atf/atf-c/detail/sanity_test

0.112779s

inv

Passed

N/A

0.023950s

post

Passed

N/A

0.027751s

pre

Passed

N/A

0.028237s

unreachable

Passed

N/A

0.025890s

atf/atf-c/detail/text_test

0.099137s

for_each_word

Passed

N/A

0.013974s

format

Passed

N/A

0.013583s

format_ap

Passed

N/A

0.013220s

split

Passed

N/A

0.014122s

split_delims

Passed

N/A

0.013561s

to_bool

Passed

N/A

0.013482s

to_long

Passed

N/A

0.013318s

atf/atf-c/detail/user_test

0.053600s

euid

Passed

N/A

0.012723s

is_member_of_group

Passed

N/A

0.013228s

is_root

Passed

N/A

0.012527s

is_unprivileged

Passed

N/A

0.012703s

atf/atf-c/atf_c_test

0.214347s

include

Passed

N/A

0.213219s

atf/atf-c/build_test

0.223052s

c_o

Passed

N/A

0.015011s

cpp

Passed

N/A

0.013602s

cxx_o

Passed

N/A

0.014917s

equal_arrays

Passed

N/A

0.013057s

include

Passed

N/A

0.163026s

atf/atf-c/check_test

2.527747s

build_c_o

Passed

N/A

0.276375s

build_cpp

Passed

N/A

0.340162s

build_cxx_o

Passed

N/A

1.610644s

exec_array

Passed

N/A

0.023558s

exec_cleanup

Passed

N/A

0.020982s

exec_exitstatus

Passed

N/A

0.032165s

exec_stdout_stderr

Passed

N/A

0.029450s

exec_umask

Passed

N/A

0.012371s

exec_unknown

Passed

N/A

0.017213s

include

Passed

N/A

0.156492s

atf/atf-c/config_test

0.175544s

get

Passed

N/A

0.013328s

include

Passed

N/A

0.160809s

atf/atf-c/error_test

0.427719s

error_new

Passed

N/A

0.012687s

error_new_wo_memory

Passed

N/A

0.012426s

format

Passed

N/A

0.012805s

include

Passed

N/A

0.153686s

include_fwd

Passed

N/A

0.141877s

is_error

Passed

N/A

0.012571s

libc_format

Passed

N/A

0.013909s

libc_new

Passed

N/A

0.012084s

no_error

Passed

N/A

0.012281s

no_memory_format

Passed

N/A

0.012018s

no_memory_new

Passed

N/A

0.012056s

no_memory_twice

Passed

N/A

0.012369s

atf/atf-c/macros_test

1.283736s

check

Passed

N/A

0.030385s

check_eq

Passed

N/A

0.051286s

check_errno

Passed

N/A

0.030348s

check_match

Passed

N/A

0.035818s

check_streq

Passed

N/A

0.055818s

detect_unused_tests

Expected failure

PR 49187: Build of unused_test.c passed; unused test cases are not properly detected

0.360392s

include

Passed

N/A

0.211825s

msg_embedded_fmt

Passed

N/A

0.032346s

require

Passed

N/A

0.028395s

require_eq

Passed

N/A

0.044856s

require_errno

Passed

N/A

0.026476s

require_match

Passed

N/A

0.033284s

require_streq

Passed

N/A

0.048227s

use

Passed

N/A

0.281021s

atf/atf-c/tc_test

0.213794s

config

Passed

N/A

0.011850s

include

Passed

N/A

0.162376s

init

Passed

N/A

0.012315s

init_pack

Passed

N/A

0.012213s

vars

Passed

N/A

0.011661s

atf/atf-c/tp_test

0.164015s

getopt

Passed

N/A

0.013583s

include

Passed

N/A

0.148566s

atf/atf-c/utils_test

0.699248s

cat_file__empty

Passed

N/A

0.013069s

cat_file__no_newline_eof

Passed

N/A

0.015331s

cat_file__one_line

Passed

N/A

0.013321s

cat_file__several_lines

Passed

N/A

0.018492s

compare_file__empty__match

Passed

N/A

0.014493s

compare_file__empty__not_match

Passed

N/A

0.014095s

compare_file__long__match

Passed

N/A

0.014168s

compare_file__long__not_match

Passed

N/A

0.014646s

compare_file__short__match

Passed

N/A

0.013873s

compare_file__short__not_match

Passed

N/A

0.014182s

copy_file__empty

Passed

N/A

0.013956s

copy_file__some_contents

Passed

N/A

0.014017s

create_file

Passed

N/A

0.013811s

file_exists

Passed

N/A

0.014032s

fork

Passed

N/A

0.017383s

free_charpp__empty

Passed

N/A

0.014061s

free_charpp__some

Passed

N/A

0.013915s

grep_file

Passed

N/A

0.016503s

grep_string

Passed

N/A

0.013701s

include

Passed

N/A

0.200522s

readline__none

Passed

N/A

0.013276s

readline__some

Passed

N/A

0.013451s

redirect__other

Passed

N/A

0.012749s

redirect__stderr

Passed

N/A

0.012768s

redirect__stdout

Passed

N/A

0.013323s

wait__invalid_exitstatus

Passed

N/A

0.019657s

wait__invalid_stderr

Passed

N/A

0.023376s

wait__invalid_stdout

Passed

N/A

0.022425s

wait__ok

Passed

N/A

0.020523s

wait__save_stderr

Passed

N/A

0.022141s

wait__save_stdout

Passed

N/A

0.021996s

atf/atf-c/pkg_config_test

0.004828s

build

Skipped

Required program 'pkg-config' not found in the PATH

0.002663s

version

Skipped

Required program 'pkg-config' not found in the PATH

0.002060s

atf/atf-c++/detail/application_test

0.027167s

getopt

Passed

N/A

0.025907s

atf/atf-c++/detail/auto_array_test

0.239286s

auto_array_access

Passed

N/A

0.025895s

auto_array_assign

Passed

N/A

0.026115s

auto_array_assign_ref

Passed

N/A

0.024511s

auto_array_copy

Passed

N/A

0.025935s

auto_array_copy_ref

Passed

N/A

0.025567s

auto_array_get

Passed

N/A

0.026406s

auto_array_release

Passed

N/A

0.026877s

auto_array_reset

Passed

N/A

0.026144s

auto_array_scope

Passed

N/A

0.025612s

atf/atf-c++/detail/env_test

0.078372s

has_get

Passed

N/A

0.025354s

set

Passed

N/A

0.025750s

unset

Passed

N/A

0.025438s

atf/atf-c++/detail/exceptions_test

0.118485s

throw_atf_error_libc

Passed

N/A

0.040664s

throw_atf_error_no_memory

Passed

N/A

0.039165s

throw_atf_error_unknown

Passed

N/A

0.037002s

atf/atf-c++/detail/fs_test

0.482450s

directory_file_info

Passed

N/A

0.024851s

directory_names

Passed

N/A

0.027489s

directory_read

Passed

N/A

0.026338s

exists

Passed

N/A

0.026427s

file_info_perms

Passed

N/A

0.029888s

file_info_stat

Passed

N/A

0.024732s

is_executable

Passed

N/A

0.024569s

path_branch_path

Passed

N/A

0.024098s

path_compare_different

Passed

N/A

0.023499s

path_compare_equal

Passed

N/A

0.025727s

path_concat

Passed

N/A

0.024137s

path_is_absolute

Passed

N/A

0.023572s

path_is_root

Passed

N/A

0.023735s

path_leaf_name

Passed

N/A

0.024510s

path_normalize

Passed

N/A

0.023729s

path_op_less

Passed

N/A

0.023861s

path_to_absolute

Passed

N/A

0.024495s

remove

Passed

N/A

0.038857s

atf/atf-c++/detail/process_test

0.273557s

argv_array_assign

Passed

N/A

0.022849s

argv_array_copy

Passed

N/A

0.025648s

argv_array_exec_argv

Passed

N/A

0.026242s

argv_array_init_carray

Passed

N/A

0.025908s

argv_array_init_col

Passed

N/A

0.023760s

argv_array_init_empty

Passed

N/A

0.023432s

argv_array_init_varargs

Passed

N/A

0.025933s

argv_array_iter

Passed

N/A

0.026598s

exec_failure

Passed

N/A

0.034767s

exec_success

Passed

N/A

0.030630s

atf/atf-c++/detail/sanity_test

0.023838s

nothing

Passed

N/A

0.023072s

atf/atf-c++/detail/text_test

0.335353s

duplicate

Passed

N/A

0.026718s

join

Passed

N/A

0.030309s

match

Passed

N/A

0.042459s

split

Passed

N/A

0.025909s

split_delims

Passed

N/A

0.026686s

to_bool

Passed

N/A

0.040493s

to_bytes

Passed

N/A

0.039219s

to_string

Passed

N/A

0.026639s

to_type

Passed

N/A

0.041236s

trim

Passed

N/A

0.026702s

atf/atf-c++/atf_c++_test

1.789548s

include

Passed

N/A

1.788323s

atf/atf-c++/build_test

0.955556s

c_o

Passed

N/A

0.028463s

cpp

Passed

N/A

0.026979s

cxx_o

Passed

N/A

0.024510s

equal_argvs

Passed

N/A

0.026037s

include

Passed

N/A

0.846272s

atf/atf-c++/check_test

3.432065s

build_c_o

Passed

N/A

0.561593s

build_cpp

Passed

N/A

0.191090s

build_cxx_o

Passed

N/A

1.466062s

exec_cleanup

Passed

N/A

0.037358s

exec_exitstatus

Passed

N/A

0.052921s

exec_stdout_stderr

Passed

N/A

0.047260s

exec_unknown

Passed

N/A

0.035551s

include

Passed

N/A

1.032356s

atf/atf-c++/config_test

1.035529s

get

Passed

N/A

0.028719s

get_all

Passed

N/A

0.023445s

has

Passed

N/A

0.024465s

include

Passed

N/A

0.956099s

atf/atf-c++/macros_test

6.885634s

check_errno

Passed

N/A

0.050436s

detect_unused_tests

Expected failure

PR 49187: Build of unused_test.cpp passed; unused test cases are not properly detected

2.243367s

fail

Passed

N/A

0.034248s

include

Passed

N/A

1.811145s

pass

Passed

N/A

0.034771s

require

Passed

N/A

0.050310s

require_eq

Passed

N/A

0.057659s

require_errno

Passed

N/A

0.051902s

require_in

Passed

N/A

0.069725s

require_match

Passed

N/A

0.042967s

require_not_in

Passed

N/A

0.070877s

require_throw

Passed

N/A

0.079167s

require_throw_re

Passed

N/A

0.101134s

skip

Passed

N/A

0.034379s

use

Passed

N/A

2.135845s

atf/atf-c++/tests_test

1.037974s

atf_tp_writer

Passed

N/A

0.023410s

include

Passed

N/A

1.012914s

atf/atf-c++/utils_test

1.727857s

cat_file__empty

Passed

N/A

0.031971s

cat_file__no_newline_eof

Passed

N/A

0.024906s

cat_file__one_line

Passed

N/A

0.026924s

cat_file__several_lines

Passed

N/A

0.027177s

compare_file__empty__match

Passed

N/A

0.024312s

compare_file__empty__not_match

Passed

N/A

0.025756s

compare_file__long__match

Passed

N/A

0.027271s

compare_file__long__not_match

Passed

N/A

0.024970s

compare_file__short__match

Passed

N/A

0.026028s

compare_file__short__not_match

Passed

N/A

0.027056s

copy_file__empty

Passed

N/A

0.024519s

copy_file__some_contents

Passed

N/A

0.025653s

create_file

Passed

N/A

0.026819s

file_exists

Passed

N/A

0.024612s

fork

Passed

N/A

0.032730s

grep_collection__set

Passed

N/A

0.024557s

grep_collection__vector

Passed

N/A

0.026107s

grep_file

Passed

N/A

0.027837s

grep_string

Passed

N/A

0.025951s

include

Passed

N/A

0.877838s

redirect__other

Passed

N/A

0.027021s

redirect__stderr

Passed

N/A

0.027083s

redirect__stdout

Passed

N/A

0.026729s

wait__invalid_exitstatus

Passed

N/A

0.041265s

wait__invalid_stderr

Passed

N/A

0.040785s

wait__invalid_stdout

Passed

N/A

0.040093s

wait__ok

Passed

N/A

0.039081s

wait__save_stderr

Passed

N/A

0.040370s

wait__save_stdout

Passed

N/A

0.038758s

atf/atf-c++/pkg_config_test

0.004083s

build

Skipped

Required program 'pkg-config' not found in the PATH

0.001976s

version

Skipped

Required program 'pkg-config' not found in the PATH

0.002009s

atf/atf-sh/atf-check_test

6.452147s

eflag_empty

Passed

N/A

0.195583s

eflag_file

Passed

N/A

0.291097s

eflag_ignore

Passed

N/A

0.179271s

eflag_inline

Passed

N/A

0.466011s

eflag_match

Passed

N/A

0.304827s

eflag_multiple

Passed

N/A

0.268716s

eflag_negated

Passed

N/A

0.285998s

eflag_save

Passed

N/A

0.153374s

invalid_umask

Passed

N/A

0.147676s

oflag_empty

Passed

N/A

0.191970s

oflag_file

Passed

N/A

0.294598s

oflag_ignore

Passed

N/A

0.182140s

oflag_inline

Passed

N/A

0.494035s

oflag_match

Passed

N/A

0.313250s

oflag_multiple

Passed

N/A

0.278835s

oflag_negated

Passed

N/A

0.277598s

oflag_save

Passed

N/A

0.148994s

sflag_eq_ne

Passed

N/A

0.451022s

sflag_exit

Passed

N/A

0.566851s

sflag_ignore

Passed

N/A

0.226803s

sflag_signal

Passed

N/A

0.383168s

stdin

Passed

N/A

0.138651s

xflag

Passed

N/A

0.187501s

atf/atf-sh/atf_check_test

12.399577s

equal

Passed

N/A

0.632888s

experr_mismatch

Passed

N/A

0.296616s

expout_mismatch

Passed

N/A

0.310128s

flush_stdout_on_timeout

Passed

N/A

10.125612s

info_ok

Passed

N/A

0.434636s

null_stderr

Passed

N/A

0.302955s

null_stdout

Passed

N/A

0.289116s

atf/atf-sh/config_test

0.942141s

get

Passed

N/A

0.444389s

has

Passed

N/A

0.495949s

atf/atf-sh/integration_test

0.564163s

arguments

Passed

N/A

0.253301s

missing_script

Passed

N/A

0.155922s

no_args

Passed

N/A

0.152391s

atf/atf-sh/normalize_test

0.271979s

main

Passed

N/A

0.271032s

atf/atf-sh/tc_test

0.768354s

default_status

Passed

N/A

0.555172s

missing_body

Passed

N/A

0.211790s

atf/atf-sh/tp_test

0.258174s

srcdir

Passed

N/A

0.256599s

atf/test-programs/config_test

1.338662s

vflag

Passed

N/A

1.337849s

atf/test-programs/expect_test

4.632218s

expect_death

Passed

N/A

0.937912s

expect_exit

Passed

N/A

0.873188s

expect_fail

Passed

N/A

0.805196s

expect_pass

Passed

N/A

0.740850s

expect_signal

Passed

N/A

0.912929s

expect_timeout

Passed

N/A

0.357608s

atf/test-programs/meta_data_test

3.605475s

no_descr

Passed

N/A

1.790168s

no_head

Passed

N/A

1.813780s

atf/test-programs/result_test

2.323214s

atf_run_warnings

Passed

N/A

0.286912s

result_exception

Passed

N/A

0.164155s

result_on_stdout

Passed

N/A

0.631297s

result_to_file

Passed

N/A

0.910802s

result_to_file_fail

Passed

N/A

0.322497s

atf/test-programs/srcdir_test

4.153640s

default

Passed

N/A

0.621602s

libtool

Passed

N/A

0.661160s

relative

Passed

N/A

2.066152s

sflag

Passed

N/A

0.793731s

atf/tools/application_test

0.024023s

getopt

Passed

N/A

0.023408s

atf/tools/atffile_test

0.542138s

atffile_1

Passed

N/A

0.028819s

atffile_2

Passed

N/A

0.025844s

atffile_3

Passed

N/A

0.025756s

atffile_4

Passed

N/A

0.024486s

atffile_5

Passed

N/A

0.026701s

atffile_50

Passed

N/A

0.039956s

atffile_51

Passed

N/A

0.039652s

atffile_52

Passed

N/A

0.041894s

atffile_53

Passed

N/A

0.041909s

atffile_54

Passed

N/A

0.041691s

atffile_6

Passed

N/A

0.027267s

atffile_getters

Passed

N/A

0.026027s

read_missing_test_program

Passed

N/A

0.042319s

read_missing_test_suite

Passed

N/A

0.041752s

read_ok_simple

Passed

N/A

0.027599s

read_ok_some_globs

Passed

N/A

0.028705s

atf/tools/auto_array_test

0.232751s

auto_array_access

Passed

N/A

0.026013s

auto_array_assign

Passed

N/A

0.025588s

auto_array_assign_ref

Passed

N/A

0.025722s

auto_array_copy

Passed

N/A

0.026232s

auto_array_copy_ref

Passed

N/A

0.025852s

auto_array_get

Passed

N/A

0.025014s

auto_array_release

Passed

N/A

0.024312s

auto_array_reset

Passed

N/A

0.023599s

auto_array_scope

Passed

N/A

0.025419s

atf/tools/config_file_test

0.426129s

config_1

Passed

N/A

0.025777s

config_2

Passed

N/A

0.024131s

config_3

Passed

N/A

0.024466s

config_4

Passed

N/A

0.023913s

config_50

Passed

N/A

0.037909s

config_51

Passed

N/A

0.037508s

config_52

Passed

N/A

0.038076s

config_53

Passed

N/A

0.038747s

config_54

Passed

N/A

0.039387s

merge_configs_both_empty

Passed

N/A

0.023845s

merge_configs_lower_empty

Passed

N/A

0.023964s

merge_configs_mixed

Passed

N/A

0.024723s

merge_configs_upper_empty

Passed

N/A

0.026373s

read_config_files_none

Passed

N/A

0.026838s

atf/tools/config_test

0.082092s

get

Passed

N/A

0.029198s

get_all

Passed

N/A

0.024797s

has

Passed

N/A

0.025673s

atf/tools/env_test

0.078681s

has_get

Passed

N/A

0.024877s

set

Passed

N/A

0.025812s

unset

Passed

N/A

0.025803s

atf/tools/expand_test

0.161004s

expand_glob_base

Passed

N/A

0.027554s

expand_glob_tps

Passed

N/A

0.026642s

is_glob

Passed

N/A

0.026175s

matches_glob_plain

Passed

N/A

0.024591s

matches_glob_question

Passed

N/A

0.026135s

matches_glob_star

Passed

N/A

0.025411s

atf/tools/fs_test

0.774063s

change_directory

Passed

N/A

0.042415s

cleanup

Passed

N/A

0.044971s

cleanup_eacces_on_root

Passed

N/A

0.027349s

cleanup_eacces_on_subdir

Passed

N/A

0.040094s

directory_file_info

Passed

N/A

0.025626s

directory_names

Passed

N/A

0.026534s

directory_read

Passed

N/A

0.028784s

exists

Passed

N/A

0.041184s

file_info_perms

Passed

N/A

0.027420s

file_info_stat

Passed

N/A

0.027306s

get_current_dir

Passed

N/A

0.026870s

is_executable

Passed

N/A

0.041415s

path_branch_path

Passed

N/A

0.027624s

path_compare_different

Passed

N/A

0.026862s

path_compare_equal

Passed

N/A

0.026109s

path_concat

Passed

N/A

0.026558s

path_is_absolute

Passed

N/A

0.026810s

path_is_root

Passed

N/A

0.026937s

path_leaf_name

Passed

N/A

0.027184s

path_normalize

Passed

N/A

0.026785s

path_op_less

Passed

N/A

0.027358s

path_to_absolute

Passed

N/A

0.026288s

remove

Passed

N/A

0.038954s

temp_dir_raii

Passed

N/A

0.039561s

atf/tools/io_test

4.396216s

file_handle_copy

Passed

N/A

0.024316s

file_handle_ctor

Passed

N/A

0.023646s

file_handle_get

Passed

N/A

0.025610s

file_handle_posix_remap

Passed

N/A

0.025370s

muxer_large_buffer

Passed

N/A

2.790057s

muxer_small_buffer

Passed

N/A

1.316770s

pistream

Passed

N/A

0.026888s

systembuf_long_read

Passed

N/A

0.053988s

systembuf_long_write

Passed

N/A

0.049523s

systembuf_short_read

Passed

N/A

0.026942s

systembuf_short_write

Passed

N/A

0.026473s

atf/tools/parser_test

0.802125s

headers_1

Passed

N/A

0.042374s

headers_10

Passed

N/A

0.041406s

headers_11

Passed

N/A

0.041656s

headers_12

Passed

N/A

0.043313s

headers_2

Passed

N/A

0.040415s

headers_3

Passed

N/A

0.040872s

headers_4

Passed

N/A

0.040241s

headers_5

Passed

N/A

0.038739s

headers_6

Passed

N/A

0.039621s

headers_7

Passed

N/A

0.038504s

headers_8

Passed

N/A

0.038653s

headers_9

Passed

N/A

0.038976s

parse_error_to_string

Passed

N/A

0.024228s

parse_errors_what

Passed

N/A

0.024192s

token_getters

Passed

N/A

0.025854s

tokenizer_delims_nows

Passed

N/A

0.025819s

tokenizer_delims_ws

Passed

N/A

0.024732s

tokenizer_keywords_nows

Passed

N/A

0.040010s

tokenizer_keywords_ws

Passed

N/A

0.024437s

tokenizer_minimal_nows

Passed

N/A

0.031538s

tokenizer_minimal_ws

Passed

N/A

0.031849s

tokenizer_quotes_nows

Passed

N/A

0.024388s

tokenizer_quotes_ws

Passed

N/A

0.024048s

atf/tools/process_test

0.267895s

argv_array_assign

Passed

N/A

0.023670s

argv_array_copy

Passed

N/A

0.023818s

argv_array_exec_argv

Passed

N/A

0.023314s

argv_array_init_carray

Passed

N/A

0.025414s

argv_array_init_col

Passed

N/A

0.024997s

argv_array_init_empty

Passed

N/A

0.025702s

argv_array_init_varargs

Passed

N/A

0.026041s

argv_array_iter

Passed

N/A

0.025144s

exec_failure

Passed

N/A

0.033831s

exec_success

Passed

N/A

0.030398s

atf/tools/reader_test

0.885130s

tps_1

Passed

N/A

0.027124s

tps_2

Passed

N/A

0.024900s

tps_3

Passed

N/A

0.027964s

tps_4

Passed

N/A

0.027768s

tps_5

Passed

N/A

0.027970s

tps_50

Passed

N/A

0.038732s

tps_51

Passed

N/A

0.040227s

tps_52

Passed

N/A

0.039145s

tps_53

Passed

N/A

0.038969s

tps_54

Passed

N/A

0.043077s

tps_55

Passed

N/A

0.045398s

tps_56

Passed

N/A

0.043109s

tps_57

Passed

N/A

0.042099s

tps_58

Passed

N/A

0.042077s

tps_59

Passed

N/A

0.041479s

tps_6

Passed

N/A

0.028310s

tps_60

Passed

N/A

0.042029s

tps_61

Passed

N/A

0.040547s

tps_62

Passed

N/A

0.041842s

tps_63

Passed

N/A

0.041186s

tps_64

Passed

N/A

0.040869s

tps_65

Passed

N/A

0.041597s

tps_66

Passed

N/A

0.041440s

atf/tools/requirements_test

0.938630s

require_arch_many_fail

Passed

N/A

0.027373s

require_arch_many_ok

Passed

N/A

0.027604s

require_arch_one_fail

Passed

N/A

0.025879s

require_arch_one_ok

Passed

N/A

0.026050s

require_config_many_fail

Passed

N/A

0.026342s

require_config_many_ok

Passed

N/A

0.025332s

require_config_one_fail

Passed

N/A

0.026111s

require_config_one_ok

Passed

N/A

0.025862s

require_files_many_fail

Passed

N/A

0.038869s

require_files_many_missing

Passed

N/A

0.039687s

require_files_many_ok

Passed

N/A

0.024647s

require_files_one_fail

Passed

N/A

0.041747s

require_files_one_missing

Passed

N/A

0.038082s

require_files_one_ok

Passed

N/A

0.023670s

require_machine_many_fail

Passed

N/A

0.024135s

require_machine_many_ok

Passed

N/A

0.023797s

require_machine_one_fail

Passed

N/A

0.023936s

require_machine_one_ok

Passed

N/A

0.026048s

require_memory_fail

Passed

N/A

0.038536s

require_memory_not_enough

Passed

N/A

0.024196s

require_memory_ok

Passed

N/A

0.023946s

require_progs_many_fail

Passed

N/A

0.038648s

require_progs_many_missing

Passed

N/A

0.039400s

require_progs_many_ok

Passed

N/A

0.038684s

require_progs_one_fail

Passed

N/A

0.037471s

require_progs_one_missing

Passed

N/A

0.039444s

require_progs_one_ok

Passed

N/A

0.040287s

require_user_fail

Passed

N/A

0.038151s

require_user_root

Passed

N/A

0.024011s

require_user_unprivileged

Passed

N/A

0.024183s

atf/tools/signals_test

0.157890s

reset

Passed

N/A

0.029338s

signal_holder_destructor

Passed

N/A

0.023600s

signal_holder_preserve

Passed

N/A

0.025036s

signal_holder_process

Passed

N/A

0.025286s

signal_programmer_preserve

Passed

N/A

0.025245s

signal_programmer_program

Passed

N/A

0.024248s

atf/tools/test_program_test

1.401892s

atf_tps_writer

Passed

N/A

0.096317s

get_metadata_bad

Passed

N/A

0.056864s

get_metadata_several_tcs

Passed

N/A

0.041229s

get_metadata_zero_tcs

Passed

N/A

0.058602s

parse_test_case_result_expected_death

Passed

N/A

0.041649s

parse_test_case_result_expected_exit

Passed

N/A

0.041350s

parse_test_case_result_expected_failure

Passed

N/A

0.041852s

parse_test_case_result_expected_signal

Passed

N/A

0.041172s

parse_test_case_result_expected_timeout

Passed

N/A

0.042177s

parse_test_case_result_failed

Passed

N/A

0.039642s

parse_test_case_result_passed

Passed

N/A

0.040162s

parse_test_case_result_skipped

Passed

N/A

0.039853s

parse_test_case_result_unknown

Passed

N/A

0.042550s

read_test_case_result_empty_file

Passed

N/A

0.041701s

read_test_case_result_failed

Passed

N/A

0.028687s

read_test_case_result_invalid

Passed

N/A

0.042268s

read_test_case_result_multiline

Passed

N/A

0.028307s

read_test_case_result_no_file

Passed

N/A

0.041712s

read_test_case_result_skipped

Passed

N/A

0.028278s

tp_1

Passed

N/A

0.025970s

tp_2

Passed

N/A

0.028117s

tp_3

Passed

N/A

0.029018s

tp_4

Passed

N/A

0.026784s

tp_50

Passed

N/A

0.042135s

tp_51

Passed

N/A

0.042437s

tp_52

Passed

N/A

0.027070s

tp_53

Passed

N/A

0.039595s

tp_54

Passed

N/A

0.041029s

tp_55

Passed

N/A

0.040012s

tp_56

Passed

N/A

0.039970s

tp_57

Passed

N/A

0.040112s

tp_58

Passed

N/A

0.039755s

tp_59

Passed

N/A

0.040540s

tp_60

Passed

N/A

0.039373s

atf/tools/text_test

0.308853s

duplicate

Passed

N/A

0.024110s

join

Passed

N/A

0.023591s

match

Passed

N/A

0.041902s

split

Passed

N/A

0.026244s

split_delims

Passed

N/A

0.022694s

to_bool

Passed

N/A

0.037337s

to_bytes

Passed

N/A

0.038529s

to_string

Passed

N/A

0.023667s

to_type

Passed

N/A

0.040246s

trim

Passed

N/A

0.023480s

atf/tools/ui_test

0.163928s

paragraphs

Passed

N/A

0.026226s

w_tag_col

Passed

N/A

0.026918s

w_tag_no_repeat

Passed

N/A

0.028827s

w_tag_repeat

Passed

N/A

0.025669s

wo_tag

Passed

N/A

0.025228s

wo_tag_col

Passed

N/A

0.026866s

atf/tools/user_test

0.101121s

euid

Passed

N/A

0.024520s

is_member_of_group

Passed

N/A

0.024398s

is_root

Passed

N/A

0.024360s

is_unprivileged

Passed

N/A

0.025454s

atf/tools/atf-config_test

12.012912s

list_all

Passed

N/A

0.624150s

override_env

Passed

N/A

5.300265s

query_mixture

Passed

N/A

1.608572s

query_multiple

Passed

N/A

0.183286s

query_one

Passed

N/A

1.312926s

query_one_terse

Passed

N/A

2.828604s

query_unknown

Passed

N/A

0.148903s

atf/tools/atf-report_test

6.720960s

default

Passed

N/A

0.595955s

expect

Passed

N/A

2.673225s

oflag

Passed

N/A

1.201998s

output_csv

Passed

N/A

0.577973s

output_ticker

Passed

N/A

0.565739s

output_xml

Passed

N/A

0.574453s

output_xml_space

Passed

N/A

0.365516s

too_many_args

Passed

N/A

0.148275s

atf/tools/atf-run_test

60.662765s

atffile

Passed

N/A

2.626733s

atffile_recursive

Passed

N/A

1.377136s

broken_results

Passed

N/A

0.808919s

broken_tp_list

Passed

N/A

0.697443s

cleanup_curdir

Passed

N/A

0.770418s

cleanup_fail

Passed

N/A

0.758874s

cleanup_mount

Passed

N/A

1.090163s

cleanup_pass

Passed

N/A

0.782168s

cleanup_signal

Passed

N/A

0.104731s

cleanup_skip

Passed

N/A

0.770833s

cleanup_symlink

Passed

N/A

1.133552s

config

Passed

N/A

2.631992s

exit_codes

Passed

N/A

0.797662s

expect

Passed

N/A

2.914480s

fds

Passed

N/A

0.736280s

hooks

Passed

N/A

2.319376s

ignore_deprecated_use_fs

Passed

N/A

0.754959s

isolation_env

Passed

N/A

1.297364s

isolation_home

Passed

N/A

0.737486s

isolation_stdin

Passed

N/A

0.761112s

isolation_umask

Passed

N/A

0.750476s

missing_results

Passed

N/A

0.799816s

mux_streams

Passed

N/A

6.325602s

no_warnings

Passed

N/A

0.744797s

require_arch

Passed

N/A

5.592306s

require_config

Passed

N/A

1.868264s

require_files

Passed

N/A

3.130877s

require_machine

Passed

N/A

5.594248s

require_progs

Passed

N/A

3.083233s

require_user_bad

Passed

N/A

0.709356s

require_user_root

Passed

N/A

0.756419s

require_user_unprivileged

Passed

N/A

0.704372s

signaled

Passed

N/A

0.851869s

timeout

Passed

N/A

1.724347s

timeout_forkexit

Passed

N/A

0.762945s

vflag

Passed

N/A

2.611610s

zero_tcs

Passed

N/A

0.726921s

Failed test cases summary

Test case

Result

Reason

Duration

bin/ps/t_ps

3.050292s

override_heading_some_null

Failed

heading [-o holdcnt -o holdcnt -o holdcnt]: expected [^HOLDCNT HOLDCNT HOLDCNT$], got [ HOLDCNT HOLDCNT HOLDCNT]

0.359592s

kernel/t_ptrace_wait

0.956014s

fpregs2

Failed

/usr/src/tests/kernel/t_ptrace_wait.c:3894: ptrace(PT_SETFPREGS, child, &r, 0) != -1 not met

0.019197s

kernel/t_ptrace_wait3

0.975666s

fpregs2

Failed

/usr/src/tests/kernel/t_ptrace_wait.c:3894: ptrace(PT_SETFPREGS, child, &r, 0) != -1 not met

0.019350s

kernel/t_ptrace_wait4

1.231071s

fork1

Failed

/usr/src/tests/kernel/t_ptrace_wait.h:295: Reported exited process

0.023915s

fpregs2

Failed

/usr/src/tests/kernel/t_ptrace_wait.c:3894: ptrace(PT_SETFPREGS, child, &r, 0) != -1 not met

0.022138s

kernel/t_ptrace_wait6

1.287691s

fork1

Failed

/usr/src/tests/kernel/t_ptrace_wait.h:295: Reported exited process

0.023701s

fpregs2

Failed

/usr/src/tests/kernel/t_ptrace_wait.c:3894: ptrace(PT_SETFPREGS, child, &r, 0) != -1 not met

0.020256s

kernel/t_ptrace_waitid

301.241683s

fork1

Failed

/usr/src/tests/kernel/t_ptrace_wait.c:1152: ptrace(PT_GET_PROCESS_STATE, child2, &state, slen) != -1 not met

0.029708s

fpregs2

Failed

/usr/src/tests/kernel/t_ptrace_wait.c:3894: ptrace(PT_SETFPREGS, child, &r, 0) != -1 not met

0.018456s

vfork1

Failed

Test case timed out after 300 seconds

300.013148s

kernel/t_ptrace_waitpid

1.226875s

fork1

Failed

/usr/src/tests/kernel/t_ptrace_wait.h:295: Reported exited process

0.022961s

fpregs2

Failed

/usr/src/tests/kernel/t_ptrace_wait.c:3894: ptrace(PT_SETFPREGS, child, &r, 0) != -1 not met

0.019971s

lib/libc/sys/t_mprotect

0.076722s

mprotect_pax

Failed

non-executable mapping made executable

0.012375s

lib/libpthread/t_timedmutex

85.123205s

mutex6

Failed

/usr/src/tests/lib/libpthread/t_mutex.c:430: mutex_lock(&mutex6, &ts_lengthy): Invalid argument

21.220583s

sbin/gpt/t_gpt

4.293510s

migrate_disklabel

Failed

atf-check failed; see the output of the test for details

0.269004s

recover_backup

Failed

atf-check failed; see the output of the test for details

0.298516s

Expected failures summary

Test case

Result

Reason

Duration

dev/cgd/t_cgd_aes

0.615447s

cgd_aes_xts_256

Expected failure

aes-xts implementation not committed yet: /usr/src/tests/dev/cgd/t_cgd_aes.c:3522: configure_cgd(cgdfd, dkpath, "aes-xts", "encblkno1", aes_xts_256_key, sizeof(aes_xts_256_key)): Invalid argument

0.079276s

cgd_aes_xts_512

Expected failure

aes-xts implementation not committed yet: /usr/src/tests/dev/cgd/t_cgd_aes.c:3576: configure_cgd(cgdfd, dkpath, "aes-xts", "encblkno1", aes_xts_512_key, sizeof(aes_xts_512_key)): Invalid argument

0.071124s

include/t_errno

0.013046s

errno_constants

Expected failure

PR standards/44921: 2 checks failed as expected; see output for more details

0.012186s

include/t_netdb

0.014260s

netdb_constants

Expected failure

PR standards/44777: 2 checks failed as expected; see output for more details

0.013498s

kernel/t_ptrace_wait4

1.231071s

vfork1

Expected failure

PR kern/51630: /usr/src/tests/kernel/t_ptrace_wait.h:305: WSTOPSIG(status) != expected: Unexpected stop signal received [Child exited] != [Trace/BPT trap]

0.019925s

kernel/t_ptrace_wait6

1.287691s

vfork1

Expected failure

PR kern/51630: /usr/src/tests/kernel/t_ptrace_wait.h:305: WSTOPSIG(status) != expected: Unexpected stop signal received [Child exited] != [Trace/BPT trap]

0.023031s

kernel/t_ptrace_waitpid

1.226875s

vfork1

Expected failure

PR kern/51630: /usr/src/tests/kernel/t_ptrace_wait.h:305: WSTOPSIG(status) != expected: Unexpected stop signal received [Child exited] != [Trace/BPT trap]

0.020983s

lib/libc/c063/t_fexecve

0.018895s

fexecve

Expected failure

fexecve not implemented: /usr/src/tests/lib/libc/c063/t_fexecve.c:85: access("test", F_OK) == 0 not met

0.018306s

lib/libc/regex/t_regex_att

0.153907s

leftassoc

Expected failure

Reason for breakage unknown: /usr/src/tests/lib/libc/regex/t_regex_att.c:377: res != matches ((0,4)(0,2)(2,3)(3,4) != (0,4)(0,1)(1,4)(4,4)): at line 3

0.014114s

lib/libc/sys/t_getrusage

13.164410s

getrusage_utime_back

Expected failure

PR kern/30115: anticipated error did not occur

9.191009s

getrusage_utime_zero

Expected failure

PR kern/30115: anticipated error did not occur

3.946093s

lib/libtre/t_regex_att

0.228897s

rightassoc

Expected failure

Reason for breakage unknown: /usr/src/tests/lib/libtre/../libc/regex/t_regex_att.c:377: res != matches ((0,4)(0,1)(1,4)(4,4) != (0,4)(0,2)(2,3)(3,4)): at line 3

0.020235s

lib/libusbhid/t_usbhid

0.091975s

check_hid_get_data

Expected failure

only the 32-bit opcode works, 8 and 16-bit is broken: 4 checks failed as expected; see output for more details

0.012669s

check_hid_logical_range

Expected failure

only the 32-bit opcode works, 8 and 16-bit is broken: 4 checks failed as expected; see output for more details

0.013583s

check_hid_physical_range

Expected failure

only the 32-bit opcode works, 8 and 16-bit is broken: 4 checks failed as expected; see output for more details

0.013232s

lib/librumphijack/t_tcpip

4.906024s

ssh

Expected failure

PR lib/50174: atf-check failed; see the output of the test for details

1.821998s

net/if/t_compat

0.190401s

OOSIOCGIFBRDADDR

Expected failure

PR kern/51610: rump does not include COMPAT_43: /usr/src/tests/net/if/t_compat.c:72: rump_sys_ioctl(fd, ((((unsigned long)0x80000000|(unsigned long)0x40000000)) | (((sizeof(struct oifreq)) & 0x1fff) << 16) | ((('i')) << 8) | ((18))), &ifreq): Inappropriate ioctl for device

0.188050s

sbin/resize_ffs/t_shrink

39.144221s

shrink_24M_16M_v2_4096

Expected failure

PR bin/44205: atf-check failed; see the output of the test for details

11.167924s

sbin/resize_ffs/t_shrink_swapped

40.660724s

shrink_24M_16M_v2_16384

Expected failure

PR bin/44205: atf-check failed; see the output of the test for details

11.491160s

usr.bin/make/t_make

42.094457s

escape

Expected failure

see PR toolchain/49085: atf-check failed; see the output of the test for details

0.973620s

impsrc

Expected failure

see PR toolchain/49085: atf-check failed; see the output of the test for details

0.884449s

phony_end

Expected failure

see PR toolchain/49085: atf-check failed; see the output of the test for details

0.814279s

posix1

Expected failure

see PR toolchain/49085: atf-check failed; see the output of the test for details

1.298763s

suffixes

Expected failure

see PR toolchain/49085: this uses up all memory and then fails

0.556788s

usr.bin/sed/t_sed

1.334807s

emptybackref

Expected failure

PR bin/28126: atf-check failed; see the output of the test for details

0.189066s

usr.sbin/useradd/t_useradd

0.349917s

longname

Expected failure

PR bin/39546: atf-check failed; see the output of the test for details

0.349293s

fs/ffs/t_mount

0.425603s

48Kimage

Expected failure

PR kern/43573: mount failed: Invalid argument

0.128779s

fs/nfs/t_mountd

0.805381s

mountdhup

Expected failure

PR kern/5844: op failed with EACCES

0.801246s

fs/vfs/t_renamerace

116.206076s

msdosfs_renamerace

Expected failure

PR kern/43626: unmount failed: Device busy

5.313494s

msdosfs_renamerace_dirs

Expected signal

PR kern/43626

0.592232s

udf_renamerace

Expected failure

PR kern/49046: race did not trigger this time

5.332030s

fs/vfs/t_vfsops

28.112506s

lfs_tfhremove

Expected failure

fhopen() for removed file succeeds (PR kern/43745): /usr/src/tests/fs/vfs/t_vfsops.c:152: Expected true value in rump_sys_fhopen(fhp, fhsize, O_RDONLY) == -1

0.413390s

ipf/t_filter_exec

16.275925s

f26

Expected failure

Known to be broken: results differ

0.444869s

f27

Expected failure

Known to be broken: results differ

0.445248s

ipf/t_filter_parse

3.718549s

i17

Expected failure

Known to be broken: atf-check failed; see the output of the test for details

0.171292s

ipf/t_nat_exec

10.698574s

n8_6

Expected failure

See PR kern/47665: results differ

0.216575s

n9_6

Expected failure

See PR kern/47665: results differ

0.220743s

atf/atf-c/macros_test

1.283736s

detect_unused_tests

Expected failure

PR 49187: Build of unused_test.c passed; unused test cases are not properly detected

0.360392s

atf/atf-c++/macros_test

6.885634s

detect_unused_tests

Expected failure

PR 49187: Build of unused_test.cpp passed; unused test cases are not properly detected

2.243367s

Skipped test cases summary

Test case

Result

Reason

Duration

include/t_paths

0.013820s

paths

Skipped

PR port-sparc/45580

0.012989s

kernel/t_ptrace

0.071614s

attach_pid1_securelevel

Skipped

Test must be run with securelevel >= 1

0.012193s

lib/libc/string/t_popcount

0.027915s

popcount_basic

Skipped

config variable "run_popcount" not set to YES/TRUE

0.013234s

popcountll_basic

Skipped

config variable "run_popcount" not set to YES/TRUE

0.012902s

lib/libc/sys/t_kevent

0.103217s

kqueue_desc_passing

Skipped

PR kern/46523

0.015845s

lib/libc/sys/t_mmap

0.191690s

mmap_block

Skipped

The test case causes a panic (PR kern/38889, kern/46592)

0.012566s

lib/libc/sys/t_mprotect

0.076722s

mprotect_exec

Skipped

Execute protection callback check not implemented

0.011821s

lib/librumphijack/t_tcpip

4.906024s

nfs_autoload

Skipped

test currently valid only on i386

0.245186s

sbin/gpt/t_gpt

4.293510s

bootable_2part

Skipped

Required file '/usr/mdec/gptmbr.bin' not found

0.000543s

fs/vfs/t_full

10.399185s

p2k_ffs_fillfs

Skipped

fs does not support explicit block allocation (GOP_ALLOC)

0.395186s

puffs_fillfs

Skipped

fs does not support explicit block allocation (GOP_ALLOC)

0.294767s

rumpfs_fillfs

Skipped

fs does not support explicit block allocation (GOP_ALLOC)

0.273133s

fs/vfs/t_renamerace

116.206076s

rumpfs_renamerace

Skipped

rename not supported by file system

0.268041s

rumpfs_renamerace_dirs

Skipped

rename not supported by file system

0.265487s

sysvbfs_renamerace

Skipped

filesystem has not enough inodes

0.290143s

sysvbfs_renamerace_dirs

Skipped

directories not supported by file system

0.286820s

fs/vfs/t_rmdirrace

125.423283s

sysvbfs_race

Skipped

directories not supported by file system

0.292095s

fs/vfs/t_union

9.571376s

ext2fs_basic

Skipped

fs does not support VOP_WHITEOUT

0.299618s

ext2fs_whiteout

Skipped

fs does not support VOP_WHITEOUT

0.325678s

msdosfs_basic

Skipped

fs does not support VOP_WHITEOUT

0.299496s

msdosfs_whiteout

Skipped

fs does not support VOP_WHITEOUT

0.356669s

nfs_basic

Skipped

fs does not support VOP_WHITEOUT

0.619767s

nfs_whiteout

Skipped

fs does not support VOP_WHITEOUT

0.664516s

p2k_ffs_basic

Skipped

fs does not support VOP_WHITEOUT

0.402156s

p2k_ffs_whiteout

Skipped

fs does not support VOP_WHITEOUT

0.458044s

puffs_basic

Skipped

fs does not support VOP_WHITEOUT

0.295389s

puffs_whiteout

Skipped

fs does not support VOP_WHITEOUT

0.339021s

sysvbfs_basic

Skipped

fs does not support VOP_WHITEOUT

0.290295s

sysvbfs_whiteout

Skipped

fs does not support VOP_WHITEOUT

0.329809s

udf_basic

Skipped

fs does not support VOP_WHITEOUT

0.325571s

udf_whiteout

Skipped

fs does not support VOP_WHITEOUT

0.350757s

v7fs_basic

Skipped

fs does not support VOP_WHITEOUT

0.309055s

v7fs_whiteout

Skipped

fs does not support VOP_WHITEOUT

0.348089s

fs/vfs/t_unpriv

19.376999s

msdosfs_owner

Skipped

owner not supported by file system

0.311141s

nfs_flags

Skipped

file flags not supported by file system

0.635694s

puffs_flags

Skipped

file flags not supported by file system

0.310955s

sysvbfs_dirperms

Skipped

directories not supported by file system

0.314493s

sysvbfs_flags

Skipped

file flags not supported by file system

0.299597s

udf_flags

Skipped

file flags not supported by file system

0.328452s

fs/vfs/t_vfsops

28.112506s

rumpfs_tfhinval

Skipped

file handles not supported

0.270681s

rumpfs_tfhremove

Skipped

file handles not supported

0.297425s

rumpfs_tfilehandle

Skipped

file handles not supported

0.298420s

sysvbfs_tfhinval

Skipped

file handles not supported

0.309457s

sysvbfs_tfhremove

Skipped

file handles not supported

0.316246s

sysvbfs_tfilehandle

Skipped

file handles not supported

0.304152s

udf_tfhinval

Skipped

file handles not supported

0.307388s

udf_tfhremove

Skipped

file handles not supported

0.311346s

udf_tfilehandle

Skipped

file handles not supported

0.307895s

v7fs_tfhinval

Skipped

file handles not supported

0.307074s

v7fs_tfhremove

Skipped

file handles not supported

0.311862s

v7fs_tfilehandle

Skipped

file handles not supported

0.309952s

fs/vfs/t_vnops

162.475100s

msdosfs_lstat_symlink

Skipped

symlinks not supported by file system

0.343627s

msdosfs_symlink_long

Skipped

symlinks not supported by file system

0.317056s

msdosfs_symlink_root

Skipped

symlinks not supported by file system

0.326033s

msdosfs_symlink_zerolen

Skipped

symlinks not supported by file system

0.339246s

rumpfs_rename_dir

Skipped

rename not supported by file system

0.317368s

rumpfs_rename_dotdot

Skipped

rename not supported by file system

0.321985s

rumpfs_rename_nametoolong

Skipped

rename not supported by file system

0.324199s

rumpfs_rename_reg_nodir

Skipped

rename not supported by file system

0.296187s

sysvbfs_dir_notempty

Skipped

directories not supported by file system

0.330571s

sysvbfs_dir_rmdirdotdot

Skipped

directories not supported by file system

0.336556s

sysvbfs_dir_simple

Skipped

directories not supported by file system

0.328729s

sysvbfs_lookup_complex

Skipped

directories not supported by file system

0.317865s

sysvbfs_lstat_symlink

Skipped

symlinks not supported by file system

0.333690s

sysvbfs_rename_dir

Skipped

directories not supported by file system

0.316444s

sysvbfs_rename_dotdot

Skipped

directories not supported by file system

0.326678s

sysvbfs_symlink_long

Skipped

symlinks not supported by file system

0.322078s

sysvbfs_symlink_root

Skipped

symlinks not supported by file system

0.322315s

sysvbfs_symlink_zerolen

Skipped

symlinks not supported by file system

0.310657s

fs/cd9660/t_high_ino_big_file

0.312003s

pr_kern_48787

Skipped

not enough free disk space, have 1048344 Kbytes, need ~ 4500000 Kbytes

0.310865s

rump/rumpkern/t_kern

0.536932s

lockme_DOUBLEINIT

Skipped

test requires LOCKDEBUG kernel

0.020821s

lockme_MEMFREE

Skipped

test requires LOCKDEBUG kernel

0.019936s

lockme_RWRX

Skipped

test requires LOCKDEBUG kernel

0.021441s

rump/modautoload/t_modautoload

0.020789s

modautoload

Skipped

host kernel modules not supported

0.019922s

crypto/libcrypto/t_ciphers

4.259876s

rc5

Skipped

RC5 support not available; system built with MKCRYPTO_RC5=no

0.102803s

crypto/opencrypto/t_opencrypto

5.413675s

arc4

Skipped

ARC4 not implemented by swcrypto

0.277922s

share/examples/t_asm

0.372267s

hello

Skipped

Example program not implemented on this platform

0.371476s

atf/atf-c/pkg_config_test

0.004828s

build

Skipped

Required program 'pkg-config' not found in the PATH

0.002663s

version

Skipped

Required program 'pkg-config' not found in the PATH

0.002060s

atf/atf-c++/pkg_config_test

0.004083s

build

Skipped

Required program 'pkg-config' not found in the PATH

0.001976s

version

Skipped

Required program 'pkg-config' not found in the PATH

0.002009s

Execution details

Environment variables

Test case: bin/ps/t_ps/override_heading_some_null

Duration: 0.359592 seconds

Termination reason

FAILED: heading [-o holdcnt -o holdcnt -o holdcnt]: expected [^HOLDCNT HOLDCNT HOLDCNT$], got [ HOLDCNT HOLDCNT HOLDCNT]

Test case: dev/cgd/t_cgd_aes/cgd_aes_xts_256

Duration: 0.079276 seconds

Termination reason

XFAIL: aes-xts implementation not committed yet: /usr/src/tests/dev/cgd/t_cgd_aes.c:3522: configure_cgd(cgdfd, dkpath, "aes-xts", "encblkno1", aes_xts_256_key, sizeof(aes_xts_256_key)): Invalid argument

Test case: dev/cgd/t_cgd_aes/cgd_aes_xts_512

Duration: 0.071124 seconds

Termination reason

XFAIL: aes-xts implementation not committed yet: /usr/src/tests/dev/cgd/t_cgd_aes.c:3576: configure_cgd(cgdfd, dkpath, "aes-xts", "encblkno1", aes_xts_512_key, sizeof(aes_xts_512_key)): Invalid argument

Test case: include/t_errno/errno_constants

Duration: 0.012186 seconds

Termination reason

XFAIL: PR standards/44921: 2 checks failed as expected; see output for more details

Standard error stream

*** Expected check failure: PR standards/44921: ENOTRECOVERABLE not defined
*** Expected check failure: PR standards/44921: EOWNERDEAD not defined

Test case: include/t_netdb/netdb_constants

Duration: 0.013498 seconds

Termination reason

XFAIL: PR standards/44777: 2 checks failed as expected; see output for more details

Standard error stream

*** Expected check failure: PR standards/44777: AI_V4MAPPED not defined
*** Expected check failure: PR standards/44777: AI_ALL not defined

Test case: include/t_paths/paths

Duration: 0.012989 seconds

Termination reason

SKIPPED: PR port-sparc/45580

Test case: kernel/t_ptrace/attach_pid1_securelevel

Duration: 0.012193 seconds

Termination reason

SKIPPED: Test must be run with securelevel >= 1

Test case: kernel/t_ptrace_wait/fpregs2

Duration: 0.019197 seconds

Termination reason

FAILED: /usr/src/tests/kernel/t_ptrace_wait.c:3894: ptrace(PT_SETFPREGS, child, &r, 0) != -1 not met

Standard output stream

Before forking process PID=10627
Parent process PID=10627, child's PID=10717
Before calling wait() for the child
Before calling PT_TRACE_ME from child 10717
Before raising Stopped (signal) from child
Call GETFPREGS for the child process
Call SETFPREGS for the child (without changed regs)

Test case: kernel/t_ptrace_wait3/fpregs2

Duration: 0.019350 seconds

Termination reason

FAILED: /usr/src/tests/kernel/t_ptrace_wait.c:3894: ptrace(PT_SETFPREGS, child, &r, 0) != -1 not met

Standard output stream

Before forking process PID=14296
Parent process PID=14296, child's PID=14295
Before calling wait3() for the child
Before calling PT_TRACE_ME from child 14295
Before raising Stopped (signal) from child
Call GETFPREGS for the child process
Call SETFPREGS for the child (without changed regs)

Test case: kernel/t_ptrace_wait4/fork1

Duration: 0.023915 seconds

Termination reason

FAILED: /usr/src/tests/kernel/t_ptrace_wait.h:295: Reported exited process

Standard output stream

Before forking process PID=23282
Parent process PID=23282, child's PID=10462
Before calling wait4() for the child
Before calling PT_TRACE_ME from child 10462
Before raising Stopped (signal) from child
Enable PTRACE_FORK in EVENT_MASK for the child 10462
Before resuming the child process where it left off and without signal to be sent
Before calling wait4() for the child 10462
Reported PTRACE_FORK event with forkee 10972
Before calling wait4() for the forkee 10972 of the child 10462

Test case: kernel/t_ptrace_wait4/fpregs2

Duration: 0.022138 seconds

Termination reason

FAILED: /usr/src/tests/kernel/t_ptrace_wait.c:3894: ptrace(PT_SETFPREGS, child, &r, 0) != -1 not met

Standard output stream

Before forking process PID=11037
Parent process PID=11037, child's PID=10893
Before calling wait4() for the child
Before calling PT_TRACE_ME from child 10893
Before raising Stopped (signal) from child
Call GETFPREGS for the child process
Call SETFPREGS for the child (without changed regs)

Test case: kernel/t_ptrace_wait4/vfork1

Duration: 0.019925 seconds

Termination reason

XFAIL: PR kern/51630: /usr/src/tests/kernel/t_ptrace_wait.h:305: WSTOPSIG(status) != expected: Unexpected stop signal received [Child exited] != [Trace/BPT trap]

Standard output stream

Before forking process PID=10656
Parent process PID=10656, child's PID=10970
Before calling wait4() for the child
Before calling PT_TRACE_ME from child 10970
Before raising Stopped (signal) from child
Enable PTRACE_VFORK in EVENT_MASK for the child 10970
Before resuming the child process where it left off and without signal to be sent
Before calling wait4() for the child 10970

Test case: kernel/t_ptrace_wait6/fork1

Duration: 0.023701 seconds

Termination reason

FAILED: /usr/src/tests/kernel/t_ptrace_wait.h:295: Reported exited process

Standard output stream

Before forking process PID=13971
Parent process PID=13971, child's PID=11556
Before calling wait6() for the child
Before calling PT_TRACE_ME from child 11556
Before raising Stopped (signal) from child
Enable PTRACE_FORK in EVENT_MASK for the child 11556
Before resuming the child process where it left off and without signal to be sent
Before calling wait6() for the child 11556
Reported PTRACE_FORK event with forkee 7647
Before calling wait6() for the forkee 7647 of the child 11556

Test case: kernel/t_ptrace_wait6/fpregs2

Duration: 0.020256 seconds

Termination reason

FAILED: /usr/src/tests/kernel/t_ptrace_wait.c:3894: ptrace(PT_SETFPREGS, child, &r, 0) != -1 not met

Standard output stream

Before forking process PID=10654
Parent process PID=10654, child's PID=11164
Before calling wait6() for the child
Before calling PT_TRACE_ME from child 11164
Before raising Stopped (signal) from child
Call GETFPREGS for the child process
Call SETFPREGS for the child (without changed regs)

Test case: kernel/t_ptrace_wait6/vfork1

Duration: 0.023031 seconds

Termination reason

XFAIL: PR kern/51630: /usr/src/tests/kernel/t_ptrace_wait.h:305: WSTOPSIG(status) != expected: Unexpected stop signal received [Child exited] != [Trace/BPT trap]

Standard output stream

Before forking process PID=12968
Parent process PID=12968, child's PID=13943
Before calling wait6() for the child
Before calling PT_TRACE_ME from child 13943
Before raising Stopped (signal) from child
Enable PTRACE_VFORK in EVENT_MASK for the child 13943
Before resuming the child process where it left off and without signal to be sent
Before calling wait6() for the child 13943

Test case: kernel/t_ptrace_waitid/fork1

Duration: 0.029708 seconds

Termination reason

FAILED: /usr/src/tests/kernel/t_ptrace_wait.c:1152: ptrace(PT_GET_PROCESS_STATE, child2, &state, slen) != -1 not met

Standard output stream

Before forking process PID=14807
Parent process PID=14807, child's PID=10964
Before calling PT_TRACE_ME from child 10964
Before calling waitid() for the child
Before raising Stopped (signal) from child
Enable PTRACE_FORK in EVENT_MASK for the child 10964
Before resuming the child process where it left off and without signal to be sent
Before calling waitid() for the child 10964
Reported PTRACE_FORK event with forkee 25164
Before calling waitid() for the forkee 25164 of the child 10964

Test case: kernel/t_ptrace_waitid/fpregs2

Duration: 0.018456 seconds

Termination reason

FAILED: /usr/src/tests/kernel/t_ptrace_wait.c:3894: ptrace(PT_SETFPREGS, child, &r, 0) != -1 not met

Standard output stream

Before forking process PID=11748
Parent process PID=11748, child's PID=7839
Before calling waitid() for the child
Before calling PT_TRACE_ME from child 7839
Before raising Stopped (signal) from child
Call GETFPREGS for the child process
Call SETFPREGS for the child (without changed regs)

Test case: kernel/t_ptrace_waitid/vfork1

Duration: 300.013148 seconds

Termination reason

FAILED: Test case timed out after 300 seconds

Standard output stream

Before forking process PID=10946
Parent process PID=10946, child's PID=15463
Before calling waitid() for the child
Before calling PT_TRACE_ME from child 15463
Before raising Stopped (signal) from child
Enable PTRACE_VFORK in EVENT_MASK for the child 15463
Before resuming the child process where it left off and without signal to be sent
Before calling waitid() for the child 15463
Reported PTRACE_VFORK event with forkee 0
Before calling waitid() for the forkee 0 of the child 15463

Test case: kernel/t_ptrace_waitpid/fork1

Duration: 0.022961 seconds

Termination reason

FAILED: /usr/src/tests/kernel/t_ptrace_wait.h:295: Reported exited process

Standard output stream

Before forking process PID=12905
Parent process PID=12905, child's PID=13329
Before calling waitpid() for the child
Before calling PT_TRACE_ME from child 13329
Before raising Stopped (signal) from child
Enable PTRACE_FORK in EVENT_MASK for the child 13329
Before resuming the child process where it left off and without signal to be sent
Before calling waitpid() for the child 13329
Reported PTRACE_FORK event with forkee 11406
Before calling waitpid() for the forkee 11406 of the child 13329

Test case: kernel/t_ptrace_waitpid/fpregs2

Duration: 0.019971 seconds

Termination reason

FAILED: /usr/src/tests/kernel/t_ptrace_wait.c:3894: ptrace(PT_SETFPREGS, child, &r, 0) != -1 not met

Standard output stream

Before forking process PID=11156
Parent process